ALT Linux Girar Builder robot reports
 help / color / mirror / Atom feed
* [#305235] p10 FAILED srpm=java-17-openjdk-17.0.4.0.8-alt1.src.rpm
@ 2022-08-13 19:31 Girar awaiter (cas)
  2022-08-18 15:30 ` [#305235] p10 EPERM (try 2) srpm=java-17-openjdk-17.0.4.0.8-alt0.p10.1.src.rpm Girar awaiter (cas)
                   ` (6 more replies)
  0 siblings, 7 replies; 8+ messages in thread
From: Girar awaiter (cas) @ 2022-08-13 19:31 UTC (permalink / raw)
  To: Andrey Cherepanov
  Cc: girar-builder-p10, sisyphus-incominger, girar-builder-p10

https://git.altlinux.org/tasks/305235/logs/events.1.1.log

subtask  name             aarch64  armh    i586  ppc64le  x86_64
   #100  java-17-openjdk    24:22     -  failed  2:07:31   13:43

2022-Aug-13 17:24:00 :: task #305235 for p10 started by cas:
2022-Aug-13 17:24:00 :: message: Bootstrap_is_finished_in_305236
#100 build java-17-openjdk-17.0.4.0.8-alt1.src.rpm
2022-Aug-13 17:24:02 :: [x86_64] #100 java-17-openjdk-17.0.4.0.8-alt1.src.rpm: build start
2022-Aug-13 17:24:02 :: [aarch64] #100 java-17-openjdk-17.0.4.0.8-alt1.src.rpm: build start
2022-Aug-13 17:24:02 :: [armh] #100 java-17-openjdk-17.0.4.0.8-alt1.src.rpm: build start
2022-Aug-13 17:24:02 :: [i586] #100 java-17-openjdk-17.0.4.0.8-alt1.src.rpm: build start
2022-Aug-13 17:24:02 :: [ppc64le] #100 java-17-openjdk-17.0.4.0.8-alt1.src.rpm: build start
2022-Aug-13 17:24:35 :: [armh] #100 java-17-openjdk-17.0.4.0.8-alt1.src.rpm: build SKIPPED
[i586] either the file containing the function 'JVM_handle_linux_signal' or the file containing the function 'gHotSpotVMLongConstantEntryValueOffset' is not compiled with -fpic/-fPIC
[i586] verify-elf: ERROR: ./usr/lib/jvm/java-17-openjdk-17.0.4.0.8-alt1.i586/lib/server/libjvm.so: TEXTREL entry found: 0x00000000
[i586] verify-elf: WARNING: ./usr/lib/jvm/java-17-openjdk-17.0.4.0.8-alt1.i586/lib/server/libjvm.so: uses non-LFS functions: __fxstat __lxstat __xstat fcntl fopen ftruncate getrlimit lseek mkstemp mmap open posix_fallocate pread readdir setrlimit
2022-Aug-13 17:35:42 :: [i586] java-17-openjdk-17.0.4.0.8-alt1.src.rpm: remote: build failed
2022-Aug-13 17:35:42 :: [i586] #100 java-17-openjdk-17.0.4.0.8-alt1.src.rpm: build FAILED
2022-Aug-13 17:35:42 :: [i586] requesting cancellation of task processing
2022-Aug-13 17:37:45 :: [x86_64] #100 java-17-openjdk-17.0.4.0.8-alt1.src.rpm: build OK
2022-Aug-13 17:48:24 :: [aarch64] #100 java-17-openjdk-17.0.4.0.8-alt1.src.rpm: build OK
2022-Aug-13 19:31:33 :: [ppc64le] #100 java-17-openjdk-17.0.4.0.8-alt1.src.rpm: build OK
2022-Aug-13 17:35:42 :: [i586] build FAILED
2022-Aug-13 19:31:33 :: task #305235 for p10 FAILED


^ permalink raw reply	[flat|nested] 8+ messages in thread

* [#305235] p10 EPERM (try 2) srpm=java-17-openjdk-17.0.4.0.8-alt0.p10.1.src.rpm
  2022-08-13 19:31 [#305235] p10 FAILED srpm=java-17-openjdk-17.0.4.0.8-alt1.src.rpm Girar awaiter (cas)
@ 2022-08-18 15:30 ` Girar awaiter (cas)
  2022-09-21 18:30 ` [#305235] p10 FAILED (try 3) srpm=java-17-openjdk-17.0.4.0.8-alt0.p10.1.src.rpm Girar awaiter (cas)
                   ` (5 subsequent siblings)
  6 siblings, 0 replies; 8+ messages in thread
From: Girar awaiter (cas) @ 2022-08-18 15:30 UTC (permalink / raw)
  To: Andrey Cherepanov
  Cc: girar-builder-p10, sisyphus-incominger, girar-builder-p10

https://git.altlinux.org/tasks/305235/logs/events.2.1.log

subtask  name             aarch64  armh   i586  ppc64le  x86_64
   #200  java-17-openjdk    24:30     -  14:36  2:08:38   13:40



^ permalink raw reply	[flat|nested] 8+ messages in thread

* [#305235] p10 FAILED (try 3) srpm=java-17-openjdk-17.0.4.0.8-alt0.p10.1.src.rpm ...
  2022-08-13 19:31 [#305235] p10 FAILED srpm=java-17-openjdk-17.0.4.0.8-alt1.src.rpm Girar awaiter (cas)
  2022-08-18 15:30 ` [#305235] p10 EPERM (try 2) srpm=java-17-openjdk-17.0.4.0.8-alt0.p10.1.src.rpm Girar awaiter (cas)
@ 2022-09-21 18:30 ` Girar awaiter (cas)
  2022-09-22  6:56 ` [#305235] p10 TESTED (try 4) srpm=java-17-openjdk-17.0.4.0.8-alt0.p10.1.src.rpm Girar awaiter (cas)
                   ` (4 subsequent siblings)
  6 siblings, 0 replies; 8+ messages in thread
From: Girar awaiter (cas) @ 2022-09-21 18:30 UTC (permalink / raw)
  To: Andrey Cherepanov
  Cc: girar-builder-p10, sisyphus-incominger, girar-builder-p10

https://git.altlinux.org/tasks/305235/logs/events.3.1.log

subtask  name              aarch64  armh   i586  ppc64le  x86_64
   #200  java-17-openjdk     31:03     -  15:10  2:09:39   14:01
   #300  java-atk-wrapper        ?  2:02     50        ?      48
   #400  jtoaster                ?  1:19     33        ?      30
   #500  mckoi                   ?  2:21      ?        ?      46
   #600  protobuf                ?     -      ?        ?  failed

2022-Sep-21 16:21:03 :: task #305235 for p10 resumed by cas:
2022-Sep-21 16:21:03 :: message: Bootstrap_is_finished_in_305236
#100 removed
#200 build java-17-openjdk-17.0.4.0.8-alt0.p10.1.src.rpm
#300 build java-atk-wrapper-0.38.0-alt2_6jpp11.src.rpm from sisyphus
#400 build jtoaster-1.0.5-alt4_12jpp11.src.rpm from sisyphus
#500 build mckoi-1.0.4-alt4_17jpp11.src.rpm from sisyphus
#600 build 3.16.0-alt6.2 from /gears/p/protobuf.git fetched at 2022-Sep-21 16:20:52 from sisyphus
2022-Sep-21 16:21:03 :: created build repo
2022-Sep-21 16:21:03 :: [aarch64] #200 java-17-openjdk-17.0.4.0.8-alt0.p10.1.src.rpm: build start
2022-Sep-21 16:21:03 :: [x86_64] #200 java-17-openjdk-17.0.4.0.8-alt0.p10.1.src.rpm: build start
2022-Sep-21 16:21:03 :: [ppc64le] #200 java-17-openjdk-17.0.4.0.8-alt0.p10.1.src.rpm: build start
2022-Sep-21 16:21:03 :: [armh] #200 java-17-openjdk-17.0.4.0.8-alt0.p10.1.src.rpm: build start
2022-Sep-21 16:21:03 :: [i586] #200 java-17-openjdk-17.0.4.0.8-alt0.p10.1.src.rpm: build start
2022-Sep-21 16:21:43 :: [armh] #200 java-17-openjdk-17.0.4.0.8-alt0.p10.1.src.rpm: build SKIPPED
2022-Sep-21 16:21:43 :: [armh] #300 java-atk-wrapper-0.38.0-alt2_6jpp11.src.rpm: build start
2022-Sep-21 16:23:45 :: [armh] #300 java-atk-wrapper-0.38.0-alt2_6jpp11.src.rpm: build OK
2022-Sep-21 16:23:45 :: [armh] #400 jtoaster-1.0.5-alt4_12jpp11.src.rpm: build start
2022-Sep-21 16:25:04 :: [armh] #400 jtoaster-1.0.5-alt4_12jpp11.src.rpm: build OK
2022-Sep-21 16:25:04 :: [armh] #500 mckoi-1.0.4-alt4_17jpp11.src.rpm: build start
2022-Sep-21 16:27:25 :: [armh] #500 mckoi-1.0.4-alt4_17jpp11.src.rpm: build OK
2022-Sep-21 16:27:25 :: [armh] #600 protobuf.git 3.16.0-alt6.2: build start
[armh] <13>Sep 21 16:27:56 rpmi: libruby-2.7.4-alt2.2.1 p10+291491.1000.21.1 1640428713 installed
[armh] <13>Sep 21 16:27:56 rpmi: libgdbm-1.8.3-alt10 sisyphus+278100.1600.1.1 1626060299 installed
[armh] <13>Sep 21 16:27:56 rpmi: libexpat-2.4.3-alt1 p10+293695.100.1.1 1642509128 installed
[armh] <13>Sep 21 16:27:56 rpmi: libidn2-2.3.2-alt1 p10+281239.100.3.1 1627673304 installed
[armh] <13>Sep 21 16:27:56 rpmi: libyaml2-0.2.5-alt1 sisyphus+278391.100.1.1 1626094976 installed
[armh] <13>Sep 21 16:27:56 rpmi: libyaml-devel-0.2.5-alt1 sisyphus+278391.100.1.1 1626094976 installed
[armh] <13>Sep 21 16:27:56 rpmi: libgdbm-devel-1.8.3-alt10 sisyphus+278100.1600.1.1 1626060299 installed
[armh] <13>Sep 21 16:27:56 rpmi: rpm-macros-ruby-1:1.0.0-alt13 sisyphus+263592.20.7.1 1608654963 installed
[armh] <13>Sep 21 16:27:56 rpmi: rpm-macros-java-1:5.3.0-alt1_15jpp11 sisyphus+278038.500.1.3 1625987751 installed
[armh] <13>Sep 21 16:27:56 rpmi: libxslt-1.1.34-alt3 sisyphus+275636.100.1.1 1624616875 installed
[armh] <13>Sep 21 16:27:59 rpmi: valgrind-3.17.0-alt2 sisyphus+279814.100.1.1 1626737457 installed
[armh] <13>Sep 21 16:27:59 rpmi: valgrind-devel-3.17.0-alt2 sisyphus+279814.100.1.1 1626737457 installed
[armh] <13>Sep 21 16:27:59 rpmi: zlib-devel-1.2.12-alt3 p10+305356.100.3.1 1661238306 installed
[armh] <13>Sep 21 16:27:59 rpmi: libreadline-devel-7.0.3-alt3 sisyphus+278099.3700.1.1 1626032931 installed
[armh] <13>Sep 21 16:28:00 rpmi: groff-base-1.22.3-alt2 sisyphus+275306.100.2.1 1624538423 installed
[armh] <13>Sep 21 16:28:00 rpmi: libncurses-6.2.20210123-alt1 sisyphus+279621.1300.1.1 1626633151 installed
[armh] <13>Sep 21 16:28:00 rpmi: libtinfo-devel-6.2.20210123-alt1 sisyphus+279621.1300.1.1 1626633151 installed
[armh] <13>Sep 21 16:28:00 rpmi: libncurses-devel-6.2.20210123-alt1 sisyphus+279621.1300.1.1 1626633151 installed
[armh] <13>Sep 21 16:28:00 rpmi: libncursesw-devel-6.2.20210123-alt1 sisyphus+279621.1300.1.1 1626633151 installed
[armh] <13>Sep 21 16:28:00 rpmi: libffi-devel-1:3.3-alt1 sisyphus+278158.300.1.1 1626050519 installed
[armh] <13>Sep 21 16:28:00 rpmi: libdb4.7-devel-4.7.25-alt11 sisyphus+279812.100.2.1 1626735008 installed
[armh] <13>Sep 21 16:28:00 rpmi: javapackages-filesystem-1:5.3.0-alt1_15jpp11 sisyphus+278038.500.1.3 1625987751 installed
[armh] <13>Sep 21 16:28:00 rpmi: javapackages-tools-1:5.3.0-alt1_15jpp11 sisyphus+278038.500.1.3 1625987751 installed
[armh] <13>Sep 21 16:28:00 rpmi: publicsuffix-list-dafsa-20220703-alt1 p10+303338.100.1.1 1657290596 installed
[armh] <13>Sep 21 16:28:00 rpmi: libpsl-0.21.1-alt2 sisyphus+279461.100.1.1 1626547594 installed
[armh] <13>Sep 21 16:28:00 rpmi: libnghttp2-1.41.0-alt1 sisyphus+275115.100.1.1 1624405608 installed
[armh] <13>Sep 21 16:28:00 rpmi: openldap-common-2.4.59-alt1 p10+282974.100.1.1 1629142498 installed
[armh] <13>Sep 21 16:28:00 rpmi: libbrotlicommon-1.0.9-alt2 sisyphus+278430.100.1.2 1626213236 installed
[armh] <13>Sep 21 16:28:00 rpmi: libbrotlidec-1.0.9-alt2 sisyphus+278430.100.1.2 1626213236 installed
[armh] <13>Sep 21 16:28:00 rpmi: libxxhash-0.8.0-alt2 sisyphus+277476.100.2.1 1625621332 installed
[armh] <13>Sep 21 16:28:00 rpmi: liblz4-1:1.9.3-alt1 sisyphus+278100.4000.1.1 1626061905 installed
[armh] <13>Sep 21 16:28:00 rpmi: libverto-0.3.2-alt1_1 sisyphus+279289.100.1.3 1626493894 installed
[armh] <13>Sep 21 16:28:00 rpmi: liblmdb-0.9.23-alt1 sisyphus+275369.100.1.2 1624493880 installed
[armh] <13>Sep 21 16:28:00 rpmi: libkeyutils-1.6.3-alt1 sisyphus+266061.100.1.1 1612919580 installed
[armh] <13>Sep 21 16:28:00 rpmi: libcom_err-1.46.2.0.16.f114-alt1 sisyphus+278100.1000.1.1 1626057017 installed
[armh] <13>Sep 21 16:28:00 rpmi: libedit3-3.1.20191231-alt1 sisyphus+278505.100.1.1 1626106450 installed
[armh] <13>Sep 21 16:28:00 rpmi: less-530-alt1 sisyphus+278268.100.1.1 1626082725 installed
[armh] <13>Sep 21 16:28:00 rpmi: doxygen-1:1.9.1-alt1 p10+283520.500.2.1 1629898208 installed
[armh] <13>Sep 21 16:28:00 rpmi: diffstat-1.64-alt1 sisyphus+278100.700.1.1 1626056809 installed
[armh] <13>Sep 21 16:28:00 rpmi: chrpath-0.16-alt1 sisyphus+278100.500.1.1 1626056725 installed
[armh] <13>Sep 21 16:28:00 rpmi: libp11-kit-0.24.1-alt1 p10+305061.100.3.1 1660573569 installed
[armh] <13>Sep 21 16:28:00 rpmi: libtasn1-4.17.0-alt1 sisyphus+276722.100.1.1 1625211325 installed
[armh] <13>Sep 21 16:28:00 rpmi: rpm-macros-alternatives-0.5.1-alt1 sisyphus+278157.100.2.1 1626055790 installed
[armh] <13>Sep 21 16:28:00 rpmi: alternatives-0.5.1-alt1 sisyphus+278157.100.2.1 1626055790 installed
[armh] <13>Sep 21 16:28:00 rpmi: ca-certificates-2021.10.06-alt1 p10+286784.100.1.1 1633940301 installed
[armh] <13>Sep 21 16:28:00 rpmi: ca-trust-0.1.2-alt1 sisyphus+233348.100.1.1 1561653823 installed
[armh] <13>Sep 21 16:28:00 rpmi: p11-kit-trust-0.24.1-alt1 p10+305061.100.3.1 1660573569 installed
[armh] <13>Sep 21 16:28:00 rpmi: libcrypto1.1-1.1.1q-alt1 p10+303207.100.1.1 1657031111 installed
[armh] <13>Sep 21 16:28:00 rpmi: libssl1.1-1.1.1q-alt1 p10+303207.100.1.1 1657031111 installed
[armh] <13>Sep 21 16:28:00 rpmi: python3-3.9.6-alt1 sisyphus+276295.100.1.1 1624965175 installed
[armh] <13>Sep 21 16:28:02 rpmi: python3-base-3.9.6-alt1 sisyphus+276295.100.1.1 1624965175 installed
[armh] <13>Sep 21 16:28:02 rpmi: libpython3-3.9.6-alt1 sisyphus+276295.100.1.1 1624965175 installed
[armh] <13>Sep 21 16:28:02 rpmi: gem-minitest-5.14.1-alt0.1 sisyphus+249637.100.1.1 1586421683 installed
[armh] <13>Sep 21 16:28:02 rpmi: ruby-net-telnet-0.2.0-alt1 sisyphus+219345.2700.8.1 1547631566 installed
[armh] <13>Sep 21 16:28:02 rpmi: gem-rake-13.0.1-alt1 sisyphus+248971.320.47.1 1586259947 installed
[armh] <13>Sep 21 16:28:02 rpmi: ruby-xmlrpc-0.3.0-alt1 sisyphus+219345.3300.8.1 1547631818 installed
[armh] <13>Sep 21 16:28:02 rpmi: gem-2:3.1.6-alt1.1 p10+291491.1000.21.1 1640428300 installed
[armh] <13>Sep 21 16:28:02 rpmi: ri-6.1.1-alt3 sisyphus+220149.7500.44.1 1552167568 installed
[armh] <13>Sep 21 16:28:02 rpmi: rdoc-6.1.1-alt3 sisyphus+220149.7500.44.1 1552167568 installed
[armh] <13>Sep 21 16:28:02 rpmi: ruby-rdoc-6.1.1-alt3 sisyphus+220149.7500.44.1 1552167568 installed
[armh] <13>Sep 21 16:28:02 rpmi: rake-13.0.1-alt1 sisyphus+248971.320.47.1 1586259947 installed
[armh] <13>Sep 21 16:28:02 rpmi: erb-2.7.4-alt2.2.1 p10+291491.1000.21.1 1640428300 installed
[armh] <13>Sep 21 16:28:02 rpmi: irb-2.7.4-alt2.2.1 p10+291491.1000.21.1 1640428300 installed
[armh] <13>Sep 21 16:28:02 rpmi: gem-test-unit-3.3.5-alt1 sisyphus+248971.620.47.1 1586260035 installed
[armh] <13>Sep 21 16:28:02 rpmi: gem-power-assert-1.1.7-alt1 sisyphus+248971.220.47.1 1586259894 installed
[armh] <13>Sep 21 16:28:02 rpmi: bundle-2.1.4-alt1 sisyphus+247301.1100.3.2 1583840910 installed
[armh] <13>Sep 21 16:28:04 rpmi: gem-bundler-2.1.4-alt1 sisyphus+247301.1100.3.2 1583840910 installed
[armh] <13>Sep 21 16:28:04 rpmi: ruby-2.7.4-alt2.2.1 p10+291491.1000.21.1 1640428713 installed
[armh] <13>Sep 21 16:28:04 rpmi: ruby-stdlibs-2.7.4-alt2.2.1 p10+291491.1000.21.1 1640428713 installed
[armh] <13>Sep 21 16:28:04 rpmi: python3-module-six-1.15.0-alt2 sisyphus+270533.5100.6.1 1619685463 installed
[armh] <86>Sep 21 16:28:04 groupadd[2010670]: group added to /etc/group: name=_keytab, GID=499
[armh] <86>Sep 21 16:28:04 groupadd[2010670]: group added to /etc/gshadow: name=_keytab
[armh] <86>Sep 21 16:28:04 groupadd[2010670]: new group: name=_keytab, GID=499
[armh] <13>Sep 21 16:28:04 rpmi: libkrb5-1.19.3-alt1 p10+296676.100.2.1 1647368655 installed
[armh] <86>Sep 21 16:28:04 groupadd[2010742]: group added to /etc/group: name=sasl, GID=498
[armh] <86>Sep 21 16:28:04 groupadd[2010742]: group added to /etc/gshadow: name=sasl
[armh] <86>Sep 21 16:28:04 groupadd[2010742]: new group: name=sasl, GID=498
[armh] <13>Sep 21 16:28:04 rpmi: libsasl2-3-2.1.27-alt2.1 sisyphus+278407.100.1.3 1626205889 installed
[armh] <13>Sep 21 16:28:04 rpmi: libldap-2.4.59-alt1 p10+282974.100.1.1 1629142881 installed
[armh] <13>Sep 21 16:28:05 rpmi: libcurl-7.85.0-alt1 p10+306026.100.2.1 1662731804 installed
[armh] <13>Sep 21 16:28:05 rpmi: python3-module-genshi-0.7.4-alt2 sisyphus+275930.100.2.1 1624873830 installed
[armh] <13>Sep 21 16:28:05 rpmi: setup-rb-5.999.4-alt8 sisyphus+264172.100.3.1 1609402344 installed
[armh] <13>Sep 21 16:28:05 rpmi: gem-setup-5.999.4-alt8 sisyphus+264172.100.3.1 1609402344 installed
[armh] <13>Sep 21 16:28:05 rpmi: python3-module-webencodings-0.5.1-alt2 sisyphus+276020.100.1.1 1624812421 installed
[armh] <13>Sep 21 16:28:05 rpmi: python3-module-html5lib-1:1.1-alt1 sisyphus+278096.120.5.1 1626086978 installed
[armh] <13>Sep 21 16:28:05 rpmi: python3-module-lxml-4.6.3.0.16.git5ecb40bc-alt1 sisyphus+279721.1500.1.1 1626649177 installed
[armh] <13>Sep 21 16:28:05 rpmi: python3-module-cssselect-0.9.1-alt3 sisyphus+270533.2600.6.1 1619684675 installed
[armh] <13>Sep 21 16:28:05 rpmi: python3-module-javapackages-1:5.3.0-alt1_15jpp11 sisyphus+278038.500.1.3 1625987751 installed
[armh] <13>Sep 21 16:28:05 rpmi: tests-for-installed-python3-pkgs-0.1.19-alt1 p10+304992.400.2.1 1660661933 installed
[armh] <13>Sep 21 16:28:05 rpmi: libssl-devel-1.1.1q-alt1 p10+303207.100.1.1 1657031111 installed
[armh] <13>Sep 21 16:28:05 rpmi: libruby-devel-2.7.4-alt2.2.1 p10+291491.1000.21.1 1640428713 installed
[armh] <13>Sep 21 16:28:05 rpmi: openssh-common-7.9p1-alt4.p10.1 p10+297014.100.1.1 1647968466 installed
[armh] <86>Sep 21 16:28:05 groupadd[2011094]: group added to /etc/group: name=sshagent, GID=497
[armh] <86>Sep 21 16:28:05 groupadd[2011094]: group added to /etc/gshadow: name=sshagent
[armh] <86>Sep 21 16:28:05 groupadd[2011094]: new group: name=sshagent, GID=497
[armh] <13>Sep 21 16:28:05 rpmi: openssh-clients-7.9p1-alt4.p10.1 p10+297014.100.1.1 1647968466 installed
[armh] <13>Sep 21 16:28:05 rpmi: rsync-3.2.5-alt1 p10+305675.100.2.1 1662449530 installed
[armh] <13>Sep 21 16:28:05 rpmi: git-core-2.33.3-alt1 p10+303145.100.1.1 1656934204 installed
[armh] <13>Sep 21 16:28:05 rpmi: ruby-tool-setup-3.4.1-alt15 sisyphus+224756.300.2.1 1552290808 installed
[armh] <13>Sep 21 16:28:05 rpmi: rpm-build-ruby-1:1.0.0-alt13 sisyphus+263592.20.7.1 1608654963 installed
[armh] <13>Sep 21 16:28:05 rpmi: rpm-build-python3-0.1.19-alt1 p10+304992.400.2.1 1660661933 installed
[armh] <13>Sep 21 16:28:05 rpmi: rpm-build-java-1:5.3.0-alt1_15jpp11 sisyphus+278038.500.1.3 1625987751 installed
[armh] warning: Macro %ruby_use_gem_dependency not found
[armh] error: line 71: Unknown tag: %ruby_use_gem_dependency rake-compiler >= 1.2.0,rake-compiler < 2
[armh] hsh-rebuild: pkg.tar: failed to fetch build dependencies.
2022-Sep-21 16:28:07 :: [armh] protobuf.git 3.16.0-alt6.2: remote: cannot build src.rpm, but we don't care
2022-Sep-21 16:28:07 :: [armh] #600 protobuf.git 3.16.0-alt6.2: build SKIPPED
2022-Sep-21 16:35:04 :: [x86_64] #200 java-17-openjdk-17.0.4.0.8-alt0.p10.1.src.rpm: build OK
2022-Sep-21 16:35:04 :: [x86_64] #300 java-atk-wrapper-0.38.0-alt2_6jpp11.src.rpm: build start
2022-Sep-21 16:35:52 :: [x86_64] #300 java-atk-wrapper-0.38.0-alt2_6jpp11.src.rpm: build OK
2022-Sep-21 16:35:52 :: [x86_64] #400 jtoaster-1.0.5-alt4_12jpp11.src.rpm: build start
2022-Sep-21 16:36:13 :: [i586] #200 java-17-openjdk-17.0.4.0.8-alt0.p10.1.src.rpm: build OK
2022-Sep-21 16:36:13 :: [i586] #300 java-atk-wrapper-0.38.0-alt2_6jpp11.src.rpm: build start
2022-Sep-21 16:36:22 :: [x86_64] #400 jtoaster-1.0.5-alt4_12jpp11.src.rpm: build OK
2022-Sep-21 16:36:22 :: [x86_64] #500 mckoi-1.0.4-alt4_17jpp11.src.rpm: build start
2022-Sep-21 16:37:03 :: [i586] #300 java-atk-wrapper-0.38.0-alt2_6jpp11.src.rpm: build OK
2022-Sep-21 16:37:03 :: [i586] #400 jtoaster-1.0.5-alt4_12jpp11.src.rpm: build start
2022-Sep-21 16:37:08 :: [x86_64] #500 mckoi-1.0.4-alt4_17jpp11.src.rpm: build OK
2022-Sep-21 16:37:08 :: [x86_64] #600 protobuf.git 3.16.0-alt6.2: build start
[x86_64] <13>Sep 21 16:37:18 rpmi: libruby-2.7.4-alt2.2.1 p10+291491.1000.21.1 1640428300 installed
[x86_64] <13>Sep 21 16:37:18 rpmi: libgdbm-1.8.3-alt10 sisyphus+278100.1600.1.1 1626058413 installed
[x86_64] <13>Sep 21 16:37:18 rpmi: libexpat-2.4.3-alt1 p10+293695.100.1.1 1642509078 installed
[x86_64] <13>Sep 21 16:37:18 rpmi: libidn2-2.3.2-alt1 p10+281239.100.3.1 1627673251 installed
[x86_64] <13>Sep 21 16:37:18 rpmi: libyaml2-0.2.5-alt1 sisyphus+278391.100.1.1 1626094928 installed
[x86_64] <13>Sep 21 16:37:18 rpmi: libyaml-devel-0.2.5-alt1 sisyphus+278391.100.1.1 1626094928 installed
[x86_64] <13>Sep 21 16:37:18 rpmi: libgdbm-devel-1.8.3-alt10 sisyphus+278100.1600.1.1 1626058413 installed
[x86_64] <13>Sep 21 16:37:18 rpmi: rpm-macros-ruby-1:1.0.0-alt13 sisyphus+263592.20.7.1 1608654963 installed
[x86_64] <13>Sep 21 16:37:18 rpmi: rpm-macros-java-1:5.3.0-alt1_15jpp11 sisyphus+278038.500.1.3 1625987751 installed
[x86_64] <13>Sep 21 16:37:18 rpmi: libxslt-1.1.34-alt3 sisyphus+275636.100.1.1 1624616833 installed
[x86_64] <13>Sep 21 16:37:21 rpmi: valgrind-3.17.0-alt2 sisyphus+279814.100.1.1 1626737975 installed
[x86_64] <13>Sep 21 16:37:21 rpmi: valgrind-devel-3.17.0-alt2 sisyphus+279814.100.1.1 1626737975 installed
[x86_64] <13>Sep 21 16:37:21 rpmi: zlib-devel-1.2.12-alt3 p10+305356.100.3.1 1661238279 installed
[x86_64] <13>Sep 21 16:37:21 rpmi: libreadline-devel-7.0.3-alt3 sisyphus+278099.3700.1.1 1626030606 installed
[x86_64] <13>Sep 21 16:37:21 rpmi: groff-base-1.22.3-alt2 sisyphus+275306.100.2.1 1624538375 installed
[x86_64] <13>Sep 21 16:37:21 rpmi: libncurses-6.2.20210123-alt1 sisyphus+279621.1300.1.1 1626630601 installed
[x86_64] <13>Sep 21 16:37:21 rpmi: libtinfo-devel-6.2.20210123-alt1 sisyphus+279621.1300.1.1 1626630601 installed
[x86_64] <13>Sep 21 16:37:21 rpmi: libncurses-devel-6.2.20210123-alt1 sisyphus+279621.1300.1.1 1626630601 installed
[x86_64] <13>Sep 21 16:37:21 rpmi: libncursesw-devel-6.2.20210123-alt1 sisyphus+279621.1300.1.1 1626630601 installed
[x86_64] <13>Sep 21 16:37:21 rpmi: libffi-devel-1:3.3-alt1 sisyphus+278158.300.1.1 1626050055 installed
[x86_64] <13>Sep 21 16:37:21 rpmi: libdb4.7-devel-4.7.25-alt11 sisyphus+279812.100.2.1 1626734823 installed
[x86_64] <13>Sep 21 16:37:21 rpmi: javapackages-filesystem-1:5.3.0-alt1_15jpp11 sisyphus+278038.500.1.3 1625987751 installed
[x86_64] <13>Sep 21 16:37:21 rpmi: javapackages-tools-1:5.3.0-alt1_15jpp11 sisyphus+278038.500.1.3 1625987751 installed
[x86_64] <13>Sep 21 16:37:21 rpmi: publicsuffix-list-dafsa-20220703-alt1 p10+303338.100.1.1 1657290596 installed
[x86_64] <13>Sep 21 16:37:21 rpmi: libpsl-0.21.1-alt2 sisyphus+279461.100.1.1 1626547547 installed
[x86_64] <13>Sep 21 16:37:21 rpmi: libnghttp2-1.41.0-alt1 sisyphus+275115.100.1.1 1624405462 installed
[x86_64] <13>Sep 21 16:37:21 rpmi: openldap-common-2.4.59-alt1 p10+282974.100.1.1 1629142498 installed
[x86_64] <13>Sep 21 16:37:21 rpmi: libbrotlicommon-1.0.9-alt2 sisyphus+278430.100.1.2 1626213212 installed
[x86_64] <13>Sep 21 16:37:21 rpmi: libbrotlidec-1.0.9-alt2 sisyphus+278430.100.1.2 1626213212 installed
[x86_64] <13>Sep 21 16:37:21 rpmi: libxxhash-0.8.0-alt2 sisyphus+277476.100.2.1 1625621312 installed
[x86_64] <13>Sep 21 16:37:21 rpmi: liblz4-1:1.9.3-alt1 sisyphus+278100.4000.1.1 1626059441 installed
[x86_64] <13>Sep 21 16:37:21 rpmi: libverto-0.3.2-alt1_1 sisyphus+279289.100.1.3 1626493868 installed
[x86_64] <13>Sep 21 16:37:21 rpmi: liblmdb-0.9.23-alt1 sisyphus+275369.100.1.2 1624493869 installed
[x86_64] <13>Sep 21 16:37:21 rpmi: libkeyutils-1.6.3-alt1 sisyphus+266061.100.1.1 1612919566 installed
[x86_64] <13>Sep 21 16:37:21 rpmi: libcom_err-1.46.2.0.16.f114-alt1 sisyphus+278100.1000.1.1 1626056805 installed
[x86_64] <13>Sep 21 16:37:21 rpmi: libedit3-3.1.20191231-alt1 sisyphus+278505.100.1.1 1626106374 installed
[x86_64] <13>Sep 21 16:37:21 rpmi: less-530-alt1 sisyphus+278268.100.1.1 1626082709 installed
[x86_64] <13>Sep 21 16:37:21 rpmi: doxygen-1:1.9.1-alt1 p10+283520.500.2.1 1629892835 installed
[x86_64] <13>Sep 21 16:37:21 rpmi: diffstat-1.64-alt1 sisyphus+278100.700.1.1 1626056683 installed
[x86_64] <13>Sep 21 16:37:21 rpmi: chrpath-0.16-alt1 sisyphus+278100.500.1.1 1626056633 installed
[x86_64] <13>Sep 21 16:37:21 rpmi: libp11-kit-0.24.1-alt1 p10+305061.100.3.1 1660573397 installed
[x86_64] <13>Sep 21 16:37:21 rpmi: libtasn1-4.17.0-alt1 sisyphus+276722.100.1.1 1625211284 installed
[x86_64] <13>Sep 21 16:37:21 rpmi: rpm-macros-alternatives-0.5.1-alt1 sisyphus+278157.100.2.1 1626055790 installed
[x86_64] <13>Sep 21 16:37:21 rpmi: alternatives-0.5.1-alt1 sisyphus+278157.100.2.1 1626055790 installed
[x86_64] <13>Sep 21 16:37:21 rpmi: ca-certificates-2021.10.06-alt1 p10+286784.100.1.1 1633940301 installed
[x86_64] <13>Sep 21 16:37:21 rpmi: ca-trust-0.1.2-alt1 sisyphus+233348.100.1.1 1561653823 installed
[x86_64] <13>Sep 21 16:37:21 rpmi: p11-kit-trust-0.24.1-alt1 p10+305061.100.3.1 1660573397 installed
[x86_64] <13>Sep 21 16:37:21 rpmi: libcrypto1.1-1.1.1q-alt1 p10+303207.100.1.1 1657030549 installed
[x86_64] <13>Sep 21 16:37:21 rpmi: libssl1.1-1.1.1q-alt1 p10+303207.100.1.1 1657030549 installed
[x86_64] <13>Sep 21 16:37:21 rpmi: python3-3.9.6-alt1 sisyphus+276295.100.1.1 1624964289 installed
[x86_64] <13>Sep 21 16:37:22 rpmi: python3-base-3.9.6-alt1 sisyphus+276295.100.1.1 1624964289 installed
[x86_64] <13>Sep 21 16:37:22 rpmi: libpython3-3.9.6-alt1 sisyphus+276295.100.1.1 1624964289 installed
[x86_64] <13>Sep 21 16:37:22 rpmi: gem-minitest-5.14.1-alt0.1 sisyphus+249637.100.1.1 1586421683 installed
[x86_64] <13>Sep 21 16:37:22 rpmi: ruby-net-telnet-0.2.0-alt1 sisyphus+219345.2700.8.1 1547631566 installed
[x86_64] <13>Sep 21 16:37:22 rpmi: gem-rake-13.0.1-alt1 sisyphus+248971.320.47.1 1586259947 installed
[x86_64] <13>Sep 21 16:37:22 rpmi: ruby-xmlrpc-0.3.0-alt1 sisyphus+219345.3300.8.1 1547631818 installed
[x86_64] <13>Sep 21 16:37:22 rpmi: gem-2:3.1.6-alt1.1 p10+291491.1000.21.1 1640428300 installed
[x86_64] <13>Sep 21 16:37:22 rpmi: ri-6.1.1-alt3 sisyphus+220149.7500.44.1 1552167568 installed
[x86_64] <13>Sep 21 16:37:22 rpmi: rdoc-6.1.1-alt3 sisyphus+220149.7500.44.1 1552167568 installed
[x86_64] <13>Sep 21 16:37:22 rpmi: ruby-rdoc-6.1.1-alt3 sisyphus+220149.7500.44.1 1552167568 installed
[x86_64] <13>Sep 21 16:37:22 rpmi: rake-13.0.1-alt1 sisyphus+248971.320.47.1 1586259947 installed
[x86_64] <13>Sep 21 16:37:22 rpmi: erb-2.7.4-alt2.2.1 p10+291491.1000.21.1 1640428300 installed
[x86_64] <13>Sep 21 16:37:22 rpmi: irb-2.7.4-alt2.2.1 p10+291491.1000.21.1 1640428300 installed
[x86_64] <13>Sep 21 16:37:22 rpmi: gem-test-unit-3.3.5-alt1 sisyphus+248971.620.47.1 1586260035 installed
[x86_64] <13>Sep 21 16:37:22 rpmi: gem-power-assert-1.1.7-alt1 sisyphus+248971.220.47.1 1586259894 installed
[x86_64] <13>Sep 21 16:37:22 rpmi: bundle-2.1.4-alt1 sisyphus+247301.1100.3.2 1583840910 installed
[x86_64] <13>Sep 21 16:37:23 rpmi: gem-bundler-2.1.4-alt1 sisyphus+247301.1100.3.2 1583840910 installed
[x86_64] <13>Sep 21 16:37:23 rpmi: ruby-2.7.4-alt2.2.1 p10+291491.1000.21.1 1640428300 installed
[x86_64] <13>Sep 21 16:37:23 rpmi: ruby-stdlibs-2.7.4-alt2.2.1 p10+291491.1000.21.1 1640428300 installed
[x86_64] <13>Sep 21 16:37:23 rpmi: python3-module-six-1.15.0-alt2 sisyphus+270533.5100.6.1 1619685463 installed
[x86_64] <86>Sep 21 16:37:23 groupadd[2909919]: group added to /etc/group: name=_keytab, GID=499
[x86_64] <86>Sep 21 16:37:23 groupadd[2909919]: group added to /etc/gshadow: name=_keytab
[x86_64] <86>Sep 21 16:37:23 groupadd[2909919]: new group: name=_keytab, GID=499
[x86_64] <13>Sep 21 16:37:23 rpmi: libkrb5-1.19.3-alt1 p10+296676.100.2.1 1647367800 installed
[x86_64] <86>Sep 21 16:37:23 groupadd[2909924]: group added to /etc/group: name=sasl, GID=498
[x86_64] <86>Sep 21 16:37:23 groupadd[2909924]: group added to /etc/gshadow: name=sasl
[x86_64] <86>Sep 21 16:37:23 groupadd[2909924]: new group: name=sasl, GID=498
[x86_64] <13>Sep 21 16:37:23 rpmi: libsasl2-3-2.1.27-alt2.1 sisyphus+278407.100.1.3 1626205817 installed
[x86_64] <13>Sep 21 16:37:23 rpmi: libldap-2.4.59-alt1 p10+282974.100.1.1 1629142498 installed
[x86_64] <13>Sep 21 16:37:23 rpmi: libcurl-7.85.0-alt1 p10+306026.100.2.1 1662731482 installed
[x86_64] <13>Sep 21 16:37:23 rpmi: python3-module-genshi-0.7.4-alt2 sisyphus+275930.100.2.1 1624873830 installed
[x86_64] <13>Sep 21 16:37:23 rpmi: setup-rb-5.999.4-alt8 sisyphus+264172.100.3.1 1609402344 installed
[x86_64] <13>Sep 21 16:37:23 rpmi: gem-setup-5.999.4-alt8 sisyphus+264172.100.3.1 1609402344 installed
[x86_64] <13>Sep 21 16:37:23 rpmi: python3-module-webencodings-0.5.1-alt2 sisyphus+276020.100.1.1 1624812421 installed
[x86_64] <13>Sep 21 16:37:23 rpmi: python3-module-html5lib-1:1.1-alt1 sisyphus+278096.120.5.1 1626086978 installed
[x86_64] <13>Sep 21 16:37:23 rpmi: python3-module-lxml-4.6.3.0.16.git5ecb40bc-alt1 sisyphus+279721.1500.1.1 1626648574 installed
[x86_64] <13>Sep 21 16:37:23 rpmi: python3-module-cssselect-0.9.1-alt3 sisyphus+270533.2600.6.1 1619684675 installed
[x86_64] <13>Sep 21 16:37:23 rpmi: python3-module-javapackages-1:5.3.0-alt1_15jpp11 sisyphus+278038.500.1.3 1625987751 installed
[x86_64] <13>Sep 21 16:37:23 rpmi: tests-for-installed-python3-pkgs-0.1.19-alt1 p10+304992.400.2.1 1660661933 installed
[x86_64] <13>Sep 21 16:37:23 rpmi: libssl-devel-1.1.1q-alt1 p10+303207.100.1.1 1657030549 installed
[x86_64] <13>Sep 21 16:37:23 rpmi: libruby-devel-2.7.4-alt2.2.1 p10+291491.1000.21.1 1640428300 installed
[x86_64] <13>Sep 21 16:37:23 rpmi: openssh-common-7.9p1-alt4.p10.1 p10+297014.100.1.1 1647968390 installed
[x86_64] <86>Sep 21 16:37:23 groupadd[2909931]: group added to /etc/group: name=sshagent, GID=497
[x86_64] <86>Sep 21 16:37:23 groupadd[2909931]: group added to /etc/gshadow: name=sshagent
[x86_64] <86>Sep 21 16:37:23 groupadd[2909931]: new group: name=sshagent, GID=497
[x86_64] <13>Sep 21 16:37:23 rpmi: openssh-clients-7.9p1-alt4.p10.1 p10+297014.100.1.1 1647968390 installed
[x86_64] <13>Sep 21 16:37:23 rpmi: rsync-3.2.5-alt1 p10+305675.100.2.1 1662449478 installed
[x86_64] <13>Sep 21 16:37:23 rpmi: git-core-2.33.3-alt1 p10+303145.100.1.1 1656934110 installed
[x86_64] <13>Sep 21 16:37:23 rpmi: ruby-tool-setup-3.4.1-alt15 sisyphus+224756.300.2.1 1552290808 installed
[x86_64] <13>Sep 21 16:37:23 rpmi: rpm-build-ruby-1:1.0.0-alt13 sisyphus+263592.20.7.1 1608654963 installed
[x86_64] <13>Sep 21 16:37:23 rpmi: rpm-build-python3-0.1.19-alt1 p10+304992.400.2.1 1660661933 installed
[x86_64] <13>Sep 21 16:37:23 rpmi: rpm-build-java-1:5.3.0-alt1_15jpp11 sisyphus+278038.500.1.3 1625987751 installed
[x86_64] warning: Macro %ruby_use_gem_dependency not found
[x86_64] error: line 71: Unknown tag: %ruby_use_gem_dependency rake-compiler >= 1.2.0,rake-compiler < 2
[x86_64] hsh-rebuild: pkg.tar: failed to fetch build dependencies.
2022-Sep-21 16:37:24 :: [x86_64] protobuf.git 3.16.0-alt6.2: remote: cannot build src.rpm
2022-Sep-21 16:37:24 :: [x86_64] #600 protobuf.git 3.16.0-alt6.2: build FAILED
2022-Sep-21 16:37:24 :: [x86_64] requesting cancellation of task processing
2022-Sep-21 16:37:36 :: [i586] #400 jtoaster-1.0.5-alt4_12jpp11.src.rpm: build OK
2022-Sep-21 16:37:36 :: [i586] task processing CANCELLED
2022-Sep-21 16:52:06 :: [aarch64] #200 java-17-openjdk-17.0.4.0.8-alt0.p10.1.src.rpm: build OK
2022-Sep-21 16:52:06 :: [aarch64] task processing CANCELLED
2022-Sep-21 18:30:42 :: [ppc64le] #200 java-17-openjdk-17.0.4.0.8-alt0.p10.1.src.rpm: build OK
2022-Sep-21 18:30:42 :: [ppc64le] task processing CANCELLED
2022-Sep-21 16:37:24 :: [x86_64] build FAILED
2022-Sep-21 16:37:36 :: [i586] build FAILED
2022-Sep-21 16:52:06 :: [aarch64] build FAILED
2022-Sep-21 18:30:42 :: [ppc64le] build FAILED
2022-Sep-21 18:30:42 :: task #305235 for p10 FAILED


^ permalink raw reply	[flat|nested] 8+ messages in thread

* [#305235] p10 TESTED (try 4) srpm=java-17-openjdk-17.0.4.0.8-alt0.p10.1.src.rpm ...
  2022-08-13 19:31 [#305235] p10 FAILED srpm=java-17-openjdk-17.0.4.0.8-alt1.src.rpm Girar awaiter (cas)
  2022-08-18 15:30 ` [#305235] p10 EPERM (try 2) srpm=java-17-openjdk-17.0.4.0.8-alt0.p10.1.src.rpm Girar awaiter (cas)
  2022-09-21 18:30 ` [#305235] p10 FAILED (try 3) srpm=java-17-openjdk-17.0.4.0.8-alt0.p10.1.src.rpm Girar awaiter (cas)
@ 2022-09-22  6:56 ` Girar awaiter (cas)
  2022-09-22  8:48 ` [#305235] p10 TESTED (try 5) srpm=java-17-openjdk-17.0.4.0.8-alt0.p10.1.src.rpm Girar awaiter (cas)
                   ` (3 subsequent siblings)
  6 siblings, 0 replies; 8+ messages in thread
From: Girar awaiter (cas) @ 2022-09-22  6:56 UTC (permalink / raw)
  To: Andrey Cherepanov
  Cc: girar-builder-p10, sisyphus-incominger, girar-builder-p10

https://git.altlinux.org/tasks/305235/logs/events.4.1.log

subtask  name              aarch64  armh  i586  ppc64le  x86_64
   #300  java-atk-wrapper     1:19  2:00    47     1:31      45
   #400  jtoaster               50  1:19    31       58      30
   #500  mckoi                1:19  2:18    49     1:33      44



^ permalink raw reply	[flat|nested] 8+ messages in thread

* [#305235] p10 TESTED (try 5) srpm=java-17-openjdk-17.0.4.0.8-alt0.p10.1.src.rpm ...
  2022-08-13 19:31 [#305235] p10 FAILED srpm=java-17-openjdk-17.0.4.0.8-alt1.src.rpm Girar awaiter (cas)
                   ` (2 preceding siblings ...)
  2022-09-22  6:56 ` [#305235] p10 TESTED (try 4) srpm=java-17-openjdk-17.0.4.0.8-alt0.p10.1.src.rpm Girar awaiter (cas)
@ 2022-09-22  8:48 ` Girar awaiter (cas)
  2022-09-22 10:04 ` [#305235] [test-only] p10 FAILED (try 6) srpm=java-17-openjdk-17.0.4.0.8-alt0.p10.1.src.rpm Girar awaiter (cas)
                   ` (2 subsequent siblings)
  6 siblings, 0 replies; 8+ messages in thread
From: Girar awaiter (cas) @ 2022-09-22  8:48 UTC (permalink / raw)
  To: Andrey Cherepanov
  Cc: girar-builder-p10, sisyphus-incominger, girar-builder-p10

https://git.altlinux.org/tasks/305235/logs/events.5.1.log

subtask  name       aarch64  armh  i586  ppc64le  x86_64
   #700  freeplane     1:03  9:35    38     1:19      37



^ permalink raw reply	[flat|nested] 8+ messages in thread

* [#305235] [test-only] p10 FAILED (try 6) srpm=java-17-openjdk-17.0.4.0.8-alt0.p10.1.src.rpm ...
  2022-08-13 19:31 [#305235] p10 FAILED srpm=java-17-openjdk-17.0.4.0.8-alt1.src.rpm Girar awaiter (cas)
                   ` (3 preceding siblings ...)
  2022-09-22  8:48 ` [#305235] p10 TESTED (try 5) srpm=java-17-openjdk-17.0.4.0.8-alt0.p10.1.src.rpm Girar awaiter (cas)
@ 2022-09-22 10:04 ` Girar awaiter (cas)
  2022-09-22 15:02 ` [#305235] p10 FAILED (try 7) srpm=java-17-openjdk-17.0.4.0.8-alt0.p10.1.src.rpm Girar awaiter (cas)
  2022-09-22 15:41 ` [#305235] p10 EPERM (try 8) srpm=java-17-openjdk-17.0.4.0.8-alt0.p10.1.src.rpm Girar awaiter (cas)
  6 siblings, 0 replies; 8+ messages in thread
From: Girar awaiter (cas) @ 2022-09-22 10:04 UTC (permalink / raw)
  To: Andrey Cherepanov
  Cc: girar-builder-p10, sisyphus-incominger, girar-builder-p10

https://git.altlinux.org/tasks/305235/logs/events.6.1.log

subtask  name   aarch64  armh    i586  ppc64le  x86_64
  #1000  jpcap        ?     ?  failed        ?  failed

2022-Sep-22 10:02:39 :: test-only task #305235 for p10 resumed by cas:
2022-Sep-22 10:02:39 :: message: Bootstrap_is_finished_in_305236
#100 removed
#200 build java-17-openjdk-17.0.4.0.8-alt0.p10.1.src.rpm
#300 build java-atk-wrapper-0.38.0-alt2_6jpp11.src.rpm from sisyphus
#400 build jtoaster-1.0.5-alt4_12jpp11.src.rpm from sisyphus
#500 build mckoi-1.0.4-alt4_17jpp11.src.rpm from sisyphus
#600 removed
#700 build freeplane-1.3.15-alt6_7jpp8.src.rpm from sisyphus
#1000 build jpcap-0.7-alt4 from /gears/j/jpcap.git fetched at 2022-Sep-22 09:59:50 from sisyphus
#1100 build 3.0.3-alt2 from /gears/t/trove4j.git fetched at 2022-Sep-22 10:00:06 from sisyphus
2022-Sep-22 10:02:40 :: created build repo
2022-Sep-22 10:02:40 :: [i586] #200 java-17-openjdk-17.0.4.0.8-alt0.p10.1.src.rpm: build start
2022-Sep-22 10:02:40 :: [ppc64le] #200 java-17-openjdk-17.0.4.0.8-alt0.p10.1.src.rpm: build start
2022-Sep-22 10:02:40 :: [x86_64] #200 java-17-openjdk-17.0.4.0.8-alt0.p10.1.src.rpm: build start
2022-Sep-22 10:02:40 :: [armh] #200 java-17-openjdk-17.0.4.0.8-alt0.p10.1.src.rpm: build start
2022-Sep-22 10:02:40 :: [aarch64] #200 java-17-openjdk-17.0.4.0.8-alt0.p10.1.src.rpm: build start
2022-Sep-22 10:02:52 :: [i586] #200 java-17-openjdk-17.0.4.0.8-alt0.p10.1.src.rpm: build OK (cached)
2022-Sep-22 10:02:52 :: [i586] #300 java-atk-wrapper-0.38.0-alt2_6jpp11.src.rpm: build start
2022-Sep-22 10:02:53 :: [x86_64] #200 java-17-openjdk-17.0.4.0.8-alt0.p10.1.src.rpm: build OK (cached)
2022-Sep-22 10:02:53 :: [x86_64] #300 java-atk-wrapper-0.38.0-alt2_6jpp11.src.rpm: build start
2022-Sep-22 10:03:02 :: [i586] #300 java-atk-wrapper-0.38.0-alt2_6jpp11.src.rpm: build OK (cached)
2022-Sep-22 10:03:02 :: [i586] #400 jtoaster-1.0.5-alt4_12jpp11.src.rpm: build start
2022-Sep-22 10:03:03 :: [x86_64] #300 java-atk-wrapper-0.38.0-alt2_6jpp11.src.rpm: build OK (cached)
2022-Sep-22 10:03:03 :: [x86_64] #400 jtoaster-1.0.5-alt4_12jpp11.src.rpm: build start
2022-Sep-22 10:03:03 :: [aarch64] #200 java-17-openjdk-17.0.4.0.8-alt0.p10.1.src.rpm: build OK (cached)
2022-Sep-22 10:03:03 :: [aarch64] #300 java-atk-wrapper-0.38.0-alt2_6jpp11.src.rpm: build start
2022-Sep-22 10:03:05 :: [ppc64le] #200 java-17-openjdk-17.0.4.0.8-alt0.p10.1.src.rpm: build OK (cached)
2022-Sep-22 10:03:05 :: [ppc64le] #300 java-atk-wrapper-0.38.0-alt2_6jpp11.src.rpm: build start
2022-Sep-22 10:03:11 :: [i586] #400 jtoaster-1.0.5-alt4_12jpp11.src.rpm: build OK (cached)
2022-Sep-22 10:03:11 :: [i586] #500 mckoi-1.0.4-alt4_17jpp11.src.rpm: build start
2022-Sep-22 10:03:12 :: [x86_64] #400 jtoaster-1.0.5-alt4_12jpp11.src.rpm: build OK (cached)
2022-Sep-22 10:03:12 :: [x86_64] #500 mckoi-1.0.4-alt4_17jpp11.src.rpm: build start
2022-Sep-22 10:03:20 :: [i586] #500 mckoi-1.0.4-alt4_17jpp11.src.rpm: build OK (cached)
2022-Sep-22 10:03:20 :: [i586] #700 freeplane-1.3.15-alt6_7jpp8.src.rpm: build start
2022-Sep-22 10:03:22 :: [x86_64] #500 mckoi-1.0.4-alt4_17jpp11.src.rpm: build OK (cached)
2022-Sep-22 10:03:22 :: [x86_64] #700 freeplane-1.3.15-alt6_7jpp8.src.rpm: build start
2022-Sep-22 10:03:23 :: [armh] #200 java-17-openjdk-17.0.4.0.8-alt0.p10.1.src.rpm: build SKIPPED
2022-Sep-22 10:03:23 :: [armh] #300 java-atk-wrapper-0.38.0-alt2_6jpp11.src.rpm: build start
2022-Sep-22 10:03:24 :: [aarch64] #300 java-atk-wrapper-0.38.0-alt2_6jpp11.src.rpm: build OK (cached)
2022-Sep-22 10:03:24 :: [aarch64] #400 jtoaster-1.0.5-alt4_12jpp11.src.rpm: build start
2022-Sep-22 10:03:29 :: [ppc64le] #300 java-atk-wrapper-0.38.0-alt2_6jpp11.src.rpm: build OK (cached)
2022-Sep-22 10:03:29 :: [ppc64le] #400 jtoaster-1.0.5-alt4_12jpp11.src.rpm: build start
2022-Sep-22 10:03:30 :: [i586] #700 freeplane-1.3.15-alt6_7jpp8.src.rpm: build OK (cached)
2022-Sep-22 10:03:30 :: [i586] #1000 jpcap.git jpcap-0.7-alt4: build start
2022-Sep-22 10:03:31 :: [x86_64] #700 freeplane-1.3.15-alt6_7jpp8.src.rpm: build OK (cached)
2022-Sep-22 10:03:31 :: [x86_64] #1000 jpcap.git jpcap-0.7-alt4: build start
2022-Sep-22 10:03:43 :: [aarch64] #400 jtoaster-1.0.5-alt4_12jpp11.src.rpm: build OK (cached)
2022-Sep-22 10:03:43 :: [aarch64] #500 mckoi-1.0.4-alt4_17jpp11.src.rpm: build start
2022-Sep-22 10:03:49 :: [ppc64le] #400 jtoaster-1.0.5-alt4_12jpp11.src.rpm: build OK (cached)
2022-Sep-22 10:03:49 :: [ppc64le] #500 mckoi-1.0.4-alt4_17jpp11.src.rpm: build start
[i586] rm libjpcap.so
[i586] rm: cannot remove 'libjpcap.so': No such file or directory
[i586] make: [Makefile:56: clean] Error 1 (ignored)
[i586] --
[i586]     [javac] warning: [options] bootstrap class path not set in conjunction with -source 6
[i586]     [javac] error: Source option 6 is no longer supported. Use 7 or later.
[i586]     [javac] error: Target option 6 is no longer supported. Use 7 or later.
[i586] BUILD FAILED
[i586] /usr/src/RPM/BUILD/jpcap-0.7/build.xml:29: Compile failed; see the compiler error output for details.
2022-Sep-22 10:03:55 :: [i586] jpcap.git jpcap-0.7-alt4: remote: build failed
[x86_64] rm libjpcap.so
[x86_64] rm: cannot remove 'libjpcap.so': No such file or directory
[x86_64] make: [Makefile:56: clean] Error 1 (ignored)
[x86_64] --
[x86_64]     [javac] warning: [options] bootstrap class path not set in conjunction with -source 6
[x86_64]     [javac] error: Source option 6 is no longer supported. Use 7 or later.
[x86_64]     [javac] error: Target option 6 is no longer supported. Use 7 or later.
[x86_64] BUILD FAILED
[x86_64] /usr/src/RPM/BUILD/jpcap-0.7/build.xml:29: Compile failed; see the compiler error output for details.
2022-Sep-22 10:03:55 :: [x86_64] jpcap.git jpcap-0.7-alt4: remote: build failed
2022-Sep-22 10:03:55 :: [i586] #1000 jpcap.git jpcap-0.7-alt4: build FAILED
2022-Sep-22 10:03:55 :: [x86_64] #1000 jpcap.git jpcap-0.7-alt4: build FAILED
2022-Sep-22 10:03:55 :: [i586] requesting cancellation of task processing
2022-Sep-22 10:03:56 :: [armh] #300 java-atk-wrapper-0.38.0-alt2_6jpp11.src.rpm: build OK (cached)
2022-Sep-22 10:03:56 :: [armh] task processing CANCELLED
2022-Sep-22 10:04:02 :: [aarch64] #500 mckoi-1.0.4-alt4_17jpp11.src.rpm: build OK (cached)
2022-Sep-22 10:04:02 :: [aarch64] task processing CANCELLED
2022-Sep-22 10:04:10 :: [ppc64le] #500 mckoi-1.0.4-alt4_17jpp11.src.rpm: build OK (cached)
2022-Sep-22 10:04:10 :: [ppc64le] task processing CANCELLED
2022-Sep-22 10:03:55 :: [x86_64] build FAILED
2022-Sep-22 10:03:55 :: [i586] build FAILED
2022-Sep-22 10:03:56 :: [armh] build FAILED
2022-Sep-22 10:04:02 :: [aarch64] build FAILED
2022-Sep-22 10:04:10 :: [ppc64le] build FAILED
2022-Sep-22 10:04:10 :: task #305235 for p10 FAILED


^ permalink raw reply	[flat|nested] 8+ messages in thread

* [#305235] p10 FAILED (try 7) srpm=java-17-openjdk-17.0.4.0.8-alt0.p10.1.src.rpm ...
  2022-08-13 19:31 [#305235] p10 FAILED srpm=java-17-openjdk-17.0.4.0.8-alt1.src.rpm Girar awaiter (cas)
                   ` (4 preceding siblings ...)
  2022-09-22 10:04 ` [#305235] [test-only] p10 FAILED (try 6) srpm=java-17-openjdk-17.0.4.0.8-alt0.p10.1.src.rpm Girar awaiter (cas)
@ 2022-09-22 15:02 ` Girar awaiter (cas)
  2022-09-22 15:41 ` [#305235] p10 EPERM (try 8) srpm=java-17-openjdk-17.0.4.0.8-alt0.p10.1.src.rpm Girar awaiter (cas)
  6 siblings, 0 replies; 8+ messages in thread
From: Girar awaiter (cas) @ 2022-09-22 15:02 UTC (permalink / raw)
  To: Andrey Cherepanov
  Cc: girar-builder-p10, sisyphus-incominger, girar-builder-p10

https://git.altlinux.org/tasks/305235/logs/events.7.1.log

subtask  name       aarch64   armh   i586  ppc64le  x86_64
   #400  jtoaster        51   1:20     32       57      30
   #500  mckoi         1:20   2:17     49     1:30      44
   #700  freeplane     1:03   8:51     39     1:24      36
  #1100  trove4j         55   1:35     34     1:02      31
  #1200  jpcap           56   1:26     35     1:03      33
  #1300  protobuf      8:10  11:40  14:43    11:36   12:36

2022-Sep-22 14:31:02 :: task #305235 for p10 resumed by cas:
2022-Sep-22 14:31:02 :: message: Bootstrap_is_finished_in_305236
#100 removed
#200 build java-17-openjdk-17.0.4.0.8-alt0.p10.1.src.rpm
#300 build java-atk-wrapper-0.38.0-alt2_6jpp11.src.rpm from sisyphus
#400 build jtoaster-1.0.5-alt4_12jpp11.src.rpm from sisyphus
#500 build mckoi-1.0.4-alt4_17jpp11.src.rpm from sisyphus
#600 removed
#700 build freeplane-1.3.15-alt6_7jpp8.src.rpm from sisyphus
#1000 removed
#1100 build 3.0.3-alt2 from /gears/t/trove4j.git fetched at 2022-Sep-22 10:00:06 from sisyphus
#1200 build 0.7-alt5 from /people/cas/packages/jpcap.git fetched at 2022-Sep-22 14:27:49
#1300 build 3.16.0-alt1.p10.1 from /people/cas/packages/protobuf.git fetched at 2022-Sep-22 14:30:53
2022-Sep-22 14:31:03 :: created build repo
2022-Sep-22 14:31:03 :: #400: force rebuild
2022-Sep-22 14:31:03 :: #500: force rebuild
2022-Sep-22 14:31:03 :: #700: force rebuild
2022-Sep-22 14:31:03 :: [armh] #200 java-17-openjdk-17.0.4.0.8-alt0.p10.1.src.rpm: build start
2022-Sep-22 14:31:03 :: [ppc64le] #200 java-17-openjdk-17.0.4.0.8-alt0.p10.1.src.rpm: build start
2022-Sep-22 14:31:03 :: [aarch64] #200 java-17-openjdk-17.0.4.0.8-alt0.p10.1.src.rpm: build start
2022-Sep-22 14:31:03 :: [i586] #200 java-17-openjdk-17.0.4.0.8-alt0.p10.1.src.rpm: build start
2022-Sep-22 14:31:03 :: [x86_64] #200 java-17-openjdk-17.0.4.0.8-alt0.p10.1.src.rpm: build start
2022-Sep-22 14:31:23 :: [x86_64] #200 java-17-openjdk-17.0.4.0.8-alt0.p10.1.src.rpm: build OK (cached)
2022-Sep-22 14:31:23 :: [x86_64] #300 java-atk-wrapper-0.38.0-alt2_6jpp11.src.rpm: build start
2022-Sep-22 14:31:24 :: [i586] #200 java-17-openjdk-17.0.4.0.8-alt0.p10.1.src.rpm: build OK (cached)
2022-Sep-22 14:31:24 :: [i586] #300 java-atk-wrapper-0.38.0-alt2_6jpp11.src.rpm: build start
2022-Sep-22 14:31:27 :: [aarch64] #200 java-17-openjdk-17.0.4.0.8-alt0.p10.1.src.rpm: build OK (cached)
2022-Sep-22 14:31:27 :: [aarch64] #300 java-atk-wrapper-0.38.0-alt2_6jpp11.src.rpm: build start
2022-Sep-22 14:31:29 :: [ppc64le] #200 java-17-openjdk-17.0.4.0.8-alt0.p10.1.src.rpm: build OK (cached)
2022-Sep-22 14:31:29 :: [ppc64le] #300 java-atk-wrapper-0.38.0-alt2_6jpp11.src.rpm: build start
2022-Sep-22 14:31:33 :: [x86_64] #300 java-atk-wrapper-0.38.0-alt2_6jpp11.src.rpm: build OK (cached)
2022-Sep-22 14:31:33 :: [x86_64] #400 jtoaster-1.0.5-alt4_12jpp11.src.rpm: build start
2022-Sep-22 14:31:33 :: [i586] #300 java-atk-wrapper-0.38.0-alt2_6jpp11.src.rpm: build OK (cached)
2022-Sep-22 14:31:33 :: [i586] #400 jtoaster-1.0.5-alt4_12jpp11.src.rpm: build start
2022-Sep-22 14:31:42 :: [armh] #200 java-17-openjdk-17.0.4.0.8-alt0.p10.1.src.rpm: build SKIPPED
2022-Sep-22 14:31:42 :: [armh] #300 java-atk-wrapper-0.38.0-alt2_6jpp11.src.rpm: build start
2022-Sep-22 14:31:48 :: [aarch64] #300 java-atk-wrapper-0.38.0-alt2_6jpp11.src.rpm: build OK (cached)
2022-Sep-22 14:31:48 :: [aarch64] #400 jtoaster-1.0.5-alt4_12jpp11.src.rpm: build start
2022-Sep-22 14:31:54 :: [ppc64le] #300 java-atk-wrapper-0.38.0-alt2_6jpp11.src.rpm: build OK (cached)
2022-Sep-22 14:31:54 :: [ppc64le] #400 jtoaster-1.0.5-alt4_12jpp11.src.rpm: build start
2022-Sep-22 14:32:03 :: [x86_64] #400 jtoaster-1.0.5-alt4_12jpp11.src.rpm: build OK
2022-Sep-22 14:32:03 :: [x86_64] #500 mckoi-1.0.4-alt4_17jpp11.src.rpm: build start
2022-Sep-22 14:32:05 :: [i586] #400 jtoaster-1.0.5-alt4_12jpp11.src.rpm: build OK
2022-Sep-22 14:32:05 :: [i586] #500 mckoi-1.0.4-alt4_17jpp11.src.rpm: build start
2022-Sep-22 14:32:13 :: [armh] #300 java-atk-wrapper-0.38.0-alt2_6jpp11.src.rpm: build OK (cached)
2022-Sep-22 14:32:13 :: [armh] #400 jtoaster-1.0.5-alt4_12jpp11.src.rpm: build start
2022-Sep-22 14:32:39 :: [aarch64] #400 jtoaster-1.0.5-alt4_12jpp11.src.rpm: build OK
2022-Sep-22 14:32:39 :: [aarch64] #500 mckoi-1.0.4-alt4_17jpp11.src.rpm: build start
2022-Sep-22 14:32:47 :: [x86_64] #500 mckoi-1.0.4-alt4_17jpp11.src.rpm: build OK
2022-Sep-22 14:32:47 :: [x86_64] #700 freeplane-1.3.15-alt6_7jpp8.src.rpm: build start
2022-Sep-22 14:32:51 :: [ppc64le] #400 jtoaster-1.0.5-alt4_12jpp11.src.rpm: build OK
2022-Sep-22 14:32:51 :: [ppc64le] #500 mckoi-1.0.4-alt4_17jpp11.src.rpm: build start
2022-Sep-22 14:32:54 :: [i586] #500 mckoi-1.0.4-alt4_17jpp11.src.rpm: build OK
2022-Sep-22 14:32:54 :: [i586] #700 freeplane-1.3.15-alt6_7jpp8.src.rpm: build start
2022-Sep-22 14:33:23 :: [x86_64] #700 freeplane-1.3.15-alt6_7jpp8.src.rpm: build OK
2022-Sep-22 14:33:23 :: [x86_64] #1100 trove4j.git 3.0.3-alt2: build start
2022-Sep-22 14:33:33 :: [armh] #400 jtoaster-1.0.5-alt4_12jpp11.src.rpm: build OK
2022-Sep-22 14:33:33 :: [armh] #500 mckoi-1.0.4-alt4_17jpp11.src.rpm: build start
2022-Sep-22 14:33:33 :: [i586] #700 freeplane-1.3.15-alt6_7jpp8.src.rpm: build OK
2022-Sep-22 14:33:33 :: [i586] #1100 trove4j.git 3.0.3-alt2: build start
2022-Sep-22 14:33:54 :: [x86_64] #1100 trove4j.git 3.0.3-alt2: build OK
2022-Sep-22 14:33:54 :: [x86_64] #1200 jpcap.git 0.7-alt5: build start
2022-Sep-22 14:33:59 :: [aarch64] #500 mckoi-1.0.4-alt4_17jpp11.src.rpm: build OK
2022-Sep-22 14:33:59 :: [aarch64] #700 freeplane-1.3.15-alt6_7jpp8.src.rpm: build start
2022-Sep-22 14:34:07 :: [i586] #1100 trove4j.git 3.0.3-alt2: build OK
2022-Sep-22 14:34:07 :: [i586] #1200 jpcap.git 0.7-alt5: build start
2022-Sep-22 14:34:21 :: [ppc64le] #500 mckoi-1.0.4-alt4_17jpp11.src.rpm: build OK
2022-Sep-22 14:34:21 :: [ppc64le] #700 freeplane-1.3.15-alt6_7jpp8.src.rpm: build start
2022-Sep-22 14:34:27 :: [x86_64] #1200 jpcap.git 0.7-alt5: build OK
2022-Sep-22 14:34:27 :: [x86_64] #1300 protobuf.git 3.16.0-alt1.p10.1: build start
2022-Sep-22 14:34:42 :: [i586] #1200 jpcap.git 0.7-alt5: build OK
2022-Sep-22 14:34:43 :: [i586] #1300 protobuf.git 3.16.0-alt1.p10.1: build start
2022-Sep-22 14:35:02 :: [aarch64] #700 freeplane-1.3.15-alt6_7jpp8.src.rpm: build OK
2022-Sep-22 14:35:02 :: [aarch64] #1100 trove4j.git 3.0.3-alt2: build start
2022-Sep-22 14:35:45 :: [ppc64le] #700 freeplane-1.3.15-alt6_7jpp8.src.rpm: build OK
2022-Sep-22 14:35:45 :: [ppc64le] #1100 trove4j.git 3.0.3-alt2: build start
2022-Sep-22 14:35:50 :: [armh] #500 mckoi-1.0.4-alt4_17jpp11.src.rpm: build OK
2022-Sep-22 14:35:50 :: [armh] #700 freeplane-1.3.15-alt6_7jpp8.src.rpm: build start
2022-Sep-22 14:35:57 :: [aarch64] #1100 trove4j.git 3.0.3-alt2: build OK
2022-Sep-22 14:35:57 :: [aarch64] #1200 jpcap.git 0.7-alt5: build start
2022-Sep-22 14:36:47 :: [ppc64le] #1100 trove4j.git 3.0.3-alt2: build OK
2022-Sep-22 14:36:47 :: [ppc64le] #1200 jpcap.git 0.7-alt5: build start
2022-Sep-22 14:36:53 :: [aarch64] #1200 jpcap.git 0.7-alt5: build OK
2022-Sep-22 14:36:53 :: [aarch64] #1300 protobuf.git 3.16.0-alt1.p10.1: build start
2022-Sep-22 14:37:50 :: [ppc64le] #1200 jpcap.git 0.7-alt5: build OK
2022-Sep-22 14:37:50 :: [ppc64le] #1300 protobuf.git 3.16.0-alt1.p10.1: build start
2022-Sep-22 14:44:41 :: [armh] #700 freeplane-1.3.15-alt6_7jpp8.src.rpm: build OK
2022-Sep-22 14:44:41 :: [armh] #1100 trove4j.git 3.0.3-alt2: build start
2022-Sep-22 14:45:03 :: [aarch64] #1300 protobuf.git 3.16.0-alt1.p10.1: build OK
2022-Sep-22 14:46:16 :: [armh] #1100 trove4j.git 3.0.3-alt2: build OK
2022-Sep-22 14:46:16 :: [armh] #1200 jpcap.git 0.7-alt5: build start
2022-Sep-22 14:47:03 :: [x86_64] #1300 protobuf.git 3.16.0-alt1.p10.1: build OK
2022-Sep-22 14:47:42 :: [armh] #1200 jpcap.git 0.7-alt5: build OK
2022-Sep-22 14:47:42 :: [armh] #1300 protobuf.git 3.16.0-alt1.p10.1: build start
2022-Sep-22 14:49:26 :: [i586] #1300 protobuf.git 3.16.0-alt1.p10.1: build OK
2022-Sep-22 14:49:26 :: [ppc64le] #1300 protobuf.git 3.16.0-alt1.p10.1: build OK
2022-Sep-22 14:59:22 :: [armh] #1300 protobuf.git 3.16.0-alt1.p10.1: build OK
2022-Sep-22 15:00:23 :: #200: java-17-openjdk-17.0.4.0.8-alt0.p10.1.src.rpm: build check OK
2022-Sep-22 15:00:36 :: #300: java-atk-wrapper-0.38.0-alt2_6jpp11.src.rpm: build check OK
2022-Sep-22 15:00:49 :: #400: jtoaster-1.0.5-alt4_12jpp11.src.rpm: build check OK
2022-Sep-22 15:01:07 :: #500: mckoi-1.0.4-alt4_17jpp11.src.rpm: build check OK
2022-Sep-22 15:01:17 :: #700: freeplane-1.3.15-alt6_7jpp8.src.rpm: build check OK
2022-Sep-22 15:01:26 :: #1100: trove4j.git 3.0.3-alt2: build check OK
2022-Sep-22 15:01:36 :: #1200: jpcap.git 0.7-alt5: package `jpcap' version `0.7-alt5' was built earlier for sisyphus from a different source: `gear:4d71436d974ffaffbcf8cda19072aa98dd670b7e'
2022-Sep-22 15:01:36 :: #1200: jpcap.git 0.7-alt5: source id check FAILED
2022-Sep-22 15:02:45 :: #1300: protobuf.git 3.16.0-alt1.p10.1: build check OK
2022-Sep-22 15:02:46 :: build check FAILED for: #1200 
2022-Sep-22 15:02:46 :: task #305235 for p10 FAILED


^ permalink raw reply	[flat|nested] 8+ messages in thread

* [#305235] p10 EPERM (try 8) srpm=java-17-openjdk-17.0.4.0.8-alt0.p10.1.src.rpm ...
  2022-08-13 19:31 [#305235] p10 FAILED srpm=java-17-openjdk-17.0.4.0.8-alt1.src.rpm Girar awaiter (cas)
                   ` (5 preceding siblings ...)
  2022-09-22 15:02 ` [#305235] p10 FAILED (try 7) srpm=java-17-openjdk-17.0.4.0.8-alt0.p10.1.src.rpm Girar awaiter (cas)
@ 2022-09-22 15:41 ` Girar awaiter (cas)
  6 siblings, 0 replies; 8+ messages in thread
From: Girar awaiter (cas) @ 2022-09-22 15:41 UTC (permalink / raw)
  To: Andrey Cherepanov
  Cc: girar-builder-p10, sisyphus-incominger, girar-builder-p10

https://git.altlinux.org/tasks/305235/logs/events.8.1.log

subtask  name   aarch64  armh  i586  ppc64le  x86_64
  #1400  jpcap       58  2:16    40     1:07      36



^ permalink raw reply	[flat|nested] 8+ messages in thread

end of thread, other threads:[~2022-09-22 15:41 UTC | newest]

Thread overview: 8+ messages (download: mbox.gz / follow: Atom feed)
-- links below jump to the message on this page --
2022-08-13 19:31 [#305235] p10 FAILED srpm=java-17-openjdk-17.0.4.0.8-alt1.src.rpm Girar awaiter (cas)
2022-08-18 15:30 ` [#305235] p10 EPERM (try 2) srpm=java-17-openjdk-17.0.4.0.8-alt0.p10.1.src.rpm Girar awaiter (cas)
2022-09-21 18:30 ` [#305235] p10 FAILED (try 3) srpm=java-17-openjdk-17.0.4.0.8-alt0.p10.1.src.rpm Girar awaiter (cas)
2022-09-22  6:56 ` [#305235] p10 TESTED (try 4) srpm=java-17-openjdk-17.0.4.0.8-alt0.p10.1.src.rpm Girar awaiter (cas)
2022-09-22  8:48 ` [#305235] p10 TESTED (try 5) srpm=java-17-openjdk-17.0.4.0.8-alt0.p10.1.src.rpm Girar awaiter (cas)
2022-09-22 10:04 ` [#305235] [test-only] p10 FAILED (try 6) srpm=java-17-openjdk-17.0.4.0.8-alt0.p10.1.src.rpm Girar awaiter (cas)
2022-09-22 15:02 ` [#305235] p10 FAILED (try 7) srpm=java-17-openjdk-17.0.4.0.8-alt0.p10.1.src.rpm Girar awaiter (cas)
2022-09-22 15:41 ` [#305235] p10 EPERM (try 8) srpm=java-17-openjdk-17.0.4.0.8-alt0.p10.1.src.rpm Girar awaiter (cas)

ALT Linux Girar Builder robot reports

This inbox may be cloned and mirrored by anyone:

	git clone --mirror http://lore.altlinux.org/sisyphus-incominger/0 sisyphus-incominger/git/0.git

	# If you have public-inbox 1.1+ installed, you may
	# initialize and index your mirror using the following commands:
	public-inbox-init -V2 sisyphus-incominger sisyphus-incominger/ http://lore.altlinux.org/sisyphus-incominger \
		sisyphus-incominger@lists.altlinux.org sisyphus-incominger@lists.altlinux.ru sisyphus-incominger@lists.altlinux.com
	public-inbox-index sisyphus-incominger

Example config snippet for mirrors.
Newsgroup available over NNTP:
	nntp://lore.altlinux.org/org.altlinux.lists.sisyphus-incominger


AGPL code for this site: git clone https://public-inbox.org/public-inbox.git