ALT Linux Girar Builder robot reports
 help / color / mirror / Atom feed
[#274528] [test-only] FAILED zincati.git=0.0.21-alt1
 2021-06-14 15:14 UTC  (2+ messages) - mbox.gz / Atom
` [#274528] [test-only] FAILED (try 2) zincati.git=0.0.21-alt1

[#274529] TESTED srpm=unfs3-0.9.22-alt6.src.rpm
 2021-06-14 15:08 UTC  - mbox.gz / Atom

[#274506] p9 TESTED mesaflash.git=3.4.0-alt1.20210527
 2021-06-14 14:35 UTC  (4+ messages) - mbox.gz / Atom
` [#274506] p9 EPERM (try 2) mesaflash.git=3.4.0-alt1.20210527
` [#274506] p9 FAILED (try 3) mesaflash.git=3.4.0-alt1.20210527 rastercarve.git=1.0.8-alt1
` [#274506] p9 EPERM (try 4) mesaflash.git=3.4.0-alt1.20210527

[#274526] [test-only] FAILED robin-hood-hashing.git=3.11.2-alt1 spirv-headers.git=1.5.4-alt1.gbcf5521 
 2021-06-14 14:27 UTC  (5+ messages) - mbox.gz / Atom
` [#274526] [test-only] FAILED (try 2) "
` [#274526] [test-only] FAILED (try 3) "
` [#274526] TESTED (try 4) "
` [#274526] DONE (try 5) "

[girar-acl] sisyphus changes summary: librobin-hood-hashing
 2021-06-14 14:27 UTC  - mbox.gz / Atom

[#274527] DONE firmware-intel-ucode.git=16-alt1.20210608
 2021-06-14 13:44 UTC  - mbox.gz / Atom

[girar-acl] sisyphus changes summary: rastercarve
 2021-06-14 12:08 UTC  - mbox.gz / Atom

[#274525] [test-only] FAILED rastercarve.git=1.0.8-alt1
 2021-06-14 12:08 UTC  (3+ messages) - mbox.gz / Atom
` [#274525] TESTED (try 2) rastercarve.git=1.0.8-alt1
` [#274525] DONE (try 3) rastercarve.git=1.0.8-alt1

[#274524] FAILED ispc.git=1.16.0-alt1
 2021-06-14 10:07 UTC  (2+ messages) - mbox.gz / Atom
` [#274524] FAILED (try 2) ispc.git=1.16.0-alt1

[#274486] TESTED lxde-lxsession.git=0.5.5-alt3.20210420
 2021-06-14  9:58 UTC  (9+ messages) - mbox.gz / Atom
` [#274486] TESTED (try 2) lxde-lxsession.git=0.5.5-alt3.20210420
` [#274486] TESTED (try 3) lxde-lxsession.git=0.5.5-alt3.20210420
` [#274486] TESTED (try 4) lxde-lxsession.git=0.5.5-alt3.20210420
` [#274486] TESTED (try 5) lxde-lxsession.git=0.5.5-alt3.20210420
` [#274486] TESTED (try 6) lxde-lxsession.git=0.5.5-alt3
` [#274486] TESTED (try 7) lxde-lxsession.git=0.5.5-alt3 lxde-settings-lxdesktop.git=0.3.2-alt1
` [#274486] TESTED (try 8) "
` [#274486] DONE (try 9) "

[#274523] DONE cve-manager-inner-knowledge.git=2021.06.14-alt1
 2021-06-14  9:34 UTC  - mbox.gz / Atom

[#274522] DONE yq.git=2.12.2-alt1
 2021-06-14  9:13 UTC  - mbox.gz / Atom

[#274521] DONE yara.git=4.1.1-alt1
 2021-06-14  9:08 UTC  - mbox.gz / Atom

[#274520] DONE stress-ng.git=0.12.10-alt1
 2021-06-14  9:01 UTC  - mbox.gz / Atom

[#274518] [test-only] FAILED vulkan-amdgpu.git=2021.Q2.5-alt1
 2021-06-14  7:42 UTC  (3+ messages) - mbox.gz / Atom
` [#274518] TESTED (try 2) vulkan-amdgpu.git=2021.Q2.5-alt2
` [#274518] DONE (try 3) vulkan-amdgpu.git=2021.Q2.5-alt2

[#274515] FAILED srpm=scala-2.10.6-alt3_17jpp8.src.rpm
 2021-06-14  1:05 UTC  - mbox.gz / Atom

[#274519] DONE srpm=mednafen-1.27.1-alt1.src.rpm
 2021-06-14  0:43 UTC  - mbox.gz / Atom

[#274516] FAILED perl.git=5.34.0-alt1 openldap.git=2.4.57-alt1 
 2021-06-14  0:01 UTC  - mbox.gz / Atom

[#262462] [test-only] p8 FAILED (try 2) usermode-fs-tools.git=1.2-alt1
 2021-06-13 22:00 UTC  (2+ messages) - mbox.gz / Atom
` [#262462] p8 TESTED (try 3) usermode-fs-tools.git=1.2-alt1

[#262460] p9 TESTED (try 2) usermode-fs-tools.git=1.2-alt1
 2021-06-13 21:31 UTC  - mbox.gz / Atom

[#272188] TESTED (try 3) usermode-fs-tools.git=1.2-alt1
 2021-06-13 21:24 UTC  (5+ messages) - mbox.gz / Atom
` [#272188] TESTED (try 2) usermode-fs-tools.git=1.2-alt1
  ` [#272188] TESTED usermode-fs-tools.git=1.2-alt1
    ` [#272188] TESTED (try 4) usermode-fs-tools.git=1.2-alt1
    ` [#272188] DONE (try 5) usermode-fs-tools.git=1.2-alt1

[#274511] TESTED python3-module-manticoresearch.git=1.0.5-alt2
 2021-06-13 18:40 UTC  (2+ messages) - mbox.gz / Atom
` [#274511] DONE (try 2) python3-module-manticoresearch.git=1.0.5-alt2

[girar-acl] sisyphus changes summary: python3-module-manticoresearch
 2021-06-13 18:40 UTC  - mbox.gz / Atom

[#274517] DONE python3-module-bitarray.git=2.1.1-alt1
 2021-06-13 17:42 UTC  - mbox.gz / Atom

[#274512] TESTED ripgrep.git=13.0.0-alt1
 2021-06-13 17:07 UTC  (2+ messages) - mbox.gz / Atom
` [#274512] DONE (try 2) ripgrep.git=13.0.0-alt1

[#274507] FAILED srpm=scala-2.10.6-alt3_17jpp8.src.rpm
 2021-06-13 16:02 UTC  - mbox.gz / Atom

[#274509] DONE srpm=gnote-40.2-alt1.src.rpm
 2021-06-13 15:26 UTC  - mbox.gz / Atom

[#274508] p9 EPERM srpm=perl-RPM-Source-Convert-0.690-alt1.src.rpm
 2021-06-13 15:10 UTC  - mbox.gz / Atom

[girar-acl] sisyphus changes summary: mesaflash
 2021-06-13 14:48 UTC  - mbox.gz / Atom

[#274505] [test-only] FAILED mesaflash.git=3.4.0-alt1.20210527
 2021-06-13 14:48 UTC  (3+ messages) - mbox.gz / Atom
` [#274505] TESTED (try 2) mesaflash.git=3.4.0-alt1.20210527
` [#274505] DONE (try 3) mesaflash.git=3.4.0-alt1.20210527

[#274504] DONE srpm=perl-RPM-Source-Convert-0.690-alt1.src.rpm
 2021-06-13 14:25 UTC  - mbox.gz / Atom

[#274502] DONE ant1.9.git=1.9.6-alt8_3jpp8
 2021-06-13 13:37 UTC  - mbox.gz / Atom

[#274503] p9 FAILED wxMaxima.git=21.05.2-alt1
 2021-06-13 13:36 UTC  - mbox.gz / Atom

[#274501] FAILED ant1.9.git=1.9.6-alt8_3jpp8
 2021-06-13 13:20 UTC  - mbox.gz / Atom

[#274500] FAILED srpm=ant1.9-1.9.6-alt8_3jpp8.src.rpm
 2021-06-13 13:12 UTC  - mbox.gz / Atom

[#274499] DONE srpm=javassist-3.27.0-alt1_2jpp11.src.rpm
 2021-06-13 13:00 UTC  - mbox.gz / Atom

[#274495] FAILED del=netty3
 2021-06-13 12:54 UTC  (2+ messages) - mbox.gz / Atom
` [#274495] DONE (try 2) del=netty3

[girar-acl] sisyphus changes summary: netty3
 2021-06-13 12:54 UTC  - mbox.gz / Atom

[girar-acl] sisyphus changes summary: maven-injection-plugin
 2021-06-13 12:50 UTC  - mbox.gz / Atom

[#274498] DONE del=maven-injection-plugin
 2021-06-13 12:50 UTC  - mbox.gz / Atom

[girar-acl] sisyphus changes summary: zookeeper
 2021-06-13 12:48 UTC  - mbox.gz / Atom

[#274497] DONE del=zookeeper
 2021-06-13 12:48 UTC  - mbox.gz / Atom

[girar-acl] sisyphus changes summary: jboss-marshalling
 2021-06-13 12:45 UTC  - mbox.gz / Atom

[#274496] DONE del=jboss-marshalling
 2021-06-13 12:45 UTC  - mbox.gz / Atom

[#274494] DONE del=protostream
 2021-06-13 12:41 UTC  - mbox.gz / Atom

[girar-acl] sisyphus changes summary: protostream
 2021-06-13 12:41 UTC  - mbox.gz / Atom

[girar-acl] sisyphus changes summary: lettuce
 2021-06-13 12:38 UTC  - mbox.gz / Atom

[#274493] DONE del=lettuce
 2021-06-13 12:38 UTC  - mbox.gz / Atom

[#274492] DONE del=jboss-msc
 2021-06-13 12:34 UTC  - mbox.gz / Atom

[girar-acl] sisyphus changes summary: jboss-msc
 2021-06-13 12:34 UTC  - mbox.gz / Atom

[#274491] p8 TESTED hw-probe.git=1.5-alt0.M80P.1
 2021-06-13 12:29 UTC  - mbox.gz / Atom

[#274490] DONE del=jboss-sasl
 2021-06-13 12:24 UTC  - mbox.gz / Atom

[girar-acl] sisyphus changes summary: jboss-sasl
 2021-06-13 12:24 UTC  - mbox.gz / Atom

[#274489] DONE srpm=xerces-j2-2.12.1-alt1_3jpp11.src.rpm
 2021-06-13 12:17 UTC  - mbox.gz / Atom

[#274488] [test-only] p8 FAILED hw-probe.git=1.5-alt1
 2021-06-13 12:07 UTC  - mbox.gz / Atom

[#274452] TESTED rr.git=5.4.0-alt3
 2021-06-13 11:19 UTC  (2+ messages) - mbox.gz / Atom
` [#274452] DONE (try 2) rr.git=5.4.0-alt3

[#274487] DONE srpm=java-runtime-decompiler-4.0-alt1_3jpp11.src.rpm
 2021-06-13 10:55 UTC  - mbox.gz / Atom

[#274485] DONE del=aesh
 2021-06-13  9:44 UTC  - mbox.gz / Atom

[girar-acl] sisyphus changes summary: aesh
 2021-06-13  9:44 UTC  - mbox.gz / Atom

[#274484] DONE pdf2djvu.git=0.9.18-alt1.1
 2021-06-13  9:26 UTC  - mbox.gz / Atom

[#274483] DONE pdf2djvu.git=0.9.18-alt1
 2021-06-13  9:16 UTC  - mbox.gz / Atom

[#274482] DONE srpm=jffi-1.2.23-alt1_5jpp11.src.rpm
 2021-06-13  9:07 UTC  - mbox.gz / Atom

[#274481] DONE srpm=args4j-2.33-alt1_14jpp11.src.rpm
 2021-06-13  7:52 UTC  - mbox.gz / Atom

[#274479] TESTED libfm.git=1.3.2-alt1 pcmanfm.git=1.3.2-alt1
 2021-06-13  7:49 UTC  (2+ messages) - mbox.gz / Atom
` [#274479] DONE (try 2) "

[#274478] TESTED lxde-lxterminal.git=0.4.0-alt1
 2021-06-13  7:41 UTC  (6+ messages) - mbox.gz / Atom
` [#274478] TESTED (try 2) lxde-lxterminal.git=0.4.0-alt1
` [#274478] [test-only] FAILED (try 3) lxde-lxterminal.git=0.4.0-alt1
` [#274478] TESTED (try 4) lxde-lxterminal.git=0.4.0-alt1
` [#274478] TESTED (try 5) lxde-lxterminal.git=0.4.0-alt1
` [#274478] DONE (try 6) lxde-lxterminal.git=0.4.0-alt1

[#274480] DONE srpm=openas2-2.10.0-alt1_9jpp11.src.rpm
 2021-06-13  7:16 UTC  - mbox.gz / Atom

[girar-acl] sisyphus changes summary: openas2
 2021-06-13  7:16 UTC  - mbox.gz / Atom

[#274477] FAILED del=qt4-webkit
 2021-06-12 22:19 UTC  - mbox.gz / Atom

[#274367] TESTED (try 3) jss.git=4.8.1-alt2 tomcatjss.git=7.6.1-alt2 ldapjdk.git=4.22.0-alt2 
 2021-06-12 22:15 UTC  (4+ messages) - mbox.gz / Atom
` [#274367] [test-only] FAILED (try 2) "
  ` [#274367] [test-only] FAILED "
    ` [#274367] DONE (try 4) "

[#274474] DONE googletest.git=1.11.0-alt1 partio.git=1.14.0-alt1 
 2021-06-12 20:26 UTC  - mbox.gz / Atom

[#274473] DONE kamoso.git=21.04.2-alt1
 2021-06-12 20:15 UTC  - mbox.gz / Atom

[#274476] DONE kernel-image-xenomai.git=4.19.192-alt2.cip50.18
 2021-06-12 20:10 UTC  - mbox.gz / Atom

[#274273] [test-only] FAILED (try 10) gnustep-base.git=1.28.0-alt2 gnustep-gui.git=0.29.0-alt2 
 2021-06-12 20:06 UTC  (19+ messages) - mbox.gz / Atom
` [#274273] FAILED (try 9) "
  ` [#274273] FAILED (try 8) "
    ` [#274273] FAILED (try 7) "
      ` [#274273] FAILED (try 6) "
        ` [#274273] FAILED (try 5) "
          ` [#274273] FAILED (try 4) "
            ` [#274273] FAILED (try 3) gnustep-base.git=1.28.0-alt2 gnustep-gui.git=0.29.0-alt1
              ` [#274273] FAILED (try 2) gnustep-base.git=1.28.0-alt2 gnustep-Affiche.git=0.6.0-alt7
                ` [#274273] FAILED gnustep-base.git=1.28.0-alt2
                  ` [#274273] [test-only] FAILED (try 18) gnustep-base.git=1.28.0-alt2 gnustep-gui.git=0.29.0-alt2
                  ` [#274273] [test-only] FAILED (try 19) "
                  ` [#274273] [test-only] FAILED (try 20) "
                  ` [#274273] [test-only] FAILED (try 21) "
                  ` [#274273] [test-only] FAILED (try 22) "
                  ` [#274273] [test-only] FAILED (try 23) "
                  ` [#274273] [test-only] FAILED (try 24) "
                  ` [#274273] [test-only] FAILED (try 25) "
                  ` [#274273] DONE (try 26) "

[#274475] p9 EPERM srpm=perl-RPM-Source-Editor-0.9245-alt1.src.rpm
 2021-06-12 19:10 UTC  - mbox.gz / Atom

[#274472] FAILED googletest.git=1.11.0-alt1 partio.git=1.14.0-alt1 
 2021-06-12 18:59 UTC  - mbox.gz / Atom

[#274470] FAILED googletest.git=1.11.0-alt1
 2021-06-12 18:37 UTC  (2+ messages) - mbox.gz / Atom
` [#274470] FAILED (try 2) googletest.git=1.11.0-alt1 partio.git=1.14.0-alt1

[#274471] DONE srpm=perl-RPM-Source-Editor-0.9245-alt1.src.rpm
 2021-06-12 17:09 UTC  - mbox.gz / Atom

[#274469] DONE srpm=juniversalchardet-2.4.0-alt1_2jpp11.src.rpm
 2021-06-12 17:01 UTC  - mbox.gz / Atom

[#274467] DONE zlib-ng.git=2.0.4-alt1
 2021-06-12 16:41 UTC  - mbox.gz / Atom

[#274468] FAILED srpm=juniversalchardet-2.4.0-alt1_2jpp11.src.rpm
 2021-06-12 16:40 UTC  - mbox.gz / Atom

[#274466] DONE srpm=HdrHistogram-2.1.12-alt1_1jpp11.src.rpm
 2021-06-12 16:33 UTC  - mbox.gz / Atom

[girar-acl] sisyphus changes summary: jol
 2021-06-12 16:01 UTC  - mbox.gz / Atom

[#274463] DONE srpm=jol-0.16-alt1_1jpp8.src.rpm
 2021-06-12 16:01 UTC  - mbox.gz / Atom

[#274462] DONE srpm=postgresql-jdbc-42.2.18-alt1_2jpp11.src.rpm
 2021-06-12 15:56 UTC  - mbox.gz / Atom

[#274461] FAILED srpm=jol-0.16-alt1_1jpp8.src.rpm
 2021-06-12 15:49 UTC  - mbox.gz / Atom

[girar-acl] sisyphus changes summary: java-diff-utils
 2021-06-12 15:43 UTC  - mbox.gz / Atom

[#274460] DONE srpm=java-diff-utils-4.9-alt1_2jpp11.src.rpm
 2021-06-12 15:43 UTC  - mbox.gz / Atom

[#274459] FAILED srpm=jnr-posix-3.0.47-alt1_8jpp8.src.rpm
 2021-06-12 15:34 UTC  (2+ messages) - mbox.gz / Atom
` [#274459] DONE (try 2) srpm=jnr-posix-3.0.47-alt1_8jpp8.src.rpm

[#274457] DONE srpm=itext-2.1.7-alt5_41jpp11.src.rpm
 2021-06-12 15:23 UTC  - mbox.gz / Atom

[#274458] DONE srpm=jython-2.7.1-alt3_16jpp11.src.rpm
 2021-06-12 15:03 UTC  - mbox.gz / Atom

[#274456] DONE srpm=bouncycastle-1.67-alt1_2jpp11.src.rpm
 2021-06-12 14:28 UTC  - mbox.gz / Atom

[#274455] DONE srpm=jglobus-2.1.0-alt2_22jpp11.src.rpm
 2021-06-12 14:21 UTC  - mbox.gz / Atom

[#274453] DONE srpm=jline-2.14.6-alt2_10jpp11.src.rpm
 2021-06-12 14:16 UTC  - mbox.gz / Atom

[#274447] TESTED dm-secdel.git=1.0.7-alt4
 2021-06-12 14:11 UTC  (3+ messages) - mbox.gz / Atom
` [#274447] TESTED (try 2) dm-secdel.git=1.0.7-alt4
` [#274447] DONE (try 3) dm-secdel.git=1.0.7-alt4

[#274450] DONE srpm=maven-surefire-3.0.0_M4-alt1_1jpp11.src.rpm
 2021-06-12 14:08 UTC  - mbox.gz / Atom

[#274454] FAILED srpm=jglobus-2.1.0-alt2_22jpp11.src.rpm
 2021-06-12 14:06 UTC  - mbox.gz / Atom

[girar-acl] sisyphus changes summary: bouncycastle1.65
 2021-06-12 14:01 UTC  - mbox.gz / Atom

[#274448] DONE srpm=bouncycastle1.65-1.65-alt2_4jpp11.src.rpm
 2021-06-12 14:01 UTC  - mbox.gz / Atom

[girar-acl] sisyphus changes summary: codegen
 2021-06-12 13:55 UTC  - mbox.gz / Atom

[#274451] DONE del=codegen
 2021-06-12 13:55 UTC  - mbox.gz / Atom

[#274445] DONE srpm=jctools-3.2.0-alt1_1jpp8.src.rpm
 2021-06-12 13:52 UTC  - mbox.gz / Atom

[#274446] FAILED srpm=bouncycastle1.65-1.65-alt2.src.rpm
 2021-06-12 13:44 UTC  - mbox.gz / Atom

[#274437] FAILED libleatherman.git=1.12.5-alt1 libcpp-hocon.git=0.3.0-alt2
 2021-06-12 12:43 UTC  (2+ messages) - mbox.gz / Atom
` [#274437] DONE (try 2) "

[#274444] FAILED del=qt4-webkit
 2021-06-12 11:52 UTC  - mbox.gz / Atom

[#274443] TESTED quickjs.git=20210327-alt1
 2021-06-12 11:43 UTC  - mbox.gz / Atom

[#272587] TESTED (try 10) bc-wip.git=0.1.0-alt1
 2021-06-12 11:39 UTC  (11+ messages) - mbox.gz / Atom
` [#272587] TESTED (try 9) bc-wip.git=0.1.0-alt1
  ` [#272587] TESTED (try 8) bc-wip.git=0.1.0-alt1
    ` [#272587] TESTED (try 7) bc-wip.git=0.1.0-alt1
      ` [#272587] TESTED (try 6) bc-wip.git=0.1.0-alt1
        ` [#272587] TESTED (try 5) bc-wip.git=0.1.0-alt1
          ` [#272587] TESTED (try 4) bc-wip.git=0.1.0-alt1
            ` [#272587] TESTED (try 3) bc-wip.git=0.1.0-alt1
              ` [#272587] TESTED (try 2) bc-wip.git=0.1.0-alt1
                ` [#272587] TESTED bc-wip.git=0.1.0-alt1
                  ` [#272587] TESTED (try 12) make-initrd-bootchain.git=0.1.0-alt1

[#274442] FAILED srpm=mockito-3.5.13-alt1_2jpp11.src.rpm
 2021-06-12 11:37 UTC  (2+ messages) - mbox.gz / Atom
` [#274442] DONE (try 2) srpm=mockito-3.5.13-alt1_2jpp11.src.rpm

[#274441] DONE srpm=powermock-2.0.0-alt2_4jpp8.src.rpm
 2021-06-12 11:31 UTC  - mbox.gz / Atom

[#274440] DONE del=smack
 2021-06-12 11:14 UTC  - mbox.gz / Atom

[#274438] DONE srpm=icu4j-68.2-alt1_1jpp11.src.rpm 
 2021-06-12 10:41 UTC  - mbox.gz / Atom

[#274426] DONE srpm=batik-1.14-alt1_1jpp8.src.rpm
 2021-06-12 10:31 UTC  - mbox.gz / Atom

[#274402] [test-only] p9 FAILED python3-module-tinycss2.git=1.0.2-alt1 
 2021-06-12 10:29 UTC  (4+ messages) - mbox.gz / Atom
` [#274402] p9 TESTED (try 2) python3-module-tinycss2.git=1.0.2-alt1
` [#274402] p9 TESTED (try 3) python3-module-tinycss2.git=1.0.2-alt1
` [#274402] p9 EPERM (try 4) python3-module-tinycss2.git=1.0.2-alt1

[#274439] DONE srpm=snappy-java-1.1.2.4-alt2_18jpp11.src.rpm
 2021-06-12 10:27 UTC  - mbox.gz / Atom

[#274436] DONE mint-translations.git=2021.06.10-alt1
 2021-06-12 10:06 UTC  - mbox.gz / Atom

[#274433] DONE srpm=tracker3-3.1.2-alt1.src.rpm srpm=tracker-miners3-3.1.2-alt1.src.rpm
 2021-06-12  9:50 UTC  - mbox.gz / Atom

[#274435] FAILED srpm=icu4j-68.2-alt1_1jpp11.src.rpm 
 2021-06-12  9:44 UTC  - mbox.gz / Atom

[#274434] DONE srpm=freemarker-2.3.30-alt2_3jpp8.src.rpm
 2021-06-12  9:41 UTC  - mbox.gz / Atom

[#274432] DONE srpm=libbase-1.1.3-alt1_29jpp11.src.rpm
 2021-06-12  9:29 UTC  - mbox.gz / Atom

[#274431] DONE srpm=liblayout-0.2.10-alt1_24jpp11.src.rpm
 2021-06-12  9:26 UTC  - mbox.gz / Atom

[#274430] DONE srpm=jcommon-serializer-0.3.0-alt1_25jpp11.src.rpm
 2021-06-12  9:23 UTC  - mbox.gz / Atom

[#274427] DONE srpm=lucene-8.6.3-alt1_2jpp11.src.rpm
 2021-06-12  9:20 UTC  - mbox.gz / Atom

[#274428] DONE srpm=xstream-1.4.14-alt1_2jpp8.src.rpm
 2021-06-12  9:12 UTC  - mbox.gz / Atom

[#274429] DONE srpm=tomcat-9.0.45-alt1_1jpp11.src.rpm
 2021-06-12  9:00 UTC  - mbox.gz / Atom

[#274425] DONE srpm=java-atk-wrapper-0.38.0-alt1_6jpp11.src.rpm
 2021-06-12  8:51 UTC  - mbox.gz / Atom

[#274424] DONE srpm=ant-1.10.9-alt1_2jpp11.src.rpm
 2021-06-12  8:48 UTC  - mbox.gz / Atom

[#274423] DONE srpm=jackson-jaxrs-providers-2.11.4-alt1_2jpp11.src.rpm
 2021-06-12  8:31 UTC  - mbox.gz / Atom

[#274421] DONE srpm=tomcat-9.0.44-alt1_1jpp11.src.rpm
 2021-06-12  8:20 UTC  - mbox.gz / Atom

[#274422] DONE srpm=voms-clients-java-3.3.2-alt1_2jpp11.src.rpm
 2021-06-12  8:16 UTC  - mbox.gz / Atom

[#274419] DONE srpm=felix-gogo-runtime-1.1.4-alt1_1jpp11.src.rpm
 2021-06-12  8:13 UTC  - mbox.gz / Atom

[#274417] DONE srpm=jgit-5.11.0-alt1_1jpp11.src.rpm
 2021-06-12  8:10 UTC  - mbox.gz / Atom

[#274414] FAILED srpm=jackson-modules-base-2.11.4-alt1_2jpp11.src.rpm
 2021-06-12  8:07 UTC  (2+ messages) - mbox.gz / Atom
` [#274414] DONE (try 2) srpm=jackson-modules-base-2.11.4-alt1_2jpp11.src.rpm

[#274418] DONE srpm=felix-gogo-command-1.1.2-alt1_1jpp11.src.rpm
 2021-06-12  8:02 UTC  - mbox.gz / Atom

[#274420] DONE srpm=felix-gogo-shell-1.1.4-alt1_1jpp11.src.rpm
 2021-06-12  7:59 UTC  - mbox.gz / Atom

[#274415] DONE srpm=maven-3.6.3-alt2_8jpp11.src.rpm
 2021-06-12  7:52 UTC  - mbox.gz / Atom

[#274416] DONE srpm=jackson-databind-2.11.4-alt1_2jpp11.src.rpm
 2021-06-12  7:43 UTC  - mbox.gz / Atom

[#274413] DONE srpm=jackson-core-2.11.4-alt1_2jpp11.src.rpm
 2021-06-12  7:31 UTC  - mbox.gz / Atom

[#274412] DONE srpm=cdi-api-2.0-alt1_2jpp11.src.rpm srpm=maven-3.6.3-alt1_8jpp11.src.rpm
 2021-06-12  7:22 UTC  - mbox.gz / Atom

[#274411] DONE srpm=jetty-9.4.38-alt1_1jpp11.src.rpm
 2021-06-12  7:09 UTC  - mbox.gz / Atom

[#263530] [test-only] FAILED (try 10) rpm-build-ruby.git=1.0.0-alt14 gem-ancestry.git=3.2.1-alt1 
 2021-06-12  6:32 UTC  (9+ messages) - mbox.gz / Atom
` [#263530] [test-only] FAILED (try 9) "
  ` [#263530] [test-only] FAILED (try 8) gem-ancestry.git=3.2.1-alt1 gem-fog-aws.git=3.7.0-alt1
      ` [#263530] [test-only] FAILED (try 6) gem-ancestry.git=3.2.1-alt1 del=ruby-dynflow gem-dynflow.git=1.4.7-alt1
        ` [#263530] [test-only] FAILED (try 5) "
            ` [#263530] [test-only] FAILED (try 3) "
              ` [#263530] [test-only] FAILED (try 2) "
                ` [#263530] [test-only] FAILED "
                  ` [#263530] [test-only] FAILED (try 13) rpm-build-ruby.git=1.0.0-alt14 gem-setup.git=5.999.4-alt9

[#274410] TESTED xenomai.git=3.1.1-alt1
 2021-06-12  4:51 UTC  (3+ messages) - mbox.gz / Atom
` [#274410] TESTED (try 2) xenomai.git=3.1.1-alt1 kernel-image-xenomai.git=4.19.192-alt1.cip50.18
` [#274410] DONE (try 3) "

[#274409] p9 EPERM srpm=usbids-20210611-alt1.src.rpm
 2021-06-12  3:09 UTC  - mbox.gz / Atom

[#274406] DONE srpm=usbids-20210611-alt1.src.rpm
 2021-06-12  1:44 UTC  - mbox.gz / Atom

[girar-acl] sisyphus changes summary: dos2unix
 2021-06-12  1:41 UTC  - mbox.gz / Atom

[#274408] DONE srpm=dos2unix-7.4.2-alt1.src.rpm
 2021-06-12  1:41 UTC  - mbox.gz / Atom

[#274270] [test-only] FAILED del=ruby-memcache-client
 2021-06-12  1:38 UTC  - mbox.gz / Atom

[#274210] DONE (try 2) kde5-kpkpass.git=21.04.2-alt1 kde5-kaccounts-integration.git=21.04.2-alt1 
 2021-06-12  1:37 UTC  - mbox.gz / Atom

page: 

ALT Linux Girar Builder robot reports

This inbox may be cloned and mirrored by anyone:

	git clone --mirror http://lore.altlinux.org/sisyphus-incominger/0 sisyphus-incominger/git/0.git

	# If you have public-inbox 1.1+ installed, you may
	# initialize and index your mirror using the following commands:
	public-inbox-init -V2 sisyphus-incominger sisyphus-incominger/ http://lore.altlinux.org/sisyphus-incominger \
		sisyphus-incominger@lists.altlinux.org sisyphus-incominger@lists.altlinux.ru sisyphus-incominger@lists.altlinux.com
	public-inbox-index sisyphus-incominger

Example config snippet for mirrors.
Newsgroup available over NNTP:
	nntp://lore.altlinux.org/org.altlinux.lists.sisyphus-incominger


AGPL code for this site: git clone https://public-inbox.org/public-inbox.git