ALT Linux Girar Builder robot reports
 help / color / mirror / Atom feed
* [#305235] p10 FAILED srpm=java-17-openjdk-17.0.4.0.8-alt1.src.rpm
@ 2022-08-13 19:31 Girar awaiter (cas)
  2022-08-18 15:30 ` [#305235] p10 EPERM (try 2) srpm=java-17-openjdk-17.0.4.0.8-alt0.p10.1.src.rpm Girar awaiter (cas)
                   ` (12 more replies)
  0 siblings, 13 replies; 14+ messages in thread
From: Girar awaiter (cas) @ 2022-08-13 19:31 UTC (permalink / raw)
  To: Andrey Cherepanov
  Cc: girar-builder-p10, sisyphus-incominger, girar-builder-p10

https://git.altlinux.org/tasks/305235/logs/events.1.1.log

subtask  name             aarch64  armh    i586  ppc64le  x86_64
   #100  java-17-openjdk    24:22     -  failed  2:07:31   13:43

2022-Aug-13 17:24:00 :: task #305235 for p10 started by cas:
2022-Aug-13 17:24:00 :: message: Bootstrap_is_finished_in_305236
#100 build java-17-openjdk-17.0.4.0.8-alt1.src.rpm
2022-Aug-13 17:24:02 :: [x86_64] #100 java-17-openjdk-17.0.4.0.8-alt1.src.rpm: build start
2022-Aug-13 17:24:02 :: [aarch64] #100 java-17-openjdk-17.0.4.0.8-alt1.src.rpm: build start
2022-Aug-13 17:24:02 :: [armh] #100 java-17-openjdk-17.0.4.0.8-alt1.src.rpm: build start
2022-Aug-13 17:24:02 :: [i586] #100 java-17-openjdk-17.0.4.0.8-alt1.src.rpm: build start
2022-Aug-13 17:24:02 :: [ppc64le] #100 java-17-openjdk-17.0.4.0.8-alt1.src.rpm: build start
2022-Aug-13 17:24:35 :: [armh] #100 java-17-openjdk-17.0.4.0.8-alt1.src.rpm: build SKIPPED
[i586] either the file containing the function 'JVM_handle_linux_signal' or the file containing the function 'gHotSpotVMLongConstantEntryValueOffset' is not compiled with -fpic/-fPIC
[i586] verify-elf: ERROR: ./usr/lib/jvm/java-17-openjdk-17.0.4.0.8-alt1.i586/lib/server/libjvm.so: TEXTREL entry found: 0x00000000
[i586] verify-elf: WARNING: ./usr/lib/jvm/java-17-openjdk-17.0.4.0.8-alt1.i586/lib/server/libjvm.so: uses non-LFS functions: __fxstat __lxstat __xstat fcntl fopen ftruncate getrlimit lseek mkstemp mmap open posix_fallocate pread readdir setrlimit
2022-Aug-13 17:35:42 :: [i586] java-17-openjdk-17.0.4.0.8-alt1.src.rpm: remote: build failed
2022-Aug-13 17:35:42 :: [i586] #100 java-17-openjdk-17.0.4.0.8-alt1.src.rpm: build FAILED
2022-Aug-13 17:35:42 :: [i586] requesting cancellation of task processing
2022-Aug-13 17:37:45 :: [x86_64] #100 java-17-openjdk-17.0.4.0.8-alt1.src.rpm: build OK
2022-Aug-13 17:48:24 :: [aarch64] #100 java-17-openjdk-17.0.4.0.8-alt1.src.rpm: build OK
2022-Aug-13 19:31:33 :: [ppc64le] #100 java-17-openjdk-17.0.4.0.8-alt1.src.rpm: build OK
2022-Aug-13 17:35:42 :: [i586] build FAILED
2022-Aug-13 19:31:33 :: task #305235 for p10 FAILED


^ permalink raw reply	[flat|nested] 14+ messages in thread

* [#305235] p10 EPERM (try 2) srpm=java-17-openjdk-17.0.4.0.8-alt0.p10.1.src.rpm
  2022-08-13 19:31 [#305235] p10 FAILED srpm=java-17-openjdk-17.0.4.0.8-alt1.src.rpm Girar awaiter (cas)
@ 2022-08-18 15:30 ` Girar awaiter (cas)
  2022-09-21 18:30 ` [#305235] p10 FAILED (try 3) srpm=java-17-openjdk-17.0.4.0.8-alt0.p10.1.src.rpm Girar awaiter (cas)
                   ` (11 subsequent siblings)
  12 siblings, 0 replies; 14+ messages in thread
From: Girar awaiter (cas) @ 2022-08-18 15:30 UTC (permalink / raw)
  To: Andrey Cherepanov
  Cc: girar-builder-p10, sisyphus-incominger, girar-builder-p10

https://git.altlinux.org/tasks/305235/logs/events.2.1.log

subtask  name             aarch64  armh   i586  ppc64le  x86_64
   #200  java-17-openjdk    24:30     -  14:36  2:08:38   13:40



^ permalink raw reply	[flat|nested] 14+ messages in thread

* [#305235] p10 FAILED (try 3) srpm=java-17-openjdk-17.0.4.0.8-alt0.p10.1.src.rpm ...
  2022-08-13 19:31 [#305235] p10 FAILED srpm=java-17-openjdk-17.0.4.0.8-alt1.src.rpm Girar awaiter (cas)
  2022-08-18 15:30 ` [#305235] p10 EPERM (try 2) srpm=java-17-openjdk-17.0.4.0.8-alt0.p10.1.src.rpm Girar awaiter (cas)
@ 2022-09-21 18:30 ` Girar awaiter (cas)
  2022-09-22  6:56 ` [#305235] p10 TESTED (try 4) srpm=java-17-openjdk-17.0.4.0.8-alt0.p10.1.src.rpm Girar awaiter (cas)
                   ` (10 subsequent siblings)
  12 siblings, 0 replies; 14+ messages in thread
From: Girar awaiter (cas) @ 2022-09-21 18:30 UTC (permalink / raw)
  To: Andrey Cherepanov
  Cc: girar-builder-p10, sisyphus-incominger, girar-builder-p10

https://git.altlinux.org/tasks/305235/logs/events.3.1.log

subtask  name              aarch64  armh   i586  ppc64le  x86_64
   #200  java-17-openjdk     31:03     -  15:10  2:09:39   14:01
   #300  java-atk-wrapper        ?  2:02     50        ?      48
   #400  jtoaster                ?  1:19     33        ?      30
   #500  mckoi                   ?  2:21      ?        ?      46
   #600  protobuf                ?     -      ?        ?  failed

2022-Sep-21 16:21:03 :: task #305235 for p10 resumed by cas:
2022-Sep-21 16:21:03 :: message: Bootstrap_is_finished_in_305236
#100 removed
#200 build java-17-openjdk-17.0.4.0.8-alt0.p10.1.src.rpm
#300 build java-atk-wrapper-0.38.0-alt2_6jpp11.src.rpm from sisyphus
#400 build jtoaster-1.0.5-alt4_12jpp11.src.rpm from sisyphus
#500 build mckoi-1.0.4-alt4_17jpp11.src.rpm from sisyphus
#600 build 3.16.0-alt6.2 from /gears/p/protobuf.git fetched at 2022-Sep-21 16:20:52 from sisyphus
2022-Sep-21 16:21:03 :: created build repo
2022-Sep-21 16:21:03 :: [aarch64] #200 java-17-openjdk-17.0.4.0.8-alt0.p10.1.src.rpm: build start
2022-Sep-21 16:21:03 :: [x86_64] #200 java-17-openjdk-17.0.4.0.8-alt0.p10.1.src.rpm: build start
2022-Sep-21 16:21:03 :: [ppc64le] #200 java-17-openjdk-17.0.4.0.8-alt0.p10.1.src.rpm: build start
2022-Sep-21 16:21:03 :: [armh] #200 java-17-openjdk-17.0.4.0.8-alt0.p10.1.src.rpm: build start
2022-Sep-21 16:21:03 :: [i586] #200 java-17-openjdk-17.0.4.0.8-alt0.p10.1.src.rpm: build start
2022-Sep-21 16:21:43 :: [armh] #200 java-17-openjdk-17.0.4.0.8-alt0.p10.1.src.rpm: build SKIPPED
2022-Sep-21 16:21:43 :: [armh] #300 java-atk-wrapper-0.38.0-alt2_6jpp11.src.rpm: build start
2022-Sep-21 16:23:45 :: [armh] #300 java-atk-wrapper-0.38.0-alt2_6jpp11.src.rpm: build OK
2022-Sep-21 16:23:45 :: [armh] #400 jtoaster-1.0.5-alt4_12jpp11.src.rpm: build start
2022-Sep-21 16:25:04 :: [armh] #400 jtoaster-1.0.5-alt4_12jpp11.src.rpm: build OK
2022-Sep-21 16:25:04 :: [armh] #500 mckoi-1.0.4-alt4_17jpp11.src.rpm: build start
2022-Sep-21 16:27:25 :: [armh] #500 mckoi-1.0.4-alt4_17jpp11.src.rpm: build OK
2022-Sep-21 16:27:25 :: [armh] #600 protobuf.git 3.16.0-alt6.2: build start
[armh] <13>Sep 21 16:27:56 rpmi: libruby-2.7.4-alt2.2.1 p10+291491.1000.21.1 1640428713 installed
[armh] <13>Sep 21 16:27:56 rpmi: libgdbm-1.8.3-alt10 sisyphus+278100.1600.1.1 1626060299 installed
[armh] <13>Sep 21 16:27:56 rpmi: libexpat-2.4.3-alt1 p10+293695.100.1.1 1642509128 installed
[armh] <13>Sep 21 16:27:56 rpmi: libidn2-2.3.2-alt1 p10+281239.100.3.1 1627673304 installed
[armh] <13>Sep 21 16:27:56 rpmi: libyaml2-0.2.5-alt1 sisyphus+278391.100.1.1 1626094976 installed
[armh] <13>Sep 21 16:27:56 rpmi: libyaml-devel-0.2.5-alt1 sisyphus+278391.100.1.1 1626094976 installed
[armh] <13>Sep 21 16:27:56 rpmi: libgdbm-devel-1.8.3-alt10 sisyphus+278100.1600.1.1 1626060299 installed
[armh] <13>Sep 21 16:27:56 rpmi: rpm-macros-ruby-1:1.0.0-alt13 sisyphus+263592.20.7.1 1608654963 installed
[armh] <13>Sep 21 16:27:56 rpmi: rpm-macros-java-1:5.3.0-alt1_15jpp11 sisyphus+278038.500.1.3 1625987751 installed
[armh] <13>Sep 21 16:27:56 rpmi: libxslt-1.1.34-alt3 sisyphus+275636.100.1.1 1624616875 installed
[armh] <13>Sep 21 16:27:59 rpmi: valgrind-3.17.0-alt2 sisyphus+279814.100.1.1 1626737457 installed
[armh] <13>Sep 21 16:27:59 rpmi: valgrind-devel-3.17.0-alt2 sisyphus+279814.100.1.1 1626737457 installed
[armh] <13>Sep 21 16:27:59 rpmi: zlib-devel-1.2.12-alt3 p10+305356.100.3.1 1661238306 installed
[armh] <13>Sep 21 16:27:59 rpmi: libreadline-devel-7.0.3-alt3 sisyphus+278099.3700.1.1 1626032931 installed
[armh] <13>Sep 21 16:28:00 rpmi: groff-base-1.22.3-alt2 sisyphus+275306.100.2.1 1624538423 installed
[armh] <13>Sep 21 16:28:00 rpmi: libncurses-6.2.20210123-alt1 sisyphus+279621.1300.1.1 1626633151 installed
[armh] <13>Sep 21 16:28:00 rpmi: libtinfo-devel-6.2.20210123-alt1 sisyphus+279621.1300.1.1 1626633151 installed
[armh] <13>Sep 21 16:28:00 rpmi: libncurses-devel-6.2.20210123-alt1 sisyphus+279621.1300.1.1 1626633151 installed
[armh] <13>Sep 21 16:28:00 rpmi: libncursesw-devel-6.2.20210123-alt1 sisyphus+279621.1300.1.1 1626633151 installed
[armh] <13>Sep 21 16:28:00 rpmi: libffi-devel-1:3.3-alt1 sisyphus+278158.300.1.1 1626050519 installed
[armh] <13>Sep 21 16:28:00 rpmi: libdb4.7-devel-4.7.25-alt11 sisyphus+279812.100.2.1 1626735008 installed
[armh] <13>Sep 21 16:28:00 rpmi: javapackages-filesystem-1:5.3.0-alt1_15jpp11 sisyphus+278038.500.1.3 1625987751 installed
[armh] <13>Sep 21 16:28:00 rpmi: javapackages-tools-1:5.3.0-alt1_15jpp11 sisyphus+278038.500.1.3 1625987751 installed
[armh] <13>Sep 21 16:28:00 rpmi: publicsuffix-list-dafsa-20220703-alt1 p10+303338.100.1.1 1657290596 installed
[armh] <13>Sep 21 16:28:00 rpmi: libpsl-0.21.1-alt2 sisyphus+279461.100.1.1 1626547594 installed
[armh] <13>Sep 21 16:28:00 rpmi: libnghttp2-1.41.0-alt1 sisyphus+275115.100.1.1 1624405608 installed
[armh] <13>Sep 21 16:28:00 rpmi: openldap-common-2.4.59-alt1 p10+282974.100.1.1 1629142498 installed
[armh] <13>Sep 21 16:28:00 rpmi: libbrotlicommon-1.0.9-alt2 sisyphus+278430.100.1.2 1626213236 installed
[armh] <13>Sep 21 16:28:00 rpmi: libbrotlidec-1.0.9-alt2 sisyphus+278430.100.1.2 1626213236 installed
[armh] <13>Sep 21 16:28:00 rpmi: libxxhash-0.8.0-alt2 sisyphus+277476.100.2.1 1625621332 installed
[armh] <13>Sep 21 16:28:00 rpmi: liblz4-1:1.9.3-alt1 sisyphus+278100.4000.1.1 1626061905 installed
[armh] <13>Sep 21 16:28:00 rpmi: libverto-0.3.2-alt1_1 sisyphus+279289.100.1.3 1626493894 installed
[armh] <13>Sep 21 16:28:00 rpmi: liblmdb-0.9.23-alt1 sisyphus+275369.100.1.2 1624493880 installed
[armh] <13>Sep 21 16:28:00 rpmi: libkeyutils-1.6.3-alt1 sisyphus+266061.100.1.1 1612919580 installed
[armh] <13>Sep 21 16:28:00 rpmi: libcom_err-1.46.2.0.16.f114-alt1 sisyphus+278100.1000.1.1 1626057017 installed
[armh] <13>Sep 21 16:28:00 rpmi: libedit3-3.1.20191231-alt1 sisyphus+278505.100.1.1 1626106450 installed
[armh] <13>Sep 21 16:28:00 rpmi: less-530-alt1 sisyphus+278268.100.1.1 1626082725 installed
[armh] <13>Sep 21 16:28:00 rpmi: doxygen-1:1.9.1-alt1 p10+283520.500.2.1 1629898208 installed
[armh] <13>Sep 21 16:28:00 rpmi: diffstat-1.64-alt1 sisyphus+278100.700.1.1 1626056809 installed
[armh] <13>Sep 21 16:28:00 rpmi: chrpath-0.16-alt1 sisyphus+278100.500.1.1 1626056725 installed
[armh] <13>Sep 21 16:28:00 rpmi: libp11-kit-0.24.1-alt1 p10+305061.100.3.1 1660573569 installed
[armh] <13>Sep 21 16:28:00 rpmi: libtasn1-4.17.0-alt1 sisyphus+276722.100.1.1 1625211325 installed
[armh] <13>Sep 21 16:28:00 rpmi: rpm-macros-alternatives-0.5.1-alt1 sisyphus+278157.100.2.1 1626055790 installed
[armh] <13>Sep 21 16:28:00 rpmi: alternatives-0.5.1-alt1 sisyphus+278157.100.2.1 1626055790 installed
[armh] <13>Sep 21 16:28:00 rpmi: ca-certificates-2021.10.06-alt1 p10+286784.100.1.1 1633940301 installed
[armh] <13>Sep 21 16:28:00 rpmi: ca-trust-0.1.2-alt1 sisyphus+233348.100.1.1 1561653823 installed
[armh] <13>Sep 21 16:28:00 rpmi: p11-kit-trust-0.24.1-alt1 p10+305061.100.3.1 1660573569 installed
[armh] <13>Sep 21 16:28:00 rpmi: libcrypto1.1-1.1.1q-alt1 p10+303207.100.1.1 1657031111 installed
[armh] <13>Sep 21 16:28:00 rpmi: libssl1.1-1.1.1q-alt1 p10+303207.100.1.1 1657031111 installed
[armh] <13>Sep 21 16:28:00 rpmi: python3-3.9.6-alt1 sisyphus+276295.100.1.1 1624965175 installed
[armh] <13>Sep 21 16:28:02 rpmi: python3-base-3.9.6-alt1 sisyphus+276295.100.1.1 1624965175 installed
[armh] <13>Sep 21 16:28:02 rpmi: libpython3-3.9.6-alt1 sisyphus+276295.100.1.1 1624965175 installed
[armh] <13>Sep 21 16:28:02 rpmi: gem-minitest-5.14.1-alt0.1 sisyphus+249637.100.1.1 1586421683 installed
[armh] <13>Sep 21 16:28:02 rpmi: ruby-net-telnet-0.2.0-alt1 sisyphus+219345.2700.8.1 1547631566 installed
[armh] <13>Sep 21 16:28:02 rpmi: gem-rake-13.0.1-alt1 sisyphus+248971.320.47.1 1586259947 installed
[armh] <13>Sep 21 16:28:02 rpmi: ruby-xmlrpc-0.3.0-alt1 sisyphus+219345.3300.8.1 1547631818 installed
[armh] <13>Sep 21 16:28:02 rpmi: gem-2:3.1.6-alt1.1 p10+291491.1000.21.1 1640428300 installed
[armh] <13>Sep 21 16:28:02 rpmi: ri-6.1.1-alt3 sisyphus+220149.7500.44.1 1552167568 installed
[armh] <13>Sep 21 16:28:02 rpmi: rdoc-6.1.1-alt3 sisyphus+220149.7500.44.1 1552167568 installed
[armh] <13>Sep 21 16:28:02 rpmi: ruby-rdoc-6.1.1-alt3 sisyphus+220149.7500.44.1 1552167568 installed
[armh] <13>Sep 21 16:28:02 rpmi: rake-13.0.1-alt1 sisyphus+248971.320.47.1 1586259947 installed
[armh] <13>Sep 21 16:28:02 rpmi: erb-2.7.4-alt2.2.1 p10+291491.1000.21.1 1640428300 installed
[armh] <13>Sep 21 16:28:02 rpmi: irb-2.7.4-alt2.2.1 p10+291491.1000.21.1 1640428300 installed
[armh] <13>Sep 21 16:28:02 rpmi: gem-test-unit-3.3.5-alt1 sisyphus+248971.620.47.1 1586260035 installed
[armh] <13>Sep 21 16:28:02 rpmi: gem-power-assert-1.1.7-alt1 sisyphus+248971.220.47.1 1586259894 installed
[armh] <13>Sep 21 16:28:02 rpmi: bundle-2.1.4-alt1 sisyphus+247301.1100.3.2 1583840910 installed
[armh] <13>Sep 21 16:28:04 rpmi: gem-bundler-2.1.4-alt1 sisyphus+247301.1100.3.2 1583840910 installed
[armh] <13>Sep 21 16:28:04 rpmi: ruby-2.7.4-alt2.2.1 p10+291491.1000.21.1 1640428713 installed
[armh] <13>Sep 21 16:28:04 rpmi: ruby-stdlibs-2.7.4-alt2.2.1 p10+291491.1000.21.1 1640428713 installed
[armh] <13>Sep 21 16:28:04 rpmi: python3-module-six-1.15.0-alt2 sisyphus+270533.5100.6.1 1619685463 installed
[armh] <86>Sep 21 16:28:04 groupadd[2010670]: group added to /etc/group: name=_keytab, GID=499
[armh] <86>Sep 21 16:28:04 groupadd[2010670]: group added to /etc/gshadow: name=_keytab
[armh] <86>Sep 21 16:28:04 groupadd[2010670]: new group: name=_keytab, GID=499
[armh] <13>Sep 21 16:28:04 rpmi: libkrb5-1.19.3-alt1 p10+296676.100.2.1 1647368655 installed
[armh] <86>Sep 21 16:28:04 groupadd[2010742]: group added to /etc/group: name=sasl, GID=498
[armh] <86>Sep 21 16:28:04 groupadd[2010742]: group added to /etc/gshadow: name=sasl
[armh] <86>Sep 21 16:28:04 groupadd[2010742]: new group: name=sasl, GID=498
[armh] <13>Sep 21 16:28:04 rpmi: libsasl2-3-2.1.27-alt2.1 sisyphus+278407.100.1.3 1626205889 installed
[armh] <13>Sep 21 16:28:04 rpmi: libldap-2.4.59-alt1 p10+282974.100.1.1 1629142881 installed
[armh] <13>Sep 21 16:28:05 rpmi: libcurl-7.85.0-alt1 p10+306026.100.2.1 1662731804 installed
[armh] <13>Sep 21 16:28:05 rpmi: python3-module-genshi-0.7.4-alt2 sisyphus+275930.100.2.1 1624873830 installed
[armh] <13>Sep 21 16:28:05 rpmi: setup-rb-5.999.4-alt8 sisyphus+264172.100.3.1 1609402344 installed
[armh] <13>Sep 21 16:28:05 rpmi: gem-setup-5.999.4-alt8 sisyphus+264172.100.3.1 1609402344 installed
[armh] <13>Sep 21 16:28:05 rpmi: python3-module-webencodings-0.5.1-alt2 sisyphus+276020.100.1.1 1624812421 installed
[armh] <13>Sep 21 16:28:05 rpmi: python3-module-html5lib-1:1.1-alt1 sisyphus+278096.120.5.1 1626086978 installed
[armh] <13>Sep 21 16:28:05 rpmi: python3-module-lxml-4.6.3.0.16.git5ecb40bc-alt1 sisyphus+279721.1500.1.1 1626649177 installed
[armh] <13>Sep 21 16:28:05 rpmi: python3-module-cssselect-0.9.1-alt3 sisyphus+270533.2600.6.1 1619684675 installed
[armh] <13>Sep 21 16:28:05 rpmi: python3-module-javapackages-1:5.3.0-alt1_15jpp11 sisyphus+278038.500.1.3 1625987751 installed
[armh] <13>Sep 21 16:28:05 rpmi: tests-for-installed-python3-pkgs-0.1.19-alt1 p10+304992.400.2.1 1660661933 installed
[armh] <13>Sep 21 16:28:05 rpmi: libssl-devel-1.1.1q-alt1 p10+303207.100.1.1 1657031111 installed
[armh] <13>Sep 21 16:28:05 rpmi: libruby-devel-2.7.4-alt2.2.1 p10+291491.1000.21.1 1640428713 installed
[armh] <13>Sep 21 16:28:05 rpmi: openssh-common-7.9p1-alt4.p10.1 p10+297014.100.1.1 1647968466 installed
[armh] <86>Sep 21 16:28:05 groupadd[2011094]: group added to /etc/group: name=sshagent, GID=497
[armh] <86>Sep 21 16:28:05 groupadd[2011094]: group added to /etc/gshadow: name=sshagent
[armh] <86>Sep 21 16:28:05 groupadd[2011094]: new group: name=sshagent, GID=497
[armh] <13>Sep 21 16:28:05 rpmi: openssh-clients-7.9p1-alt4.p10.1 p10+297014.100.1.1 1647968466 installed
[armh] <13>Sep 21 16:28:05 rpmi: rsync-3.2.5-alt1 p10+305675.100.2.1 1662449530 installed
[armh] <13>Sep 21 16:28:05 rpmi: git-core-2.33.3-alt1 p10+303145.100.1.1 1656934204 installed
[armh] <13>Sep 21 16:28:05 rpmi: ruby-tool-setup-3.4.1-alt15 sisyphus+224756.300.2.1 1552290808 installed
[armh] <13>Sep 21 16:28:05 rpmi: rpm-build-ruby-1:1.0.0-alt13 sisyphus+263592.20.7.1 1608654963 installed
[armh] <13>Sep 21 16:28:05 rpmi: rpm-build-python3-0.1.19-alt1 p10+304992.400.2.1 1660661933 installed
[armh] <13>Sep 21 16:28:05 rpmi: rpm-build-java-1:5.3.0-alt1_15jpp11 sisyphus+278038.500.1.3 1625987751 installed
[armh] warning: Macro %ruby_use_gem_dependency not found
[armh] error: line 71: Unknown tag: %ruby_use_gem_dependency rake-compiler >= 1.2.0,rake-compiler < 2
[armh] hsh-rebuild: pkg.tar: failed to fetch build dependencies.
2022-Sep-21 16:28:07 :: [armh] protobuf.git 3.16.0-alt6.2: remote: cannot build src.rpm, but we don't care
2022-Sep-21 16:28:07 :: [armh] #600 protobuf.git 3.16.0-alt6.2: build SKIPPED
2022-Sep-21 16:35:04 :: [x86_64] #200 java-17-openjdk-17.0.4.0.8-alt0.p10.1.src.rpm: build OK
2022-Sep-21 16:35:04 :: [x86_64] #300 java-atk-wrapper-0.38.0-alt2_6jpp11.src.rpm: build start
2022-Sep-21 16:35:52 :: [x86_64] #300 java-atk-wrapper-0.38.0-alt2_6jpp11.src.rpm: build OK
2022-Sep-21 16:35:52 :: [x86_64] #400 jtoaster-1.0.5-alt4_12jpp11.src.rpm: build start
2022-Sep-21 16:36:13 :: [i586] #200 java-17-openjdk-17.0.4.0.8-alt0.p10.1.src.rpm: build OK
2022-Sep-21 16:36:13 :: [i586] #300 java-atk-wrapper-0.38.0-alt2_6jpp11.src.rpm: build start
2022-Sep-21 16:36:22 :: [x86_64] #400 jtoaster-1.0.5-alt4_12jpp11.src.rpm: build OK
2022-Sep-21 16:36:22 :: [x86_64] #500 mckoi-1.0.4-alt4_17jpp11.src.rpm: build start
2022-Sep-21 16:37:03 :: [i586] #300 java-atk-wrapper-0.38.0-alt2_6jpp11.src.rpm: build OK
2022-Sep-21 16:37:03 :: [i586] #400 jtoaster-1.0.5-alt4_12jpp11.src.rpm: build start
2022-Sep-21 16:37:08 :: [x86_64] #500 mckoi-1.0.4-alt4_17jpp11.src.rpm: build OK
2022-Sep-21 16:37:08 :: [x86_64] #600 protobuf.git 3.16.0-alt6.2: build start
[x86_64] <13>Sep 21 16:37:18 rpmi: libruby-2.7.4-alt2.2.1 p10+291491.1000.21.1 1640428300 installed
[x86_64] <13>Sep 21 16:37:18 rpmi: libgdbm-1.8.3-alt10 sisyphus+278100.1600.1.1 1626058413 installed
[x86_64] <13>Sep 21 16:37:18 rpmi: libexpat-2.4.3-alt1 p10+293695.100.1.1 1642509078 installed
[x86_64] <13>Sep 21 16:37:18 rpmi: libidn2-2.3.2-alt1 p10+281239.100.3.1 1627673251 installed
[x86_64] <13>Sep 21 16:37:18 rpmi: libyaml2-0.2.5-alt1 sisyphus+278391.100.1.1 1626094928 installed
[x86_64] <13>Sep 21 16:37:18 rpmi: libyaml-devel-0.2.5-alt1 sisyphus+278391.100.1.1 1626094928 installed
[x86_64] <13>Sep 21 16:37:18 rpmi: libgdbm-devel-1.8.3-alt10 sisyphus+278100.1600.1.1 1626058413 installed
[x86_64] <13>Sep 21 16:37:18 rpmi: rpm-macros-ruby-1:1.0.0-alt13 sisyphus+263592.20.7.1 1608654963 installed
[x86_64] <13>Sep 21 16:37:18 rpmi: rpm-macros-java-1:5.3.0-alt1_15jpp11 sisyphus+278038.500.1.3 1625987751 installed
[x86_64] <13>Sep 21 16:37:18 rpmi: libxslt-1.1.34-alt3 sisyphus+275636.100.1.1 1624616833 installed
[x86_64] <13>Sep 21 16:37:21 rpmi: valgrind-3.17.0-alt2 sisyphus+279814.100.1.1 1626737975 installed
[x86_64] <13>Sep 21 16:37:21 rpmi: valgrind-devel-3.17.0-alt2 sisyphus+279814.100.1.1 1626737975 installed
[x86_64] <13>Sep 21 16:37:21 rpmi: zlib-devel-1.2.12-alt3 p10+305356.100.3.1 1661238279 installed
[x86_64] <13>Sep 21 16:37:21 rpmi: libreadline-devel-7.0.3-alt3 sisyphus+278099.3700.1.1 1626030606 installed
[x86_64] <13>Sep 21 16:37:21 rpmi: groff-base-1.22.3-alt2 sisyphus+275306.100.2.1 1624538375 installed
[x86_64] <13>Sep 21 16:37:21 rpmi: libncurses-6.2.20210123-alt1 sisyphus+279621.1300.1.1 1626630601 installed
[x86_64] <13>Sep 21 16:37:21 rpmi: libtinfo-devel-6.2.20210123-alt1 sisyphus+279621.1300.1.1 1626630601 installed
[x86_64] <13>Sep 21 16:37:21 rpmi: libncurses-devel-6.2.20210123-alt1 sisyphus+279621.1300.1.1 1626630601 installed
[x86_64] <13>Sep 21 16:37:21 rpmi: libncursesw-devel-6.2.20210123-alt1 sisyphus+279621.1300.1.1 1626630601 installed
[x86_64] <13>Sep 21 16:37:21 rpmi: libffi-devel-1:3.3-alt1 sisyphus+278158.300.1.1 1626050055 installed
[x86_64] <13>Sep 21 16:37:21 rpmi: libdb4.7-devel-4.7.25-alt11 sisyphus+279812.100.2.1 1626734823 installed
[x86_64] <13>Sep 21 16:37:21 rpmi: javapackages-filesystem-1:5.3.0-alt1_15jpp11 sisyphus+278038.500.1.3 1625987751 installed
[x86_64] <13>Sep 21 16:37:21 rpmi: javapackages-tools-1:5.3.0-alt1_15jpp11 sisyphus+278038.500.1.3 1625987751 installed
[x86_64] <13>Sep 21 16:37:21 rpmi: publicsuffix-list-dafsa-20220703-alt1 p10+303338.100.1.1 1657290596 installed
[x86_64] <13>Sep 21 16:37:21 rpmi: libpsl-0.21.1-alt2 sisyphus+279461.100.1.1 1626547547 installed
[x86_64] <13>Sep 21 16:37:21 rpmi: libnghttp2-1.41.0-alt1 sisyphus+275115.100.1.1 1624405462 installed
[x86_64] <13>Sep 21 16:37:21 rpmi: openldap-common-2.4.59-alt1 p10+282974.100.1.1 1629142498 installed
[x86_64] <13>Sep 21 16:37:21 rpmi: libbrotlicommon-1.0.9-alt2 sisyphus+278430.100.1.2 1626213212 installed
[x86_64] <13>Sep 21 16:37:21 rpmi: libbrotlidec-1.0.9-alt2 sisyphus+278430.100.1.2 1626213212 installed
[x86_64] <13>Sep 21 16:37:21 rpmi: libxxhash-0.8.0-alt2 sisyphus+277476.100.2.1 1625621312 installed
[x86_64] <13>Sep 21 16:37:21 rpmi: liblz4-1:1.9.3-alt1 sisyphus+278100.4000.1.1 1626059441 installed
[x86_64] <13>Sep 21 16:37:21 rpmi: libverto-0.3.2-alt1_1 sisyphus+279289.100.1.3 1626493868 installed
[x86_64] <13>Sep 21 16:37:21 rpmi: liblmdb-0.9.23-alt1 sisyphus+275369.100.1.2 1624493869 installed
[x86_64] <13>Sep 21 16:37:21 rpmi: libkeyutils-1.6.3-alt1 sisyphus+266061.100.1.1 1612919566 installed
[x86_64] <13>Sep 21 16:37:21 rpmi: libcom_err-1.46.2.0.16.f114-alt1 sisyphus+278100.1000.1.1 1626056805 installed
[x86_64] <13>Sep 21 16:37:21 rpmi: libedit3-3.1.20191231-alt1 sisyphus+278505.100.1.1 1626106374 installed
[x86_64] <13>Sep 21 16:37:21 rpmi: less-530-alt1 sisyphus+278268.100.1.1 1626082709 installed
[x86_64] <13>Sep 21 16:37:21 rpmi: doxygen-1:1.9.1-alt1 p10+283520.500.2.1 1629892835 installed
[x86_64] <13>Sep 21 16:37:21 rpmi: diffstat-1.64-alt1 sisyphus+278100.700.1.1 1626056683 installed
[x86_64] <13>Sep 21 16:37:21 rpmi: chrpath-0.16-alt1 sisyphus+278100.500.1.1 1626056633 installed
[x86_64] <13>Sep 21 16:37:21 rpmi: libp11-kit-0.24.1-alt1 p10+305061.100.3.1 1660573397 installed
[x86_64] <13>Sep 21 16:37:21 rpmi: libtasn1-4.17.0-alt1 sisyphus+276722.100.1.1 1625211284 installed
[x86_64] <13>Sep 21 16:37:21 rpmi: rpm-macros-alternatives-0.5.1-alt1 sisyphus+278157.100.2.1 1626055790 installed
[x86_64] <13>Sep 21 16:37:21 rpmi: alternatives-0.5.1-alt1 sisyphus+278157.100.2.1 1626055790 installed
[x86_64] <13>Sep 21 16:37:21 rpmi: ca-certificates-2021.10.06-alt1 p10+286784.100.1.1 1633940301 installed
[x86_64] <13>Sep 21 16:37:21 rpmi: ca-trust-0.1.2-alt1 sisyphus+233348.100.1.1 1561653823 installed
[x86_64] <13>Sep 21 16:37:21 rpmi: p11-kit-trust-0.24.1-alt1 p10+305061.100.3.1 1660573397 installed
[x86_64] <13>Sep 21 16:37:21 rpmi: libcrypto1.1-1.1.1q-alt1 p10+303207.100.1.1 1657030549 installed
[x86_64] <13>Sep 21 16:37:21 rpmi: libssl1.1-1.1.1q-alt1 p10+303207.100.1.1 1657030549 installed
[x86_64] <13>Sep 21 16:37:21 rpmi: python3-3.9.6-alt1 sisyphus+276295.100.1.1 1624964289 installed
[x86_64] <13>Sep 21 16:37:22 rpmi: python3-base-3.9.6-alt1 sisyphus+276295.100.1.1 1624964289 installed
[x86_64] <13>Sep 21 16:37:22 rpmi: libpython3-3.9.6-alt1 sisyphus+276295.100.1.1 1624964289 installed
[x86_64] <13>Sep 21 16:37:22 rpmi: gem-minitest-5.14.1-alt0.1 sisyphus+249637.100.1.1 1586421683 installed
[x86_64] <13>Sep 21 16:37:22 rpmi: ruby-net-telnet-0.2.0-alt1 sisyphus+219345.2700.8.1 1547631566 installed
[x86_64] <13>Sep 21 16:37:22 rpmi: gem-rake-13.0.1-alt1 sisyphus+248971.320.47.1 1586259947 installed
[x86_64] <13>Sep 21 16:37:22 rpmi: ruby-xmlrpc-0.3.0-alt1 sisyphus+219345.3300.8.1 1547631818 installed
[x86_64] <13>Sep 21 16:37:22 rpmi: gem-2:3.1.6-alt1.1 p10+291491.1000.21.1 1640428300 installed
[x86_64] <13>Sep 21 16:37:22 rpmi: ri-6.1.1-alt3 sisyphus+220149.7500.44.1 1552167568 installed
[x86_64] <13>Sep 21 16:37:22 rpmi: rdoc-6.1.1-alt3 sisyphus+220149.7500.44.1 1552167568 installed
[x86_64] <13>Sep 21 16:37:22 rpmi: ruby-rdoc-6.1.1-alt3 sisyphus+220149.7500.44.1 1552167568 installed
[x86_64] <13>Sep 21 16:37:22 rpmi: rake-13.0.1-alt1 sisyphus+248971.320.47.1 1586259947 installed
[x86_64] <13>Sep 21 16:37:22 rpmi: erb-2.7.4-alt2.2.1 p10+291491.1000.21.1 1640428300 installed
[x86_64] <13>Sep 21 16:37:22 rpmi: irb-2.7.4-alt2.2.1 p10+291491.1000.21.1 1640428300 installed
[x86_64] <13>Sep 21 16:37:22 rpmi: gem-test-unit-3.3.5-alt1 sisyphus+248971.620.47.1 1586260035 installed
[x86_64] <13>Sep 21 16:37:22 rpmi: gem-power-assert-1.1.7-alt1 sisyphus+248971.220.47.1 1586259894 installed
[x86_64] <13>Sep 21 16:37:22 rpmi: bundle-2.1.4-alt1 sisyphus+247301.1100.3.2 1583840910 installed
[x86_64] <13>Sep 21 16:37:23 rpmi: gem-bundler-2.1.4-alt1 sisyphus+247301.1100.3.2 1583840910 installed
[x86_64] <13>Sep 21 16:37:23 rpmi: ruby-2.7.4-alt2.2.1 p10+291491.1000.21.1 1640428300 installed
[x86_64] <13>Sep 21 16:37:23 rpmi: ruby-stdlibs-2.7.4-alt2.2.1 p10+291491.1000.21.1 1640428300 installed
[x86_64] <13>Sep 21 16:37:23 rpmi: python3-module-six-1.15.0-alt2 sisyphus+270533.5100.6.1 1619685463 installed
[x86_64] <86>Sep 21 16:37:23 groupadd[2909919]: group added to /etc/group: name=_keytab, GID=499
[x86_64] <86>Sep 21 16:37:23 groupadd[2909919]: group added to /etc/gshadow: name=_keytab
[x86_64] <86>Sep 21 16:37:23 groupadd[2909919]: new group: name=_keytab, GID=499
[x86_64] <13>Sep 21 16:37:23 rpmi: libkrb5-1.19.3-alt1 p10+296676.100.2.1 1647367800 installed
[x86_64] <86>Sep 21 16:37:23 groupadd[2909924]: group added to /etc/group: name=sasl, GID=498
[x86_64] <86>Sep 21 16:37:23 groupadd[2909924]: group added to /etc/gshadow: name=sasl
[x86_64] <86>Sep 21 16:37:23 groupadd[2909924]: new group: name=sasl, GID=498
[x86_64] <13>Sep 21 16:37:23 rpmi: libsasl2-3-2.1.27-alt2.1 sisyphus+278407.100.1.3 1626205817 installed
[x86_64] <13>Sep 21 16:37:23 rpmi: libldap-2.4.59-alt1 p10+282974.100.1.1 1629142498 installed
[x86_64] <13>Sep 21 16:37:23 rpmi: libcurl-7.85.0-alt1 p10+306026.100.2.1 1662731482 installed
[x86_64] <13>Sep 21 16:37:23 rpmi: python3-module-genshi-0.7.4-alt2 sisyphus+275930.100.2.1 1624873830 installed
[x86_64] <13>Sep 21 16:37:23 rpmi: setup-rb-5.999.4-alt8 sisyphus+264172.100.3.1 1609402344 installed
[x86_64] <13>Sep 21 16:37:23 rpmi: gem-setup-5.999.4-alt8 sisyphus+264172.100.3.1 1609402344 installed
[x86_64] <13>Sep 21 16:37:23 rpmi: python3-module-webencodings-0.5.1-alt2 sisyphus+276020.100.1.1 1624812421 installed
[x86_64] <13>Sep 21 16:37:23 rpmi: python3-module-html5lib-1:1.1-alt1 sisyphus+278096.120.5.1 1626086978 installed
[x86_64] <13>Sep 21 16:37:23 rpmi: python3-module-lxml-4.6.3.0.16.git5ecb40bc-alt1 sisyphus+279721.1500.1.1 1626648574 installed
[x86_64] <13>Sep 21 16:37:23 rpmi: python3-module-cssselect-0.9.1-alt3 sisyphus+270533.2600.6.1 1619684675 installed
[x86_64] <13>Sep 21 16:37:23 rpmi: python3-module-javapackages-1:5.3.0-alt1_15jpp11 sisyphus+278038.500.1.3 1625987751 installed
[x86_64] <13>Sep 21 16:37:23 rpmi: tests-for-installed-python3-pkgs-0.1.19-alt1 p10+304992.400.2.1 1660661933 installed
[x86_64] <13>Sep 21 16:37:23 rpmi: libssl-devel-1.1.1q-alt1 p10+303207.100.1.1 1657030549 installed
[x86_64] <13>Sep 21 16:37:23 rpmi: libruby-devel-2.7.4-alt2.2.1 p10+291491.1000.21.1 1640428300 installed
[x86_64] <13>Sep 21 16:37:23 rpmi: openssh-common-7.9p1-alt4.p10.1 p10+297014.100.1.1 1647968390 installed
[x86_64] <86>Sep 21 16:37:23 groupadd[2909931]: group added to /etc/group: name=sshagent, GID=497
[x86_64] <86>Sep 21 16:37:23 groupadd[2909931]: group added to /etc/gshadow: name=sshagent
[x86_64] <86>Sep 21 16:37:23 groupadd[2909931]: new group: name=sshagent, GID=497
[x86_64] <13>Sep 21 16:37:23 rpmi: openssh-clients-7.9p1-alt4.p10.1 p10+297014.100.1.1 1647968390 installed
[x86_64] <13>Sep 21 16:37:23 rpmi: rsync-3.2.5-alt1 p10+305675.100.2.1 1662449478 installed
[x86_64] <13>Sep 21 16:37:23 rpmi: git-core-2.33.3-alt1 p10+303145.100.1.1 1656934110 installed
[x86_64] <13>Sep 21 16:37:23 rpmi: ruby-tool-setup-3.4.1-alt15 sisyphus+224756.300.2.1 1552290808 installed
[x86_64] <13>Sep 21 16:37:23 rpmi: rpm-build-ruby-1:1.0.0-alt13 sisyphus+263592.20.7.1 1608654963 installed
[x86_64] <13>Sep 21 16:37:23 rpmi: rpm-build-python3-0.1.19-alt1 p10+304992.400.2.1 1660661933 installed
[x86_64] <13>Sep 21 16:37:23 rpmi: rpm-build-java-1:5.3.0-alt1_15jpp11 sisyphus+278038.500.1.3 1625987751 installed
[x86_64] warning: Macro %ruby_use_gem_dependency not found
[x86_64] error: line 71: Unknown tag: %ruby_use_gem_dependency rake-compiler >= 1.2.0,rake-compiler < 2
[x86_64] hsh-rebuild: pkg.tar: failed to fetch build dependencies.
2022-Sep-21 16:37:24 :: [x86_64] protobuf.git 3.16.0-alt6.2: remote: cannot build src.rpm
2022-Sep-21 16:37:24 :: [x86_64] #600 protobuf.git 3.16.0-alt6.2: build FAILED
2022-Sep-21 16:37:24 :: [x86_64] requesting cancellation of task processing
2022-Sep-21 16:37:36 :: [i586] #400 jtoaster-1.0.5-alt4_12jpp11.src.rpm: build OK
2022-Sep-21 16:37:36 :: [i586] task processing CANCELLED
2022-Sep-21 16:52:06 :: [aarch64] #200 java-17-openjdk-17.0.4.0.8-alt0.p10.1.src.rpm: build OK
2022-Sep-21 16:52:06 :: [aarch64] task processing CANCELLED
2022-Sep-21 18:30:42 :: [ppc64le] #200 java-17-openjdk-17.0.4.0.8-alt0.p10.1.src.rpm: build OK
2022-Sep-21 18:30:42 :: [ppc64le] task processing CANCELLED
2022-Sep-21 16:37:24 :: [x86_64] build FAILED
2022-Sep-21 16:37:36 :: [i586] build FAILED
2022-Sep-21 16:52:06 :: [aarch64] build FAILED
2022-Sep-21 18:30:42 :: [ppc64le] build FAILED
2022-Sep-21 18:30:42 :: task #305235 for p10 FAILED


^ permalink raw reply	[flat|nested] 14+ messages in thread

* [#305235] p10 TESTED (try 4) srpm=java-17-openjdk-17.0.4.0.8-alt0.p10.1.src.rpm ...
  2022-08-13 19:31 [#305235] p10 FAILED srpm=java-17-openjdk-17.0.4.0.8-alt1.src.rpm Girar awaiter (cas)
  2022-08-18 15:30 ` [#305235] p10 EPERM (try 2) srpm=java-17-openjdk-17.0.4.0.8-alt0.p10.1.src.rpm Girar awaiter (cas)
  2022-09-21 18:30 ` [#305235] p10 FAILED (try 3) srpm=java-17-openjdk-17.0.4.0.8-alt0.p10.1.src.rpm Girar awaiter (cas)
@ 2022-09-22  6:56 ` Girar awaiter (cas)
  2022-09-22  8:48 ` [#305235] p10 TESTED (try 5) srpm=java-17-openjdk-17.0.4.0.8-alt0.p10.1.src.rpm Girar awaiter (cas)
                   ` (9 subsequent siblings)
  12 siblings, 0 replies; 14+ messages in thread
From: Girar awaiter (cas) @ 2022-09-22  6:56 UTC (permalink / raw)
  To: Andrey Cherepanov
  Cc: girar-builder-p10, sisyphus-incominger, girar-builder-p10

https://git.altlinux.org/tasks/305235/logs/events.4.1.log

subtask  name              aarch64  armh  i586  ppc64le  x86_64
   #300  java-atk-wrapper     1:19  2:00    47     1:31      45
   #400  jtoaster               50  1:19    31       58      30
   #500  mckoi                1:19  2:18    49     1:33      44



^ permalink raw reply	[flat|nested] 14+ messages in thread

* [#305235] p10 TESTED (try 5) srpm=java-17-openjdk-17.0.4.0.8-alt0.p10.1.src.rpm ...
  2022-08-13 19:31 [#305235] p10 FAILED srpm=java-17-openjdk-17.0.4.0.8-alt1.src.rpm Girar awaiter (cas)
                   ` (2 preceding siblings ...)
  2022-09-22  6:56 ` [#305235] p10 TESTED (try 4) srpm=java-17-openjdk-17.0.4.0.8-alt0.p10.1.src.rpm Girar awaiter (cas)
@ 2022-09-22  8:48 ` Girar awaiter (cas)
  2022-09-22 10:04 ` [#305235] [test-only] p10 FAILED (try 6) srpm=java-17-openjdk-17.0.4.0.8-alt0.p10.1.src.rpm Girar awaiter (cas)
                   ` (8 subsequent siblings)
  12 siblings, 0 replies; 14+ messages in thread
From: Girar awaiter (cas) @ 2022-09-22  8:48 UTC (permalink / raw)
  To: Andrey Cherepanov
  Cc: girar-builder-p10, sisyphus-incominger, girar-builder-p10

https://git.altlinux.org/tasks/305235/logs/events.5.1.log

subtask  name       aarch64  armh  i586  ppc64le  x86_64
   #700  freeplane     1:03  9:35    38     1:19      37



^ permalink raw reply	[flat|nested] 14+ messages in thread

* [#305235] [test-only] p10 FAILED (try 6) srpm=java-17-openjdk-17.0.4.0.8-alt0.p10.1.src.rpm ...
  2022-08-13 19:31 [#305235] p10 FAILED srpm=java-17-openjdk-17.0.4.0.8-alt1.src.rpm Girar awaiter (cas)
                   ` (3 preceding siblings ...)
  2022-09-22  8:48 ` [#305235] p10 TESTED (try 5) srpm=java-17-openjdk-17.0.4.0.8-alt0.p10.1.src.rpm Girar awaiter (cas)
@ 2022-09-22 10:04 ` Girar awaiter (cas)
  2022-09-22 15:02 ` [#305235] p10 FAILED (try 7) srpm=java-17-openjdk-17.0.4.0.8-alt0.p10.1.src.rpm Girar awaiter (cas)
                   ` (7 subsequent siblings)
  12 siblings, 0 replies; 14+ messages in thread
From: Girar awaiter (cas) @ 2022-09-22 10:04 UTC (permalink / raw)
  To: Andrey Cherepanov
  Cc: girar-builder-p10, sisyphus-incominger, girar-builder-p10

https://git.altlinux.org/tasks/305235/logs/events.6.1.log

subtask  name   aarch64  armh    i586  ppc64le  x86_64
  #1000  jpcap        ?     ?  failed        ?  failed

2022-Sep-22 10:02:39 :: test-only task #305235 for p10 resumed by cas:
2022-Sep-22 10:02:39 :: message: Bootstrap_is_finished_in_305236
#100 removed
#200 build java-17-openjdk-17.0.4.0.8-alt0.p10.1.src.rpm
#300 build java-atk-wrapper-0.38.0-alt2_6jpp11.src.rpm from sisyphus
#400 build jtoaster-1.0.5-alt4_12jpp11.src.rpm from sisyphus
#500 build mckoi-1.0.4-alt4_17jpp11.src.rpm from sisyphus
#600 removed
#700 build freeplane-1.3.15-alt6_7jpp8.src.rpm from sisyphus
#1000 build jpcap-0.7-alt4 from /gears/j/jpcap.git fetched at 2022-Sep-22 09:59:50 from sisyphus
#1100 build 3.0.3-alt2 from /gears/t/trove4j.git fetched at 2022-Sep-22 10:00:06 from sisyphus
2022-Sep-22 10:02:40 :: created build repo
2022-Sep-22 10:02:40 :: [i586] #200 java-17-openjdk-17.0.4.0.8-alt0.p10.1.src.rpm: build start
2022-Sep-22 10:02:40 :: [ppc64le] #200 java-17-openjdk-17.0.4.0.8-alt0.p10.1.src.rpm: build start
2022-Sep-22 10:02:40 :: [x86_64] #200 java-17-openjdk-17.0.4.0.8-alt0.p10.1.src.rpm: build start
2022-Sep-22 10:02:40 :: [armh] #200 java-17-openjdk-17.0.4.0.8-alt0.p10.1.src.rpm: build start
2022-Sep-22 10:02:40 :: [aarch64] #200 java-17-openjdk-17.0.4.0.8-alt0.p10.1.src.rpm: build start
2022-Sep-22 10:02:52 :: [i586] #200 java-17-openjdk-17.0.4.0.8-alt0.p10.1.src.rpm: build OK (cached)
2022-Sep-22 10:02:52 :: [i586] #300 java-atk-wrapper-0.38.0-alt2_6jpp11.src.rpm: build start
2022-Sep-22 10:02:53 :: [x86_64] #200 java-17-openjdk-17.0.4.0.8-alt0.p10.1.src.rpm: build OK (cached)
2022-Sep-22 10:02:53 :: [x86_64] #300 java-atk-wrapper-0.38.0-alt2_6jpp11.src.rpm: build start
2022-Sep-22 10:03:02 :: [i586] #300 java-atk-wrapper-0.38.0-alt2_6jpp11.src.rpm: build OK (cached)
2022-Sep-22 10:03:02 :: [i586] #400 jtoaster-1.0.5-alt4_12jpp11.src.rpm: build start
2022-Sep-22 10:03:03 :: [x86_64] #300 java-atk-wrapper-0.38.0-alt2_6jpp11.src.rpm: build OK (cached)
2022-Sep-22 10:03:03 :: [x86_64] #400 jtoaster-1.0.5-alt4_12jpp11.src.rpm: build start
2022-Sep-22 10:03:03 :: [aarch64] #200 java-17-openjdk-17.0.4.0.8-alt0.p10.1.src.rpm: build OK (cached)
2022-Sep-22 10:03:03 :: [aarch64] #300 java-atk-wrapper-0.38.0-alt2_6jpp11.src.rpm: build start
2022-Sep-22 10:03:05 :: [ppc64le] #200 java-17-openjdk-17.0.4.0.8-alt0.p10.1.src.rpm: build OK (cached)
2022-Sep-22 10:03:05 :: [ppc64le] #300 java-atk-wrapper-0.38.0-alt2_6jpp11.src.rpm: build start
2022-Sep-22 10:03:11 :: [i586] #400 jtoaster-1.0.5-alt4_12jpp11.src.rpm: build OK (cached)
2022-Sep-22 10:03:11 :: [i586] #500 mckoi-1.0.4-alt4_17jpp11.src.rpm: build start
2022-Sep-22 10:03:12 :: [x86_64] #400 jtoaster-1.0.5-alt4_12jpp11.src.rpm: build OK (cached)
2022-Sep-22 10:03:12 :: [x86_64] #500 mckoi-1.0.4-alt4_17jpp11.src.rpm: build start
2022-Sep-22 10:03:20 :: [i586] #500 mckoi-1.0.4-alt4_17jpp11.src.rpm: build OK (cached)
2022-Sep-22 10:03:20 :: [i586] #700 freeplane-1.3.15-alt6_7jpp8.src.rpm: build start
2022-Sep-22 10:03:22 :: [x86_64] #500 mckoi-1.0.4-alt4_17jpp11.src.rpm: build OK (cached)
2022-Sep-22 10:03:22 :: [x86_64] #700 freeplane-1.3.15-alt6_7jpp8.src.rpm: build start
2022-Sep-22 10:03:23 :: [armh] #200 java-17-openjdk-17.0.4.0.8-alt0.p10.1.src.rpm: build SKIPPED
2022-Sep-22 10:03:23 :: [armh] #300 java-atk-wrapper-0.38.0-alt2_6jpp11.src.rpm: build start
2022-Sep-22 10:03:24 :: [aarch64] #300 java-atk-wrapper-0.38.0-alt2_6jpp11.src.rpm: build OK (cached)
2022-Sep-22 10:03:24 :: [aarch64] #400 jtoaster-1.0.5-alt4_12jpp11.src.rpm: build start
2022-Sep-22 10:03:29 :: [ppc64le] #300 java-atk-wrapper-0.38.0-alt2_6jpp11.src.rpm: build OK (cached)
2022-Sep-22 10:03:29 :: [ppc64le] #400 jtoaster-1.0.5-alt4_12jpp11.src.rpm: build start
2022-Sep-22 10:03:30 :: [i586] #700 freeplane-1.3.15-alt6_7jpp8.src.rpm: build OK (cached)
2022-Sep-22 10:03:30 :: [i586] #1000 jpcap.git jpcap-0.7-alt4: build start
2022-Sep-22 10:03:31 :: [x86_64] #700 freeplane-1.3.15-alt6_7jpp8.src.rpm: build OK (cached)
2022-Sep-22 10:03:31 :: [x86_64] #1000 jpcap.git jpcap-0.7-alt4: build start
2022-Sep-22 10:03:43 :: [aarch64] #400 jtoaster-1.0.5-alt4_12jpp11.src.rpm: build OK (cached)
2022-Sep-22 10:03:43 :: [aarch64] #500 mckoi-1.0.4-alt4_17jpp11.src.rpm: build start
2022-Sep-22 10:03:49 :: [ppc64le] #400 jtoaster-1.0.5-alt4_12jpp11.src.rpm: build OK (cached)
2022-Sep-22 10:03:49 :: [ppc64le] #500 mckoi-1.0.4-alt4_17jpp11.src.rpm: build start
[i586] rm libjpcap.so
[i586] rm: cannot remove 'libjpcap.so': No such file or directory
[i586] make: [Makefile:56: clean] Error 1 (ignored)
[i586] --
[i586]     [javac] warning: [options] bootstrap class path not set in conjunction with -source 6
[i586]     [javac] error: Source option 6 is no longer supported. Use 7 or later.
[i586]     [javac] error: Target option 6 is no longer supported. Use 7 or later.
[i586] BUILD FAILED
[i586] /usr/src/RPM/BUILD/jpcap-0.7/build.xml:29: Compile failed; see the compiler error output for details.
2022-Sep-22 10:03:55 :: [i586] jpcap.git jpcap-0.7-alt4: remote: build failed
[x86_64] rm libjpcap.so
[x86_64] rm: cannot remove 'libjpcap.so': No such file or directory
[x86_64] make: [Makefile:56: clean] Error 1 (ignored)
[x86_64] --
[x86_64]     [javac] warning: [options] bootstrap class path not set in conjunction with -source 6
[x86_64]     [javac] error: Source option 6 is no longer supported. Use 7 or later.
[x86_64]     [javac] error: Target option 6 is no longer supported. Use 7 or later.
[x86_64] BUILD FAILED
[x86_64] /usr/src/RPM/BUILD/jpcap-0.7/build.xml:29: Compile failed; see the compiler error output for details.
2022-Sep-22 10:03:55 :: [x86_64] jpcap.git jpcap-0.7-alt4: remote: build failed
2022-Sep-22 10:03:55 :: [i586] #1000 jpcap.git jpcap-0.7-alt4: build FAILED
2022-Sep-22 10:03:55 :: [x86_64] #1000 jpcap.git jpcap-0.7-alt4: build FAILED
2022-Sep-22 10:03:55 :: [i586] requesting cancellation of task processing
2022-Sep-22 10:03:56 :: [armh] #300 java-atk-wrapper-0.38.0-alt2_6jpp11.src.rpm: build OK (cached)
2022-Sep-22 10:03:56 :: [armh] task processing CANCELLED
2022-Sep-22 10:04:02 :: [aarch64] #500 mckoi-1.0.4-alt4_17jpp11.src.rpm: build OK (cached)
2022-Sep-22 10:04:02 :: [aarch64] task processing CANCELLED
2022-Sep-22 10:04:10 :: [ppc64le] #500 mckoi-1.0.4-alt4_17jpp11.src.rpm: build OK (cached)
2022-Sep-22 10:04:10 :: [ppc64le] task processing CANCELLED
2022-Sep-22 10:03:55 :: [x86_64] build FAILED
2022-Sep-22 10:03:55 :: [i586] build FAILED
2022-Sep-22 10:03:56 :: [armh] build FAILED
2022-Sep-22 10:04:02 :: [aarch64] build FAILED
2022-Sep-22 10:04:10 :: [ppc64le] build FAILED
2022-Sep-22 10:04:10 :: task #305235 for p10 FAILED


^ permalink raw reply	[flat|nested] 14+ messages in thread

* [#305235] p10 FAILED (try 7) srpm=java-17-openjdk-17.0.4.0.8-alt0.p10.1.src.rpm ...
  2022-08-13 19:31 [#305235] p10 FAILED srpm=java-17-openjdk-17.0.4.0.8-alt1.src.rpm Girar awaiter (cas)
                   ` (4 preceding siblings ...)
  2022-09-22 10:04 ` [#305235] [test-only] p10 FAILED (try 6) srpm=java-17-openjdk-17.0.4.0.8-alt0.p10.1.src.rpm Girar awaiter (cas)
@ 2022-09-22 15:02 ` Girar awaiter (cas)
  2022-09-22 15:41 ` [#305235] p10 EPERM (try 8) srpm=java-17-openjdk-17.0.4.0.8-alt0.p10.1.src.rpm Girar awaiter (cas)
                   ` (6 subsequent siblings)
  12 siblings, 0 replies; 14+ messages in thread
From: Girar awaiter (cas) @ 2022-09-22 15:02 UTC (permalink / raw)
  To: Andrey Cherepanov
  Cc: girar-builder-p10, sisyphus-incominger, girar-builder-p10

https://git.altlinux.org/tasks/305235/logs/events.7.1.log

subtask  name       aarch64   armh   i586  ppc64le  x86_64
   #400  jtoaster        51   1:20     32       57      30
   #500  mckoi         1:20   2:17     49     1:30      44
   #700  freeplane     1:03   8:51     39     1:24      36
  #1100  trove4j         55   1:35     34     1:02      31
  #1200  jpcap           56   1:26     35     1:03      33
  #1300  protobuf      8:10  11:40  14:43    11:36   12:36

2022-Sep-22 14:31:02 :: task #305235 for p10 resumed by cas:
2022-Sep-22 14:31:02 :: message: Bootstrap_is_finished_in_305236
#100 removed
#200 build java-17-openjdk-17.0.4.0.8-alt0.p10.1.src.rpm
#300 build java-atk-wrapper-0.38.0-alt2_6jpp11.src.rpm from sisyphus
#400 build jtoaster-1.0.5-alt4_12jpp11.src.rpm from sisyphus
#500 build mckoi-1.0.4-alt4_17jpp11.src.rpm from sisyphus
#600 removed
#700 build freeplane-1.3.15-alt6_7jpp8.src.rpm from sisyphus
#1000 removed
#1100 build 3.0.3-alt2 from /gears/t/trove4j.git fetched at 2022-Sep-22 10:00:06 from sisyphus
#1200 build 0.7-alt5 from /people/cas/packages/jpcap.git fetched at 2022-Sep-22 14:27:49
#1300 build 3.16.0-alt1.p10.1 from /people/cas/packages/protobuf.git fetched at 2022-Sep-22 14:30:53
2022-Sep-22 14:31:03 :: created build repo
2022-Sep-22 14:31:03 :: #400: force rebuild
2022-Sep-22 14:31:03 :: #500: force rebuild
2022-Sep-22 14:31:03 :: #700: force rebuild
2022-Sep-22 14:31:03 :: [armh] #200 java-17-openjdk-17.0.4.0.8-alt0.p10.1.src.rpm: build start
2022-Sep-22 14:31:03 :: [ppc64le] #200 java-17-openjdk-17.0.4.0.8-alt0.p10.1.src.rpm: build start
2022-Sep-22 14:31:03 :: [aarch64] #200 java-17-openjdk-17.0.4.0.8-alt0.p10.1.src.rpm: build start
2022-Sep-22 14:31:03 :: [i586] #200 java-17-openjdk-17.0.4.0.8-alt0.p10.1.src.rpm: build start
2022-Sep-22 14:31:03 :: [x86_64] #200 java-17-openjdk-17.0.4.0.8-alt0.p10.1.src.rpm: build start
2022-Sep-22 14:31:23 :: [x86_64] #200 java-17-openjdk-17.0.4.0.8-alt0.p10.1.src.rpm: build OK (cached)
2022-Sep-22 14:31:23 :: [x86_64] #300 java-atk-wrapper-0.38.0-alt2_6jpp11.src.rpm: build start
2022-Sep-22 14:31:24 :: [i586] #200 java-17-openjdk-17.0.4.0.8-alt0.p10.1.src.rpm: build OK (cached)
2022-Sep-22 14:31:24 :: [i586] #300 java-atk-wrapper-0.38.0-alt2_6jpp11.src.rpm: build start
2022-Sep-22 14:31:27 :: [aarch64] #200 java-17-openjdk-17.0.4.0.8-alt0.p10.1.src.rpm: build OK (cached)
2022-Sep-22 14:31:27 :: [aarch64] #300 java-atk-wrapper-0.38.0-alt2_6jpp11.src.rpm: build start
2022-Sep-22 14:31:29 :: [ppc64le] #200 java-17-openjdk-17.0.4.0.8-alt0.p10.1.src.rpm: build OK (cached)
2022-Sep-22 14:31:29 :: [ppc64le] #300 java-atk-wrapper-0.38.0-alt2_6jpp11.src.rpm: build start
2022-Sep-22 14:31:33 :: [x86_64] #300 java-atk-wrapper-0.38.0-alt2_6jpp11.src.rpm: build OK (cached)
2022-Sep-22 14:31:33 :: [x86_64] #400 jtoaster-1.0.5-alt4_12jpp11.src.rpm: build start
2022-Sep-22 14:31:33 :: [i586] #300 java-atk-wrapper-0.38.0-alt2_6jpp11.src.rpm: build OK (cached)
2022-Sep-22 14:31:33 :: [i586] #400 jtoaster-1.0.5-alt4_12jpp11.src.rpm: build start
2022-Sep-22 14:31:42 :: [armh] #200 java-17-openjdk-17.0.4.0.8-alt0.p10.1.src.rpm: build SKIPPED
2022-Sep-22 14:31:42 :: [armh] #300 java-atk-wrapper-0.38.0-alt2_6jpp11.src.rpm: build start
2022-Sep-22 14:31:48 :: [aarch64] #300 java-atk-wrapper-0.38.0-alt2_6jpp11.src.rpm: build OK (cached)
2022-Sep-22 14:31:48 :: [aarch64] #400 jtoaster-1.0.5-alt4_12jpp11.src.rpm: build start
2022-Sep-22 14:31:54 :: [ppc64le] #300 java-atk-wrapper-0.38.0-alt2_6jpp11.src.rpm: build OK (cached)
2022-Sep-22 14:31:54 :: [ppc64le] #400 jtoaster-1.0.5-alt4_12jpp11.src.rpm: build start
2022-Sep-22 14:32:03 :: [x86_64] #400 jtoaster-1.0.5-alt4_12jpp11.src.rpm: build OK
2022-Sep-22 14:32:03 :: [x86_64] #500 mckoi-1.0.4-alt4_17jpp11.src.rpm: build start
2022-Sep-22 14:32:05 :: [i586] #400 jtoaster-1.0.5-alt4_12jpp11.src.rpm: build OK
2022-Sep-22 14:32:05 :: [i586] #500 mckoi-1.0.4-alt4_17jpp11.src.rpm: build start
2022-Sep-22 14:32:13 :: [armh] #300 java-atk-wrapper-0.38.0-alt2_6jpp11.src.rpm: build OK (cached)
2022-Sep-22 14:32:13 :: [armh] #400 jtoaster-1.0.5-alt4_12jpp11.src.rpm: build start
2022-Sep-22 14:32:39 :: [aarch64] #400 jtoaster-1.0.5-alt4_12jpp11.src.rpm: build OK
2022-Sep-22 14:32:39 :: [aarch64] #500 mckoi-1.0.4-alt4_17jpp11.src.rpm: build start
2022-Sep-22 14:32:47 :: [x86_64] #500 mckoi-1.0.4-alt4_17jpp11.src.rpm: build OK
2022-Sep-22 14:32:47 :: [x86_64] #700 freeplane-1.3.15-alt6_7jpp8.src.rpm: build start
2022-Sep-22 14:32:51 :: [ppc64le] #400 jtoaster-1.0.5-alt4_12jpp11.src.rpm: build OK
2022-Sep-22 14:32:51 :: [ppc64le] #500 mckoi-1.0.4-alt4_17jpp11.src.rpm: build start
2022-Sep-22 14:32:54 :: [i586] #500 mckoi-1.0.4-alt4_17jpp11.src.rpm: build OK
2022-Sep-22 14:32:54 :: [i586] #700 freeplane-1.3.15-alt6_7jpp8.src.rpm: build start
2022-Sep-22 14:33:23 :: [x86_64] #700 freeplane-1.3.15-alt6_7jpp8.src.rpm: build OK
2022-Sep-22 14:33:23 :: [x86_64] #1100 trove4j.git 3.0.3-alt2: build start
2022-Sep-22 14:33:33 :: [armh] #400 jtoaster-1.0.5-alt4_12jpp11.src.rpm: build OK
2022-Sep-22 14:33:33 :: [armh] #500 mckoi-1.0.4-alt4_17jpp11.src.rpm: build start
2022-Sep-22 14:33:33 :: [i586] #700 freeplane-1.3.15-alt6_7jpp8.src.rpm: build OK
2022-Sep-22 14:33:33 :: [i586] #1100 trove4j.git 3.0.3-alt2: build start
2022-Sep-22 14:33:54 :: [x86_64] #1100 trove4j.git 3.0.3-alt2: build OK
2022-Sep-22 14:33:54 :: [x86_64] #1200 jpcap.git 0.7-alt5: build start
2022-Sep-22 14:33:59 :: [aarch64] #500 mckoi-1.0.4-alt4_17jpp11.src.rpm: build OK
2022-Sep-22 14:33:59 :: [aarch64] #700 freeplane-1.3.15-alt6_7jpp8.src.rpm: build start
2022-Sep-22 14:34:07 :: [i586] #1100 trove4j.git 3.0.3-alt2: build OK
2022-Sep-22 14:34:07 :: [i586] #1200 jpcap.git 0.7-alt5: build start
2022-Sep-22 14:34:21 :: [ppc64le] #500 mckoi-1.0.4-alt4_17jpp11.src.rpm: build OK
2022-Sep-22 14:34:21 :: [ppc64le] #700 freeplane-1.3.15-alt6_7jpp8.src.rpm: build start
2022-Sep-22 14:34:27 :: [x86_64] #1200 jpcap.git 0.7-alt5: build OK
2022-Sep-22 14:34:27 :: [x86_64] #1300 protobuf.git 3.16.0-alt1.p10.1: build start
2022-Sep-22 14:34:42 :: [i586] #1200 jpcap.git 0.7-alt5: build OK
2022-Sep-22 14:34:43 :: [i586] #1300 protobuf.git 3.16.0-alt1.p10.1: build start
2022-Sep-22 14:35:02 :: [aarch64] #700 freeplane-1.3.15-alt6_7jpp8.src.rpm: build OK
2022-Sep-22 14:35:02 :: [aarch64] #1100 trove4j.git 3.0.3-alt2: build start
2022-Sep-22 14:35:45 :: [ppc64le] #700 freeplane-1.3.15-alt6_7jpp8.src.rpm: build OK
2022-Sep-22 14:35:45 :: [ppc64le] #1100 trove4j.git 3.0.3-alt2: build start
2022-Sep-22 14:35:50 :: [armh] #500 mckoi-1.0.4-alt4_17jpp11.src.rpm: build OK
2022-Sep-22 14:35:50 :: [armh] #700 freeplane-1.3.15-alt6_7jpp8.src.rpm: build start
2022-Sep-22 14:35:57 :: [aarch64] #1100 trove4j.git 3.0.3-alt2: build OK
2022-Sep-22 14:35:57 :: [aarch64] #1200 jpcap.git 0.7-alt5: build start
2022-Sep-22 14:36:47 :: [ppc64le] #1100 trove4j.git 3.0.3-alt2: build OK
2022-Sep-22 14:36:47 :: [ppc64le] #1200 jpcap.git 0.7-alt5: build start
2022-Sep-22 14:36:53 :: [aarch64] #1200 jpcap.git 0.7-alt5: build OK
2022-Sep-22 14:36:53 :: [aarch64] #1300 protobuf.git 3.16.0-alt1.p10.1: build start
2022-Sep-22 14:37:50 :: [ppc64le] #1200 jpcap.git 0.7-alt5: build OK
2022-Sep-22 14:37:50 :: [ppc64le] #1300 protobuf.git 3.16.0-alt1.p10.1: build start
2022-Sep-22 14:44:41 :: [armh] #700 freeplane-1.3.15-alt6_7jpp8.src.rpm: build OK
2022-Sep-22 14:44:41 :: [armh] #1100 trove4j.git 3.0.3-alt2: build start
2022-Sep-22 14:45:03 :: [aarch64] #1300 protobuf.git 3.16.0-alt1.p10.1: build OK
2022-Sep-22 14:46:16 :: [armh] #1100 trove4j.git 3.0.3-alt2: build OK
2022-Sep-22 14:46:16 :: [armh] #1200 jpcap.git 0.7-alt5: build start
2022-Sep-22 14:47:03 :: [x86_64] #1300 protobuf.git 3.16.0-alt1.p10.1: build OK
2022-Sep-22 14:47:42 :: [armh] #1200 jpcap.git 0.7-alt5: build OK
2022-Sep-22 14:47:42 :: [armh] #1300 protobuf.git 3.16.0-alt1.p10.1: build start
2022-Sep-22 14:49:26 :: [i586] #1300 protobuf.git 3.16.0-alt1.p10.1: build OK
2022-Sep-22 14:49:26 :: [ppc64le] #1300 protobuf.git 3.16.0-alt1.p10.1: build OK
2022-Sep-22 14:59:22 :: [armh] #1300 protobuf.git 3.16.0-alt1.p10.1: build OK
2022-Sep-22 15:00:23 :: #200: java-17-openjdk-17.0.4.0.8-alt0.p10.1.src.rpm: build check OK
2022-Sep-22 15:00:36 :: #300: java-atk-wrapper-0.38.0-alt2_6jpp11.src.rpm: build check OK
2022-Sep-22 15:00:49 :: #400: jtoaster-1.0.5-alt4_12jpp11.src.rpm: build check OK
2022-Sep-22 15:01:07 :: #500: mckoi-1.0.4-alt4_17jpp11.src.rpm: build check OK
2022-Sep-22 15:01:17 :: #700: freeplane-1.3.15-alt6_7jpp8.src.rpm: build check OK
2022-Sep-22 15:01:26 :: #1100: trove4j.git 3.0.3-alt2: build check OK
2022-Sep-22 15:01:36 :: #1200: jpcap.git 0.7-alt5: package `jpcap' version `0.7-alt5' was built earlier for sisyphus from a different source: `gear:4d71436d974ffaffbcf8cda19072aa98dd670b7e'
2022-Sep-22 15:01:36 :: #1200: jpcap.git 0.7-alt5: source id check FAILED
2022-Sep-22 15:02:45 :: #1300: protobuf.git 3.16.0-alt1.p10.1: build check OK
2022-Sep-22 15:02:46 :: build check FAILED for: #1200 
2022-Sep-22 15:02:46 :: task #305235 for p10 FAILED


^ permalink raw reply	[flat|nested] 14+ messages in thread

* [#305235] p10 EPERM (try 8) srpm=java-17-openjdk-17.0.4.0.8-alt0.p10.1.src.rpm ...
  2022-08-13 19:31 [#305235] p10 FAILED srpm=java-17-openjdk-17.0.4.0.8-alt1.src.rpm Girar awaiter (cas)
                   ` (5 preceding siblings ...)
  2022-09-22 15:02 ` [#305235] p10 FAILED (try 7) srpm=java-17-openjdk-17.0.4.0.8-alt0.p10.1.src.rpm Girar awaiter (cas)
@ 2022-09-22 15:41 ` Girar awaiter (cas)
  2022-10-01 12:15 ` [#305235] [test-only] p10 FAILED (try 9) srpm=java-17-openjdk-17.0.4.0.8-alt0.p10.1.src.rpm Girar awaiter (cas)
                   ` (5 subsequent siblings)
  12 siblings, 0 replies; 14+ messages in thread
From: Girar awaiter (cas) @ 2022-09-22 15:41 UTC (permalink / raw)
  To: Andrey Cherepanov
  Cc: girar-builder-p10, sisyphus-incominger, girar-builder-p10

https://git.altlinux.org/tasks/305235/logs/events.8.1.log

subtask  name   aarch64  armh  i586  ppc64le  x86_64
  #1400  jpcap       58  2:16    40     1:07      36



^ permalink raw reply	[flat|nested] 14+ messages in thread

* [#305235] [test-only] p10 FAILED (try 9) srpm=java-17-openjdk-17.0.4.0.8-alt0.p10.1.src.rpm ...
  2022-08-13 19:31 [#305235] p10 FAILED srpm=java-17-openjdk-17.0.4.0.8-alt1.src.rpm Girar awaiter (cas)
                   ` (6 preceding siblings ...)
  2022-09-22 15:41 ` [#305235] p10 EPERM (try 8) srpm=java-17-openjdk-17.0.4.0.8-alt0.p10.1.src.rpm Girar awaiter (cas)
@ 2022-10-01 12:15 ` Girar awaiter (cas)
  2022-10-02 11:22 ` [#305235] p10 FAILED (try 10) srpm=java-17-openjdk-17.0.4.0.8-alt0.p10.1.src.rpm Girar awaiter (cas)
                   ` (4 subsequent siblings)
  12 siblings, 0 replies; 14+ messages in thread
From: Girar awaiter (cas) @ 2022-10-01 12:15 UTC (permalink / raw)
  To: Andrey Cherepanov
  Cc: girar-builder-p10, sisyphus-incominger, girar-builder-p10

https://git.altlinux.org/tasks/305235/logs/events.9.1.log

subtask  name  aarch64  armh  i586  ppc64le  x86_64
  #1500  jss         ?     ?     -        ?  failed

2022-Oct-01 12:13:41 :: test-only task #305235 for p10 resumed by cas:
2022-Oct-01 12:13:41 :: message: Bootstrap_is_finished_in_305236
#100 removed
#200 build java-17-openjdk-17.0.4.0.8-alt0.p10.1.src.rpm
#300 build java-atk-wrapper-0.38.0-alt2_6jpp11.src.rpm from sisyphus
#400 build jtoaster-1.0.5-alt4_12jpp11.src.rpm from sisyphus
#500 build mckoi-1.0.4-alt4_17jpp11.src.rpm from sisyphus
#600 removed
#700 build freeplane-1.3.15-alt6_7jpp8.src.rpm from sisyphus
#1000 removed
#1100 build 3.0.3-alt2 from /gears/t/trove4j.git fetched at 2022-Sep-22 10:00:06 from sisyphus
#1200 removed
#1300 build 3.16.0-alt1.p10.1 from /people/cas/packages/protobuf.git fetched at 2022-Sep-22 14:30:53
#1400 build 0.7-alt5 from /people/cas/packages/jpcap.git fetched at 2022-Sep-22 15:07:52
#1500 build 5.2.1-alt1 from /gears/j/jss.git fetched at 2022-Sep-30 16:17:44 from sisyphus
#1600 build 8.2.0-alt1 from /gears/t/tomcatjss.git fetched at 2022-Sep-30 16:18:06 from sisyphus
2022-Oct-01 12:13:42 :: created build repo
2022-Oct-01 12:13:42 :: [ppc64le] #200 java-17-openjdk-17.0.4.0.8-alt0.p10.1.src.rpm: build start
2022-Oct-01 12:13:42 :: [x86_64] #200 java-17-openjdk-17.0.4.0.8-alt0.p10.1.src.rpm: build start
2022-Oct-01 12:13:42 :: [aarch64] #200 java-17-openjdk-17.0.4.0.8-alt0.p10.1.src.rpm: build start
2022-Oct-01 12:13:42 :: [i586] #200 java-17-openjdk-17.0.4.0.8-alt0.p10.1.src.rpm: build start
2022-Oct-01 12:13:42 :: [armh] #200 java-17-openjdk-17.0.4.0.8-alt0.p10.1.src.rpm: build start
2022-Oct-01 12:13:58 :: [i586] #200 java-17-openjdk-17.0.4.0.8-alt0.p10.1.src.rpm: build OK (cached)
2022-Oct-01 12:13:58 :: [i586] #300 java-atk-wrapper-0.38.0-alt2_6jpp11.src.rpm: build start
2022-Oct-01 12:13:59 :: [x86_64] #200 java-17-openjdk-17.0.4.0.8-alt0.p10.1.src.rpm: build OK (cached)
2022-Oct-01 12:13:59 :: [x86_64] #300 java-atk-wrapper-0.38.0-alt2_6jpp11.src.rpm: build start
2022-Oct-01 12:14:08 :: [i586] #300 java-atk-wrapper-0.38.0-alt2_6jpp11.src.rpm: build OK (cached)
2022-Oct-01 12:14:08 :: [i586] #400 jtoaster-1.0.5-alt4_12jpp11.src.rpm: build start
2022-Oct-01 12:14:09 :: [x86_64] #300 java-atk-wrapper-0.38.0-alt2_6jpp11.src.rpm: build OK (cached)
2022-Oct-01 12:14:09 :: [x86_64] #400 jtoaster-1.0.5-alt4_12jpp11.src.rpm: build start
2022-Oct-01 12:14:13 :: [aarch64] #200 java-17-openjdk-17.0.4.0.8-alt0.p10.1.src.rpm: build OK (cached)
2022-Oct-01 12:14:13 :: [aarch64] #300 java-atk-wrapper-0.38.0-alt2_6jpp11.src.rpm: build start
2022-Oct-01 12:14:17 :: [i586] #400 jtoaster-1.0.5-alt4_12jpp11.src.rpm: build OK (cached)
2022-Oct-01 12:14:17 :: [i586] #500 mckoi-1.0.4-alt4_17jpp11.src.rpm: build start
2022-Oct-01 12:14:18 :: [x86_64] #400 jtoaster-1.0.5-alt4_12jpp11.src.rpm: build OK (cached)
2022-Oct-01 12:14:18 :: [x86_64] #500 mckoi-1.0.4-alt4_17jpp11.src.rpm: build start
2022-Oct-01 12:14:18 :: [ppc64le] #200 java-17-openjdk-17.0.4.0.8-alt0.p10.1.src.rpm: build OK (cached)
2022-Oct-01 12:14:19 :: [ppc64le] #300 java-atk-wrapper-0.38.0-alt2_6jpp11.src.rpm: build start
2022-Oct-01 12:14:26 :: [i586] #500 mckoi-1.0.4-alt4_17jpp11.src.rpm: build OK (cached)
2022-Oct-01 12:14:26 :: [i586] #700 freeplane-1.3.15-alt6_7jpp8.src.rpm: build start
2022-Oct-01 12:14:28 :: [x86_64] #500 mckoi-1.0.4-alt4_17jpp11.src.rpm: build OK (cached)
2022-Oct-01 12:14:28 :: [x86_64] #700 freeplane-1.3.15-alt6_7jpp8.src.rpm: build start
2022-Oct-01 12:14:30 :: [armh] #200 java-17-openjdk-17.0.4.0.8-alt0.p10.1.src.rpm: build SKIPPED
2022-Oct-01 12:14:30 :: [armh] #300 java-atk-wrapper-0.38.0-alt2_6jpp11.src.rpm: build start
2022-Oct-01 12:14:33 :: [aarch64] #300 java-atk-wrapper-0.38.0-alt2_6jpp11.src.rpm: build OK (cached)
2022-Oct-01 12:14:33 :: [aarch64] #400 jtoaster-1.0.5-alt4_12jpp11.src.rpm: build start
2022-Oct-01 12:14:36 :: [i586] #700 freeplane-1.3.15-alt6_7jpp8.src.rpm: build OK (cached)
2022-Oct-01 12:14:36 :: [i586] #1100 trove4j.git 3.0.3-alt2: build start
2022-Oct-01 12:14:37 :: [x86_64] #700 freeplane-1.3.15-alt6_7jpp8.src.rpm: build OK (cached)
2022-Oct-01 12:14:37 :: [x86_64] #1100 trove4j.git 3.0.3-alt2: build start
2022-Oct-01 12:14:40 :: [ppc64le] #300 java-atk-wrapper-0.38.0-alt2_6jpp11.src.rpm: build OK (cached)
2022-Oct-01 12:14:40 :: [ppc64le] #400 jtoaster-1.0.5-alt4_12jpp11.src.rpm: build start
2022-Oct-01 12:14:45 :: [i586] #1100 trove4j.git 3.0.3-alt2: build OK (cached)
2022-Oct-01 12:14:45 :: [i586] #1300 protobuf.git 3.16.0-alt1.p10.1: build start
2022-Oct-01 12:14:47 :: [x86_64] #1100 trove4j.git 3.0.3-alt2: build OK (cached)
2022-Oct-01 12:14:47 :: [x86_64] #1300 protobuf.git 3.16.0-alt1.p10.1: build start
2022-Oct-01 12:14:52 :: [aarch64] #400 jtoaster-1.0.5-alt4_12jpp11.src.rpm: build OK (cached)
2022-Oct-01 12:14:52 :: [aarch64] #500 mckoi-1.0.4-alt4_17jpp11.src.rpm: build start
2022-Oct-01 12:14:56 :: [i586] #1300 protobuf.git 3.16.0-alt1.p10.1: build OK (cached)
2022-Oct-01 12:14:56 :: [i586] #1400 jpcap.git 0.7-alt5: build start
2022-Oct-01 12:14:57 :: [x86_64] #1300 protobuf.git 3.16.0-alt1.p10.1: build OK (cached)
2022-Oct-01 12:14:57 :: [x86_64] #1400 jpcap.git 0.7-alt5: build start
2022-Oct-01 12:15:00 :: [armh] #300 java-atk-wrapper-0.38.0-alt2_6jpp11.src.rpm: build OK (cached)
2022-Oct-01 12:15:00 :: [armh] #400 jtoaster-1.0.5-alt4_12jpp11.src.rpm: build start
2022-Oct-01 12:15:01 :: [ppc64le] #400 jtoaster-1.0.5-alt4_12jpp11.src.rpm: build OK (cached)
2022-Oct-01 12:15:01 :: [ppc64le] #500 mckoi-1.0.4-alt4_17jpp11.src.rpm: build start
2022-Oct-01 12:15:05 :: [i586] #1400 jpcap.git 0.7-alt5: build OK (cached)
2022-Oct-01 12:15:05 :: [i586] #1500 jss.git 5.2.1-alt1: build start
2022-Oct-01 12:15:07 :: [x86_64] #1400 jpcap.git 0.7-alt5: build OK (cached)
2022-Oct-01 12:15:07 :: [x86_64] #1500 jss.git 5.2.1-alt1: build start
2022-Oct-01 12:15:14 :: [aarch64] #500 mckoi-1.0.4-alt4_17jpp11.src.rpm: build OK (cached)
2022-Oct-01 12:15:14 :: [aarch64] #700 freeplane-1.3.15-alt6_7jpp8.src.rpm: build start
2022-Oct-01 12:15:14 :: [i586] #1500 jss.git 5.2.1-alt1: build SKIPPED
2022-Oct-01 12:15:14 :: [i586] #1600 tomcatjss.git 8.2.0-alt1: build start
[x86_64] <13>Oct  1 12:15:16 rpmi: rpm-macros-java-1:5.3.0-alt1_15jpp11 sisyphus+278038.500.1.3 1625987751 installed
[x86_64] <13>Oct  1 12:15:16 rpmi: rpm-macros-cmake-3.20.5-alt1 sisyphus+277391.100.2.1 1625533880 installed
[x86_64] Reading Package Lists...
[x86_64] Building Dependency Tree...
[x86_64] MI2a: mark gcc-c++
[x86_64] MI2a:  target gcc10-c++
[x86_64] MI2a:   mark gcc10-c++
[x86_64] MI2a:    target libstdc++10-devel
[x86_64] MI2a:     mark libstdc++10-devel
[x86_64] MI2a:      target gcc-c++-common
[x86_64] MI2a:       mark gcc-c++-common
[x86_64] MI2a: mark jaxb-api
[x86_64] MI2a:  target javapackages-filesystem
[x86_64] MI2a:   mark javapackages-filesystem
[x86_64] MI2a: mark cmake
[x86_64] MI2a:  target libarchive.so.13()(64bit)
[x86_64] MI2a:   mark libarchive13
[x86_64] MI2a:    target libcrypto.so.1.1()(64bit)
[x86_64] MI2a:     mark libcrypto1.1
[x86_64] MI2a:      target ca-certificates
[x86_64] MI2a:       mark ca-certificates
[x86_64] MI2a:        target ca-trust
[x86_64] MI2a:         mark ca-trust
[x86_64] MI2a:          target p11-kit-trust
[x86_64] MI2a:           mark p11-kit-trust
[x86_64] MI2a:            target /etc/alternatives/packages.d
[x86_64] MI2a:             mark alternatives
[x86_64] MI2a:              target rpm-macros-alternatives
[x86_64] MI2a:               mark rpm-macros-alternatives
[x86_64] MI2a:            target libtasn1.so.6()(64bit)
[x86_64] MI2a:             mark libtasn1
[x86_64] MI2a:            target libp11-kit
[x86_64] MI2a:             mark libp11-kit
[x86_64] MI2a:  target libcurl.so.4()(64bit)
[x86_64] MI2a:   mark libcurl
[x86_64] MI2a:    target libbrotlidec.so.1()(64bit)
[x86_64] MI2a:     mark libbrotlidec
[x86_64] MI2a:      target libbrotlicommon
[x86_64] MI2a:       mark libbrotlicommon
[x86_64] MI2a:    target libgssapi_krb5.so.2()(64bit)
[x86_64] MI2a:     mark libkrb5
[x86_64] MI2a:      target libcom_err.so.2()(64bit)
[x86_64] MI2a:       mark libcom_err
[x86_64] MI2a:      target libkeyutils.so.1()(64bit)
[x86_64] MI2a:       mark libkeyutils
[x86_64] MI2a:      target liblmdb.so.0()(64bit)
[x86_64] MI2a:       mark liblmdb
[x86_64] MI2a:      target libssl.so.1.1()(64bit)
[x86_64] MI2a:       mark libssl1.1
[x86_64] MI2a:      target libverto.so.1()(64bit)
[x86_64] MI2a:       mark libverto
[x86_64] MI2a:    target libidn2.so.0()(64bit)
[x86_64] MI2a:     mark libidn2
[x86_64] MI2a:    target liblber-2.4.so.2()(64bit)
[x86_64] MI2a:     mark libldap
[x86_64] MI2a:      target libsasl2.so.3()(64bit)
[x86_64] MI2a:       mark libsasl2-3
[x86_64] MI2a:      target openldap-common
[x86_64] MI2a:       mark openldap-common
[x86_64] MI2a:    target libnghttp2.so.14()(64bit)
[x86_64] MI2a:     mark libnghttp2
[x86_64] MI2a:    target libpsl.so.5()(64bit)
[x86_64] MI2a:     mark libpsl
[x86_64] MI2a:      target publicsuffix-list-dafsa
[x86_64] MI2a:       mark publicsuffix-list-dafsa
[x86_64] MI2a:  target libexpat.so.1()(64bit)
[x86_64] MI2a:   mark libexpat
[x86_64] MI2a:  target libjsoncpp.so.19()(64bit)
[x86_64] MI2a:   mark libjsoncpp19
[x86_64] MI2a:  target librhash.so.0()(64bit)
[x86_64] MI2a:   mark librhash
[x86_64] MI2a:  target libuv.so.1()(64bit)
[x86_64] MI2a:   mark libuv
[x86_64] MI2a:  target cmake-modules
[x86_64] MI2a:   mark cmake-modules
[x86_64] MI2a: mark java-17-openjdk-devel
[x86_64] MI2a:  target java-17-openjdk
[x86_64] MI2a:   mark java-17-openjdk
[x86_64] MI2a:    target fontconfig
[x86_64] MI2a:     mark fontconfig
[x86_64] MI2a:      target libfreetype.so.6()(64bit)
[x86_64] MI2a:       mark libfreetype
[x86_64] MI2a:        target libharfbuzz
[x86_64] MI2a:         mark libharfbuzz
[x86_64] MI2a:          target libgraphite2.so.3()(64bit)
[x86_64] MI2a:           mark libgraphite2
[x86_64] MI2a:        target libpng16.so.16()(64bit)
[x86_64] MI2a:         mark libpng16
[x86_64] MI2a:    target fonts-type1-xorg
[x86_64] MI2a:     mark fonts-type1-xorg
[x86_64] MI2a:    target libXcomposite
[x86_64] MI2a:     mark libXcomposite
[x86_64] MI2a:      target libX11.so.6()(64bit)
[x86_64] MI2a:       mark libX11
[x86_64] MI2a:        target libxcb.so.1()(64bit)
[x86_64] MI2a:         mark libxcb
[x86_64] MI2a:          target libXau.so.6()(64bit)
[x86_64] MI2a:           mark libXau
[x86_64] MI2a:          target libXdmcp.so.6()(64bit)
[x86_64] MI2a:           mark libXdmcp
[x86_64] MI2a:        target libX11-locales
[x86_64] MI2a:         mark libX11-locales
[x86_64] MI2a:    target gtk3-demo
[x86_64] MI2a:     mark gtk3-demo
[x86_64] MI2a:      target libcairo.so.2()(64bit)
[x86_64] MI2a:       mark libcairo
[x86_64] MI2a:        target libEGL.so.1()(64bit)
[x86_64] MI2a:         mark libEGL
[x86_64] MI2a:          target libEGL-mesa
[x86_64] MI2a:           mark libEGL-mesa
[x86_64] MI2a:            target libdrm.so.2()(64bit)
[x86_64] MI2a:             mark libdrm
[x86_64] MI2a:              target libpciaccess.so.0()(64bit)
[x86_64] MI2a:               mark libpciaccess
[x86_64] MI2a:            target libwayland-client.so.0()(64bit)
[x86_64] MI2a:             mark libwayland-client
[x86_64] MI2a:            target libwayland-server.so.0()(64bit)
[x86_64] MI2a:             mark libwayland-server
[x86_64] MI2a:            target libGLX-mesa
[x86_64] MI2a:             mark libGLX-mesa
[x86_64] MI2a:              target libXext.so.6()(64bit)
[x86_64] MI2a:               mark libXext
[x86_64] MI2a:              target libXfixes.so.3()(64bit)
[x86_64] MI2a:               mark libXfixes
[x86_64] MI2a:              target libXxf86vm.so.1()(64bit)
[x86_64] MI2a:               mark libXxf86vm
[x86_64] MI2a:              target libxshmfence.so.1()(64bit)
[x86_64] MI2a:               mark libxshmfence
[x86_64] MI2a:            target libgbm
[x86_64] MI2a:             mark libgbm
[x86_64] MI2a:          target libglvnd
[x86_64] MI2a:           mark libglvnd
[x86_64] MI2a:        target libGL.so.1()(64bit)
[x86_64] MI2a:         mark libGL
[x86_64] MI2a:          target libGLX
[x86_64] MI2a:           mark libGLX
[x86_64] MI2a:        target libXrender.so.1()(64bit)
[x86_64] MI2a:         mark libXrender
[x86_64] MI2a:        target libpixman-1.so.0()(64bit)
[x86_64] MI2a:         mark libpixman
[x86_64] MI2a:      target libepoxy.so.0()(64bit)
[x86_64] MI2a:       mark libepoxy
[x86_64] MI2a:      target libgdk_pixbuf-2.0.so.0()(64bit)
[x86_64] MI2a:       mark libgdk-pixbuf
[x86_64] MI2a:        target libgdk-pixbuf-locales
[x86_64] MI2a:         mark libgdk-pixbuf-locales
[x86_64] MI2a:        target libgio-2.0.so.0()(64bit)
[x86_64] MI2a:         mark libgio
[x86_64] MI2a:          target gsettings-desktop-schemas
[x86_64] MI2a:           mark gsettings-desktop-schemas
[x86_64] MI2a:            target gsettings-desktop-schemas-data
[x86_64] MI2a:             mark gsettings-desktop-schemas-data
[x86_64] MI2a:          target shared-mime-info
[x86_64] MI2a:           mark shared-mime-info
[x86_64] MI2a:        target libjpeg.so.62()(64bit)
[x86_64] MI2a:         mark libjpeg
[x86_64] MI2a:        target libtiff.so.5()(64bit)
[x86_64] MI2a:         mark libtiff5
[x86_64] MI2a:          target libjbig.so.1.6()(64bit)
[x86_64] MI2a:           mark libjbig
[x86_64] MI2a:          target libwebp.so.7()(64bit)
[x86_64] MI2a:           mark libwebp7
[x86_64] MI2a:      target libpango-1.0.so.0()(64bit)
[x86_64] MI2a:       mark libpango
[x86_64] MI2a:        target libXft.so.2()(64bit)
[x86_64] MI2a:         mark libXft
[x86_64] MI2a:        target libfribidi.so.0()(64bit)
[x86_64] MI2a:         mark libfribidi
[x86_64] MI2a:        target libthai.so.0()(64bit)
[x86_64] MI2a:         mark libthai
[x86_64] MI2a:          target libdatrie.so.1()(64bit)
[x86_64] MI2a:           mark libdatrie
[x86_64] MI2a:      target libgtk+3
[x86_64] MI2a:       mark libgtk+3
[x86_64] MI2a:        target icon-theme-adwaita
[x86_64] MI2a:         mark icon-theme-adwaita
[x86_64] MI2a:          target icon-naming-utils
[x86_64] MI2a:           mark icon-naming-utils
[x86_64] MI2a:            target perl(XML/Simple.pm)
[x86_64] MI2a:             mark perl-XML-Simple
[x86_64] MI2a:              target perl(XML/NamespaceSupport.pm)
[x86_64] MI2a:               mark perl-XML-NamespaceSupport
[x86_64] MI2a:              target perl(XML/SAX.pm)
[x86_64] MI2a:               mark perl-XML-SAX
[x86_64] MI2a:                target perl(XML/LibXML/SAX.pm)
[x86_64] MI2a:                 mark perl-XML-LibXML
[x86_64] MI2a:                  target perl(Encode.pm)
[x86_64] MI2a:                   mark perl-Encode
[x86_64] MI2a:                    target perl(Filter/Util/Call.pm)
[x86_64] MI2a:                     mark perl-Filter
[x86_64] MI2a:                  target perl(XML/SAX/Base.pm)
[x86_64] MI2a:                   mark perl-XML-SAX-Base
[x86_64] MI2a:                target perl(LWP/UserAgent.pm)
[x86_64] MI2a:                 mark perl-libwww
[x86_64] MI2a:                  target perl(Data/Dump.pm)
[x86_64] MI2a:                   mark perl-Data-Dump
[x86_64] MI2a:                    target perl(Term/ANSIColor.pm)
[x86_64] MI2a:                     mark perl-Term-ANSIColor
[x86_64] MI2a:                  target perl(Encode/Locale.pm)
[x86_64] MI2a:                   mark perl-Encode-Locale
[x86_64] MI2a:                  target perl(File/Listing.pm)
[x86_64] MI2a:                   mark perl-File-Listing
[x86_64] MI2a:                    target perl(HTTP/Date.pm)
[x86_64] MI2a:                     mark perl-HTTP-Date
[x86_64] MI2a:                  target perl(HTML/Entities.pm)
[x86_64] MI2a:                   mark perl-HTML-Parser
[x86_64] MI2a:                    target perl(HTML/Tagset.pm)
[x86_64] MI2a:                     mark perl-HTML-Tagset
[x86_64] MI2a:                    target perl(URI.pm)
[x86_64] MI2a:                     mark perl-URI
[x86_64] MI2a:                      target perl(Net/Domain.pm)
[x86_64] MI2a:                       mark perl-libnet
[x86_64] MI2a:                  target perl(HTTP/Config.pm)
[x86_64] MI2a:                   mark perl-HTTP-Message
[x86_64] MI2a:                    target perl(IO/Compress/Bzip2.pm)
[x86_64] MI2a:                     mark perl-IO-Compress
[x86_64] MI2a:                      target perl(Compress/Raw/Bzip2.pm)
[x86_64] MI2a:                       mark perl-Compress-Raw-Bzip2
[x86_64] MI2a:                      target perl(Compress/Raw/Zlib.pm)
[x86_64] MI2a:                       mark perl-Compress-Raw-Zlib
[x86_64] MI2a:                    target perl(IO/HTML.pm)
[x86_64] MI2a:                     mark perl-IO-HTML
[x86_64] MI2a:                    target perl(LWP/MediaTypes.pm)
[x86_64] MI2a:                     mark perl-LWP-MediaTypes
[x86_64] MI2a:                  target perl(HTTP/Cookies.pm)
[x86_64] MI2a:                   mark perl-HTTP-Cookies
[x86_64] MI2a:                  target perl(HTTP/Negotiate.pm)
[x86_64] MI2a:                   mark perl-HTTP-Negotiate
[x86_64] MI2a:                  target perl(Net/HTTP.pm)
[x86_64] MI2a:                   mark perl-Net-HTTP
[x86_64] MI2a:                    target perl(IO/Socket/IP.pm)
[x86_64] MI2a:                     mark perl-IO-Socket-IP
[x86_64] MI2a:                  target perl(Try/Tiny.pm)
[x86_64] MI2a:                   mark perl-Try-Tiny
[x86_64] MI2a:                  target perl(WWW/RobotRules.pm)
[x86_64] MI2a:                   mark perl-WWW-RobotRules
[x86_64] MI2a:        target gtk+3-themes-incompatible
[x86_64] MI2a:         mark gtk+3-themes-incompatible
[x86_64] MI2a:        target colord
[x86_64] MI2a:         mark colord
[x86_64] MI2a:          target /lib/udev/rules.d
[x86_64] MI2a:           mark udev
[x86_64] MI2a:            target dmsetup
[x86_64] MI2a:             mark dmsetup
[x86_64] MI2a:              target lsblk
[x86_64] MI2a:               mark lsblk
[x86_64] MI2a:              target libdevmapper
[x86_64] MI2a:               mark libdevmapper
[x86_64] MI2a:            target kmod
[x86_64] MI2a:             mark kmod
[x86_64] MI2a:              target libkmod
[x86_64] MI2a:               mark libkmod
[x86_64] MI2a:            target losetup
[x86_64] MI2a:             mark losetup
[x86_64] MI2a:              target hashalot
[x86_64] MI2a:               mark hashalot
[x86_64] MI2a:            target mount
[x86_64] MI2a:             mark mount
[x86_64] MI2a:          target libgudev-1.0.so.0()(64bit)
[x86_64] MI2a:           mark libgudev
[x86_64] MI2a:          target libgusb.so.2()(64bit)
[x86_64] MI2a:           mark libgusb
[x86_64] MI2a:            target libusb-1.0.so.0()(64bit)
[x86_64] MI2a:             mark libusb
[x86_64] MI2a:          target liblcms2.so.2()(64bit)
[x86_64] MI2a:           mark liblcms2
[x86_64] MI2a:          target libpolkit-gobject-1.so.0()(64bit)
[x86_64] MI2a:           mark libpolkit
[x86_64] MI2a:            target libsystemd.so.0()(64bit)
[x86_64] MI2a:             mark libsystemd
[x86_64] MI2a:              target libgcrypt.so.20()(64bit)
[x86_64] MI2a:               mark libgcrypt20
[x86_64] MI2a:                target libgpg-error.so.0()(64bit)
[x86_64] MI2a:                 mark libgpg-error
[x86_64] MI2a:              target liblz4.so.1()(64bit)
[x86_64] MI2a:               mark liblz4
[x86_64] MI2a:          target libsqlite3.so.0()(64bit)
[x86_64] MI2a:           mark libsqlite3
[x86_64] MI2a:          target libcolord
[x86_64] MI2a:           mark libcolord
[x86_64] MI2a:        target libXcursor.so.1()(64bit)
[x86_64] MI2a:         mark libXcursor
[x86_64] MI2a:        target libXdamage.so.1()(64bit)
[x86_64] MI2a:         mark libXdamage
[x86_64] MI2a:        target libXi.so.6()(64bit)
[x86_64] MI2a:         mark libXi
[x86_64] MI2a:        target libXinerama.so.1()(64bit)
[x86_64] MI2a:         mark libXinerama
[x86_64] MI2a:        target libXrandr.so.2()(64bit)
[x86_64] MI2a:         mark libXrandr
[x86_64] MI2a:        target libatk-1.0.so.0()(64bit)
[x86_64] MI2a:         mark libatk
[x86_64] MI2a:          target libatk-locales
[x86_64] MI2a:           mark libatk-locales
[x86_64] MI2a:        target libatk-bridge-2.0.so.0()(64bit)
[x86_64] MI2a:         mark at-spi2-atk
[x86_64] MI2a:          target at-spi2-core
[x86_64] MI2a:           mark at-spi2-core
[x86_64] MI2a:            target dbus-tools-gui
[x86_64] MI2a:             mark dbus-tools-gui
[x86_64] MI2a:              target dbus
[x86_64] MI2a:               mark dbus
[x86_64] MI2a:                target dbus-tools
[x86_64] MI2a:                 mark dbus-tools
[x86_64] MI2a:                  target libdbus
[x86_64] MI2a:                   mark libdbus
[x86_64] MI2a:            target libXtst.so.6()(64bit)
[x86_64] MI2a:             mark libXtst
[x86_64] MI2a:            target libat-spi2-core
[x86_64] MI2a:             mark libat-spi2-core
[x86_64] MI2a:        target libcairo-gobject.so.2()(64bit)
[x86_64] MI2a:         mark libcairo-gobject
[x86_64] MI2a:        target libcups.so.2()(64bit)
[x86_64] MI2a:         mark libcups
[x86_64] MI2a:          target libavahi-client.so.3()(64bit)
[x86_64] MI2a:           mark libavahi
[x86_64] MI2a:          target libgnutls.so.30()(64bit)
[x86_64] MI2a:           mark libgnutls30
[x86_64] MI2a:            target libhogweed.so.6()(64bit)
[x86_64] MI2a:             mark libhogweed6
[x86_64] MI2a:              target libnettle8
[x86_64] MI2a:               mark libnettle8
[x86_64] MI2a:        target libwayland-cursor.so.0()(64bit)
[x86_64] MI2a:         mark libwayland-cursor
[x86_64] MI2a:        target libwayland-egl.so.1()(64bit)
[x86_64] MI2a:         mark libwayland-egl
[x86_64] MI2a:        target libxkbcommon.so.0()(64bit)
[x86_64] MI2a:         mark libxkbcommon
[x86_64] MI2a:        target libgtk+3-schemas
[x86_64] MI2a:         mark libgtk+3-schemas
[x86_64] MI2a:          target dconf
[x86_64] MI2a:           mark dconf
[x86_64] MI2a:            target libdconf
[x86_64] MI2a:             mark libdconf
[x86_64] MI2a:        target gtk-update-icon-cache
[x86_64] MI2a:         mark gtk-update-icon-cache
[x86_64] MI2a:    target libgail3
[x86_64] MI2a:     mark libgail3
[x86_64] MI2a:    target libgif.so.4()(64bit)
[x86_64] MI2a:     mark libgif
[x86_64] MI2a:    target java-17-openjdk-headless
[x86_64] MI2a:     mark java-17-openjdk-headless
[x86_64] MI2a:      target tzdata-java
[x86_64] MI2a:       mark javazi
[x86_64] MI2a:      target liblksctp
[x86_64] MI2a:       mark liblksctp
[x86_64] MI2a:      target lksctp-tools
[x86_64] MI2a:       mark lksctp-tools
[x86_64] MI2a:      target libpcsclite
[x86_64] MI2a:       mark libpcsclite
[x86_64] MI2a:      target java-common
[x86_64] MI2a:       mark java-common
[x86_64] MI2a:        target jpackage-utils
[x86_64] MI2a:         mark javapackages-tools
[x86_64] MI2a:      target /etc/pki/java/cacerts
[x86_64] MI2a:       mark ca-trust-java
[x86_64] MI2a:      target libasound.so.2()(64bit)
[x86_64] MI2a:       mark libalsa
[x86_64] MI2a:        target alsa-ucm-conf
[x86_64] MI2a:         mark alsa-ucm-conf
[x86_64] MI2a:        target alsa-topology-conf
[x86_64] MI2a:         mark alsa-topology-conf
[x86_64] MI2a: mark jpackage-1.8-compat
[x86_64] MI2a:  target java-1.8.0-openjdk-devel
[x86_64] MI2a:   mark java-1.8.0-openjdk-devel
[x86_64] MI2a:    target java-1.8.0-openjdk
[x86_64] MI2a:     mark java-1.8.0-openjdk
[x86_64] MI2a:      target libgail
[x86_64] MI2a:       mark libgail
[x86_64] MI2a:        target libgtk+2
[x86_64] MI2a:         mark libgtk+2
[x86_64] MI2a:          target libgtk+2-locales
[x86_64] MI2a:           mark libgtk+2-locales
[x86_64] MI2a:          target icon-theme-hicolor
[x86_64] MI2a:           mark icon-theme-hicolor
[x86_64] MI2a:      target java-1.8.0-openjdk-headless
[x86_64] MI2a:       mark java-1.8.0-openjdk-headless
[x86_64] MI2a:  target rpm-build-java
[x86_64] MI2a:   mark rpm-build-java
[x86_64] MI2a:    target python3
[x86_64] MI2a:     mark python3
[x86_64] MI2a:      target python3-base
[x86_64] MI2a:       mark python3-base
[x86_64] MI2a:        target libgdbm.so.3()(64bit)
[x86_64] MI2a:         mark libgdbm
[x86_64] MI2a:      target libpython3
[x86_64] MI2a:       mark libpython3
[x86_64] MI2a:    target python3-module-javapackages
[x86_64] MI2a:     mark python3-module-javapackages
[x86_64] MI2a:      target python3-module-lxml
[x86_64] MI2a:       mark python3-module-lxml
[x86_64] MI2a:        target python3-module-cssselect
[x86_64] MI2a:         mark python3-module-cssselect
[x86_64] MI2a:        target libexslt.so.0()(64bit)
[x86_64] MI2a:         mark libxslt
[x86_64] MI2a:        target python3(html5lib)
[x86_64] MI2a:         mark python3-module-html5lib
[x86_64] MI2a:          target python3(genshi.core)
[x86_64] MI2a:           mark python3-module-genshi
[x86_64] MI2a:            target python3(six)
[x86_64] MI2a:             mark python3-module-six
[x86_64] MI2a:          target python3(webencodings)
[x86_64] MI2a:           mark python3-module-webencodings
[x86_64] MI2a:  target java-stub-javadoc
[x86_64] MI2a:   mark java-stub-javadoc
[x86_64] MI2a:  delete java-11-openjdk-devel
[x86_64] MI2a:  delete java-10-openjdk-devel
[x86_64] MI2a:  delete java-17-openjdk-devel
[x86_64] MI2a:  delete java-9-openjdk
[x86_64] MI2a:  delete java-11-openjdk
[x86_64] MI2a:  delete java-10-openjdk
[x86_64] MI2a:  delete java-17-openjdk
[x86_64] MI2a:  delete java-9-openjdk-headless
[x86_64] MI2a:  delete java-11-openjdk-headless
[x86_64] MI2a:  delete java-10-openjdk-headless
[x86_64] MI2a:  delete java-17-openjdk-headless
[x86_64] MI2a: mark libnss-devel
[x86_64] MI2a:  target libnspr-devel
[x86_64] MI2a:   mark libnspr-devel
[x86_64] MI2a:    target libnspr
[x86_64] MI2a:     mark libnspr
[x86_64] MI2a:  target libnss
[x86_64] MI2a:   mark libnss
[x86_64] MI2a: mark unzip
[x86_64] MI2a:  target libnatspec.so.0()(64bit)
[x86_64] MI2a:   mark libnatspec
[x86_64] MI2a: mark junit
[x86_64] MI2a:  target mvn(org.hamcrest:hamcrest-core)
[x86_64] MI2a:   mark hamcrest-core
[x86_64] Starting
[x86_64] Starting 2
[x86_64] rpm-macros-java is already the newest version.
[x86_64] rpm-macros-cmake is already the newest version.
[x86_64] Selecting filesystem for '/proc'
[x86_64] filesystem is already the newest version.
[x86_64] Selected version java-17-openjdk-devel#0:17.0.4.0.8-alt0.p10.1:p10+305235.200.3.1@1663778031 for java-devel>=17
[x86_64] Selecting jpackage-1.8-compat for 'jpackage-generic-compat'
[x86_64] Selected version libnss-devel#3.72-alt1.p10.1:p10+298016.200.3.1@1649764169 for libnss-devel>=3.66
[x86_64] Selected version nss-utils#3.72-alt1.p10.1:p10+298016.200.3.1@1649764169 for nss-utils>=3.66
[x86_64] Investigating jpackage-1.8-compat
[x86_64] Package jpackage-1.8-compat has broken dep on java-devel
[x86_64]   Considering java-11-openjdk-devel 0 as a solution to jpackage-1.8-compat 9999
[x86_64]   Considering java-10-openjdk-devel 0 as a solution to jpackage-1.8-compat 9999
[x86_64]   Considering java-17-openjdk-devel 9999 as a solution to jpackage-1.8-compat 9999
[x86_64] Investigating java-17-openjdk-devel
[x86_64] Package java-17-openjdk-devel has broken dep on java-17-openjdk
[x86_64]   Considering java-17-openjdk 1 as a solution to java-17-openjdk-devel 9999
[x86_64]   Re-Instated java-17-openjdk-headless
[x86_64]   Re-Instated java-17-openjdk
[x86_64] Done
[x86_64] Some packages could not be installed. This may mean that you have
[x86_64] requested an impossible situation or if you are using the unstable
[x86_64] distribution that some required packages have not yet been created
[x86_64] or been moved out of Incoming.
[x86_64] The following information may help to resolve the situation:
[x86_64] 
[x86_64] The following packages have unmet dependencies:
[x86_64]   jpackage-1.8-compat: Conflicts: java-devel (> 1.8.99)
[x86_64]                        Conflicts: java (> 1.8.99)
[x86_64]                        Conflicts: java-headless (> 1.8.99)
[x86_64] E: Broken packages
[x86_64] hsh-install: Failed to calculate package file list.
[x86_64] hsh-install: Failed to generate package file list.
2022-Oct-01 12:15:17 :: [x86_64] jss.git 5.2.1-alt1: remote: cannot build src.rpm
2022-Oct-01 12:15:17 :: [x86_64] #1500 jss.git 5.2.1-alt1: build FAILED
2022-Oct-01 12:15:17 :: [x86_64] requesting cancellation of task processing
2022-Oct-01 12:15:21 :: [ppc64le] #500 mckoi-1.0.4-alt4_17jpp11.src.rpm: build OK (cached)
2022-Oct-01 12:15:21 :: [ppc64le] task processing CANCELLED
2022-Oct-01 12:15:23 :: [i586] #1600 tomcatjss.git 8.2.0-alt1: build SKIPPED
2022-Oct-01 12:15:30 :: [armh] #400 jtoaster-1.0.5-alt4_12jpp11.src.rpm: build OK (cached)
2022-Oct-01 12:15:30 :: [armh] task processing CANCELLED
2022-Oct-01 12:15:33 :: [aarch64] #700 freeplane-1.3.15-alt6_7jpp8.src.rpm: build OK (cached)
2022-Oct-01 12:15:33 :: [aarch64] task processing CANCELLED
2022-Oct-01 12:15:17 :: [x86_64] build FAILED
2022-Oct-01 12:15:21 :: [ppc64le] build FAILED
2022-Oct-01 12:15:30 :: [armh] build FAILED
2022-Oct-01 12:15:33 :: [aarch64] build FAILED
2022-Oct-01 12:15:33 :: task #305235 for p10 FAILED


^ permalink raw reply	[flat|nested] 14+ messages in thread

* [#305235] p10 FAILED (try 10) srpm=java-17-openjdk-17.0.4.0.8-alt0.p10.1.src.rpm ...
  2022-08-13 19:31 [#305235] p10 FAILED srpm=java-17-openjdk-17.0.4.0.8-alt1.src.rpm Girar awaiter (cas)
                   ` (7 preceding siblings ...)
  2022-10-01 12:15 ` [#305235] [test-only] p10 FAILED (try 9) srpm=java-17-openjdk-17.0.4.0.8-alt0.p10.1.src.rpm Girar awaiter (cas)
@ 2022-10-02 11:22 ` Girar awaiter (cas)
  2022-10-02 11:45 ` [#305235] p10 FAILED (try 11) srpm=java-17-openjdk-17.0.4.0.8-alt0.p10.1.src.rpm Girar awaiter (cas)
                   ` (3 subsequent siblings)
  12 siblings, 0 replies; 14+ messages in thread
From: Girar awaiter (cas) @ 2022-10-02 11:22 UTC (permalink / raw)
  To: Andrey Cherepanov
  Cc: girar-builder-p10, sisyphus-incominger, girar-builder-p10

https://git.altlinux.org/tasks/305235/logs/events.10.1.log

subtask  name                     aarch64   armh   i586  ppc64le  x86_64
   #500  mckoi                       1:21   2:19     50     1:31      44
   #700  freeplane                   1:03   9:03     39     1:19      37
  #1100  trove4j                       56   1:36     34     1:03      31
  #1300  protobuf                    8:17  11:50  14:58    11:25   12:37
  #1400  jpcap                       1:00   1:30     37     1:07      35
  #1440  jpackage-generic-compat       20     31     10       22      10
  #1500  jss                         2:37      -      -     1:24    1:06
  #1600  tomcatjss                     49      -      -       55      28



^ permalink raw reply	[flat|nested] 14+ messages in thread

* [#305235] p10 FAILED (try 11) srpm=java-17-openjdk-17.0.4.0.8-alt0.p10.1.src.rpm ...
  2022-08-13 19:31 [#305235] p10 FAILED srpm=java-17-openjdk-17.0.4.0.8-alt1.src.rpm Girar awaiter (cas)
                   ` (8 preceding siblings ...)
  2022-10-02 11:22 ` [#305235] p10 FAILED (try 10) srpm=java-17-openjdk-17.0.4.0.8-alt0.p10.1.src.rpm Girar awaiter (cas)
@ 2022-10-02 11:45 ` Girar awaiter (cas)
  2022-10-02 14:33 ` [#305235] p10 FAILED (try 12) srpm=java-17-openjdk-17.0.4.0.8-alt0.p10.1.src.rpm Girar awaiter (cas)
                   ` (2 subsequent siblings)
  12 siblings, 0 replies; 14+ messages in thread
From: Girar awaiter (cas) @ 2022-10-02 11:45 UTC (permalink / raw)
  To: Andrey Cherepanov
  Cc: girar-builder-p10, sisyphus-incominger, girar-builder-p10

https://git.altlinux.org/tasks/305235/logs/events.11.1.log

subtask  name     aarch64  armh  i586  ppc64le  x86_64
  #2000  ldapjdk     1:06     -     -     1:16      37



^ permalink raw reply	[flat|nested] 14+ messages in thread

* [#305235] p10 FAILED (try 12) srpm=java-17-openjdk-17.0.4.0.8-alt0.p10.1.src.rpm ...
  2022-08-13 19:31 [#305235] p10 FAILED srpm=java-17-openjdk-17.0.4.0.8-alt1.src.rpm Girar awaiter (cas)
                   ` (9 preceding siblings ...)
  2022-10-02 11:45 ` [#305235] p10 FAILED (try 11) srpm=java-17-openjdk-17.0.4.0.8-alt0.p10.1.src.rpm Girar awaiter (cas)
@ 2022-10-02 14:33 ` Girar awaiter (cas)
  2022-10-04 11:04 ` [#305235] [test-only] p10 FAILED (try 13) srpm=java-17-openjdk-17.0.4.0.8-alt0.p10.1.src.rpm Girar awaiter (cas)
  2022-10-04 16:10 ` [#305235] p10 EPERM (try 14) srpm=java-17-openjdk-17.0.4.0.8-alt0.p10.1.src.rpm Girar awaiter (cas)
  12 siblings, 0 replies; 14+ messages in thread
From: Girar awaiter (cas) @ 2022-10-02 14:33 UTC (permalink / raw)
  To: Andrey Cherepanov
  Cc: girar-builder-p10, sisyphus-incominger, girar-builder-p10

https://git.altlinux.org/tasks/305235/logs/events.12.1.log

subtask  name     aarch64  armh  i586  ppc64le  x86_64
  #2200  freeipa        ?     ?  1:36        ?  failed

2022-Oct-02 14:29:25 :: task #305235 for p10 resumed by cas:
2022-Oct-02 14:29:25 :: message: Bootstrap_is_finished_in_305236
#100 removed
#200 build java-17-openjdk-17.0.4.0.8-alt0.p10.1.src.rpm
#300 build java-atk-wrapper-0.38.0-alt2_6jpp11.src.rpm from sisyphus
#400 build jtoaster-1.0.5-alt4_12jpp11.src.rpm from sisyphus
#500 build mckoi-1.0.4-alt4_17jpp11.src.rpm from sisyphus
#600 removed
#700 build freeplane-1.3.15-alt6_7jpp8.src.rpm from sisyphus
#1000 removed
#1100 build 3.0.3-alt2 from /gears/t/trove4j.git fetched at 2022-Sep-22 10:00:06 from sisyphus
#1200 removed
#1300 build 3.16.0-alt1.p10.1 from /people/cas/packages/protobuf.git fetched at 2022-Sep-22 14:30:53
#1400 build 0.7-alt5 from /people/cas/packages/jpcap.git fetched at 2022-Sep-22 15:07:52
#1440 build jpackage-generic-compat-0.42-alt1.src.rpm from sisyphus
#1500 build 5.2.1-alt1 from /gears/j/jss.git fetched at 2022-Sep-30 16:17:44 from sisyphus
#1600 build 8.2.0-alt1 from /gears/t/tomcatjss.git fetched at 2022-Sep-30 16:18:06 from sisyphus
#1700 delete idm-console-framework
#2000 build 5.2.0-alt1 from /gears/l/ldapjdk.git fetched at 2022-Oct-02 11:27:51 from sisyphus
#2100 delete pki-core
#2200 build 4.9.10-alt3 from /gears/f/freeipa.git fetched at 2022-Oct-02 12:28:32 from sisyphus
#2300 build 0.11-alt2 from /gears/f/freeipa-healthcheck.git fetched at 2022-Oct-02 12:28:40 from sisyphus
2022-Oct-02 14:29:25 :: created build repo
2022-Oct-02 14:29:26 :: [ppc64le] #200 java-17-openjdk-17.0.4.0.8-alt0.p10.1.src.rpm: build start
2022-Oct-02 14:29:26 :: [x86_64] #200 java-17-openjdk-17.0.4.0.8-alt0.p10.1.src.rpm: build start
2022-Oct-02 14:29:26 :: [armh] #200 java-17-openjdk-17.0.4.0.8-alt0.p10.1.src.rpm: build start
2022-Oct-02 14:29:26 :: [aarch64] #200 java-17-openjdk-17.0.4.0.8-alt0.p10.1.src.rpm: build start
2022-Oct-02 14:29:26 :: [i586] #200 java-17-openjdk-17.0.4.0.8-alt0.p10.1.src.rpm: build start
2022-Oct-02 14:29:41 :: [i586] #200 java-17-openjdk-17.0.4.0.8-alt0.p10.1.src.rpm: build OK (cached)
2022-Oct-02 14:29:41 :: [i586] #300 java-atk-wrapper-0.38.0-alt2_6jpp11.src.rpm: build start
2022-Oct-02 14:29:44 :: [x86_64] #200 java-17-openjdk-17.0.4.0.8-alt0.p10.1.src.rpm: build OK (cached)
2022-Oct-02 14:29:44 :: [x86_64] #300 java-atk-wrapper-0.38.0-alt2_6jpp11.src.rpm: build start
2022-Oct-02 14:29:51 :: [i586] #300 java-atk-wrapper-0.38.0-alt2_6jpp11.src.rpm: build OK (cached)
2022-Oct-02 14:29:51 :: [i586] #400 jtoaster-1.0.5-alt4_12jpp11.src.rpm: build start
2022-Oct-02 14:29:55 :: [x86_64] #300 java-atk-wrapper-0.38.0-alt2_6jpp11.src.rpm: build OK (cached)
2022-Oct-02 14:29:55 :: [x86_64] #400 jtoaster-1.0.5-alt4_12jpp11.src.rpm: build start
2022-Oct-02 14:29:58 :: [aarch64] #200 java-17-openjdk-17.0.4.0.8-alt0.p10.1.src.rpm: build OK (cached)
2022-Oct-02 14:29:58 :: [aarch64] #300 java-atk-wrapper-0.38.0-alt2_6jpp11.src.rpm: build start
2022-Oct-02 14:30:00 :: [i586] #400 jtoaster-1.0.5-alt4_12jpp11.src.rpm: build OK (cached)
2022-Oct-02 14:30:00 :: [i586] #500 mckoi-1.0.4-alt4_17jpp11.src.rpm: build start
2022-Oct-02 14:30:02 :: [ppc64le] #200 java-17-openjdk-17.0.4.0.8-alt0.p10.1.src.rpm: build OK (cached)
2022-Oct-02 14:30:02 :: [ppc64le] #300 java-atk-wrapper-0.38.0-alt2_6jpp11.src.rpm: build start
2022-Oct-02 14:30:05 :: [x86_64] #400 jtoaster-1.0.5-alt4_12jpp11.src.rpm: build OK (cached)
2022-Oct-02 14:30:05 :: [x86_64] #500 mckoi-1.0.4-alt4_17jpp11.src.rpm: build start
2022-Oct-02 14:30:10 :: [i586] #500 mckoi-1.0.4-alt4_17jpp11.src.rpm: build OK (cached)
2022-Oct-02 14:30:10 :: [i586] #700 freeplane-1.3.15-alt6_7jpp8.src.rpm: build start
2022-Oct-02 14:30:14 :: [armh] #200 java-17-openjdk-17.0.4.0.8-alt0.p10.1.src.rpm: build SKIPPED
2022-Oct-02 14:30:14 :: [armh] #300 java-atk-wrapper-0.38.0-alt2_6jpp11.src.rpm: build start
2022-Oct-02 14:30:15 :: [x86_64] #500 mckoi-1.0.4-alt4_17jpp11.src.rpm: build OK (cached)
2022-Oct-02 14:30:15 :: [x86_64] #700 freeplane-1.3.15-alt6_7jpp8.src.rpm: build start
2022-Oct-02 14:30:19 :: [aarch64] #300 java-atk-wrapper-0.38.0-alt2_6jpp11.src.rpm: build OK (cached)
2022-Oct-02 14:30:19 :: [aarch64] #400 jtoaster-1.0.5-alt4_12jpp11.src.rpm: build start
2022-Oct-02 14:30:20 :: [i586] #700 freeplane-1.3.15-alt6_7jpp8.src.rpm: build OK (cached)
2022-Oct-02 14:30:20 :: [i586] #1100 trove4j.git 3.0.3-alt2: build start
2022-Oct-02 14:30:25 :: [ppc64le] #300 java-atk-wrapper-0.38.0-alt2_6jpp11.src.rpm: build OK (cached)
2022-Oct-02 14:30:25 :: [ppc64le] #400 jtoaster-1.0.5-alt4_12jpp11.src.rpm: build start
2022-Oct-02 14:30:25 :: [x86_64] #700 freeplane-1.3.15-alt6_7jpp8.src.rpm: build OK (cached)
2022-Oct-02 14:30:25 :: [x86_64] #1100 trove4j.git 3.0.3-alt2: build start
2022-Oct-02 14:30:30 :: [i586] #1100 trove4j.git 3.0.3-alt2: build OK (cached)
2022-Oct-02 14:30:30 :: [i586] #1300 protobuf.git 3.16.0-alt1.p10.1: build start
2022-Oct-02 14:30:36 :: [x86_64] #1100 trove4j.git 3.0.3-alt2: build OK (cached)
2022-Oct-02 14:30:36 :: [x86_64] #1300 protobuf.git 3.16.0-alt1.p10.1: build start
2022-Oct-02 14:30:38 :: [aarch64] #400 jtoaster-1.0.5-alt4_12jpp11.src.rpm: build OK (cached)
2022-Oct-02 14:30:38 :: [aarch64] #500 mckoi-1.0.4-alt4_17jpp11.src.rpm: build start
2022-Oct-02 14:30:41 :: [i586] #1300 protobuf.git 3.16.0-alt1.p10.1: build OK (cached)
2022-Oct-02 14:30:41 :: [i586] #1400 jpcap.git 0.7-alt5: build start
2022-Oct-02 14:30:45 :: [armh] #300 java-atk-wrapper-0.38.0-alt2_6jpp11.src.rpm: build OK (cached)
2022-Oct-02 14:30:45 :: [armh] #400 jtoaster-1.0.5-alt4_12jpp11.src.rpm: build start
2022-Oct-02 14:30:45 :: [ppc64le] #400 jtoaster-1.0.5-alt4_12jpp11.src.rpm: build OK (cached)
2022-Oct-02 14:30:46 :: [ppc64le] #500 mckoi-1.0.4-alt4_17jpp11.src.rpm: build start
2022-Oct-02 14:30:48 :: [x86_64] #1300 protobuf.git 3.16.0-alt1.p10.1: build OK (cached)
2022-Oct-02 14:30:48 :: [x86_64] #1400 jpcap.git 0.7-alt5: build start
2022-Oct-02 14:30:50 :: [i586] #1400 jpcap.git 0.7-alt5: build OK (cached)
2022-Oct-02 14:30:50 :: [i586] #1440 jpackage-generic-compat-0.42-alt1.src.rpm: build start
2022-Oct-02 14:30:58 :: [x86_64] #1400 jpcap.git 0.7-alt5: build OK (cached)
2022-Oct-02 14:30:58 :: [aarch64] #500 mckoi-1.0.4-alt4_17jpp11.src.rpm: build OK (cached)
2022-Oct-02 14:30:58 :: [x86_64] #1440 jpackage-generic-compat-0.42-alt1.src.rpm: build start
2022-Oct-02 14:30:58 :: [aarch64] #700 freeplane-1.3.15-alt6_7jpp8.src.rpm: build start
2022-Oct-02 14:30:59 :: [i586] #1440 jpackage-generic-compat-0.42-alt1.src.rpm: build OK (cached)
2022-Oct-02 14:30:59 :: [i586] #1500 jss.git 5.2.1-alt1: build start
2022-Oct-02 14:31:07 :: [ppc64le] #500 mckoi-1.0.4-alt4_17jpp11.src.rpm: build OK (cached)
2022-Oct-02 14:31:07 :: [ppc64le] #700 freeplane-1.3.15-alt6_7jpp8.src.rpm: build start
2022-Oct-02 14:31:08 :: [x86_64] #1440 jpackage-generic-compat-0.42-alt1.src.rpm: build OK (cached)
2022-Oct-02 14:31:08 :: [x86_64] #1500 jss.git 5.2.1-alt1: build start
2022-Oct-02 14:31:09 :: [i586] #1500 jss.git 5.2.1-alt1: build SKIPPED
2022-Oct-02 14:31:09 :: [i586] #1600 tomcatjss.git 8.2.0-alt1: build start
2022-Oct-02 14:31:15 :: [armh] #400 jtoaster-1.0.5-alt4_12jpp11.src.rpm: build OK (cached)
2022-Oct-02 14:31:15 :: [armh] #500 mckoi-1.0.4-alt4_17jpp11.src.rpm: build start
2022-Oct-02 14:31:18 :: [x86_64] #1500 jss.git 5.2.1-alt1: build OK (cached)
2022-Oct-02 14:31:18 :: [x86_64] #1600 tomcatjss.git 8.2.0-alt1: build start
2022-Oct-02 14:31:18 :: [aarch64] #700 freeplane-1.3.15-alt6_7jpp8.src.rpm: build OK (cached)
2022-Oct-02 14:31:18 :: [aarch64] #1100 trove4j.git 3.0.3-alt2: build start
2022-Oct-02 14:31:19 :: [i586] #1600 tomcatjss.git 8.2.0-alt1: build SKIPPED
2022-Oct-02 14:31:19 :: [i586] #2000 ldapjdk.git 5.2.0-alt1: build start
2022-Oct-02 14:31:27 :: [ppc64le] #700 freeplane-1.3.15-alt6_7jpp8.src.rpm: build OK (cached)
2022-Oct-02 14:31:27 :: [ppc64le] #1100 trove4j.git 3.0.3-alt2: build start
2022-Oct-02 14:31:28 :: [x86_64] #1600 tomcatjss.git 8.2.0-alt1: build OK (cached)
2022-Oct-02 14:31:28 :: [x86_64] #2000 ldapjdk.git 5.2.0-alt1: build start
2022-Oct-02 14:31:29 :: [i586] #2000 ldapjdk.git 5.2.0-alt1: build SKIPPED
2022-Oct-02 14:31:29 :: [i586] #2200 freeipa.git 4.9.10-alt3: build start
2022-Oct-02 14:31:37 :: [aarch64] #1100 trove4j.git 3.0.3-alt2: build OK (cached)
2022-Oct-02 14:31:37 :: [aarch64] #1300 protobuf.git 3.16.0-alt1.p10.1: build start
2022-Oct-02 14:31:37 :: [x86_64] #2000 ldapjdk.git 5.2.0-alt1: build OK (cached)
2022-Oct-02 14:31:37 :: [x86_64] #2200 freeipa.git 4.9.10-alt3: build start
2022-Oct-02 14:31:46 :: [armh] #500 mckoi-1.0.4-alt4_17jpp11.src.rpm: build OK (cached)
2022-Oct-02 14:31:46 :: [armh] #700 freeplane-1.3.15-alt6_7jpp8.src.rpm: build start
2022-Oct-02 14:31:49 :: [ppc64le] #1100 trove4j.git 3.0.3-alt2: build OK (cached)
2022-Oct-02 14:31:49 :: [ppc64le] #1300 protobuf.git 3.16.0-alt1.p10.1: build start
2022-Oct-02 14:31:59 :: [aarch64] #1300 protobuf.git 3.16.0-alt1.p10.1: build OK (cached)
2022-Oct-02 14:31:59 :: [aarch64] #1400 jpcap.git 0.7-alt5: build start
2022-Oct-02 14:32:11 :: [ppc64le] #1300 protobuf.git 3.16.0-alt1.p10.1: build OK (cached)
2022-Oct-02 14:32:11 :: [ppc64le] #1400 jpcap.git 0.7-alt5: build start
2022-Oct-02 14:32:17 :: [armh] #700 freeplane-1.3.15-alt6_7jpp8.src.rpm: build OK (cached)
2022-Oct-02 14:32:17 :: [armh] #1100 trove4j.git 3.0.3-alt2: build start
2022-Oct-02 14:32:19 :: [aarch64] #1400 jpcap.git 0.7-alt5: build OK (cached)
2022-Oct-02 14:32:19 :: [aarch64] #1440 jpackage-generic-compat-0.42-alt1.src.rpm: build start
[x86_64] oauth2.c: In function 'oauth2_on_child_readable':
[x86_64] oauth2.c:322:38: error: parameter name omitted
[x86_64]   322 | static void oauth2_on_child_readable(verto_ctx *, verto_ev *ev)
2022-Oct-02 14:32:32 :: [x86_64] freeipa.git 4.9.10-alt3: remote: build failed
2022-Oct-02 14:32:32 :: [x86_64] #2200 freeipa.git 4.9.10-alt3: build FAILED
2022-Oct-02 14:32:32 :: [x86_64] requesting cancellation of task processing
2022-Oct-02 14:32:33 :: [ppc64le] #1400 jpcap.git 0.7-alt5: build OK (cached)
2022-Oct-02 14:32:33 :: [ppc64le] task processing CANCELLED
2022-Oct-02 14:32:38 :: [aarch64] #1440 jpackage-generic-compat-0.42-alt1.src.rpm: build OK (cached)
2022-Oct-02 14:32:38 :: [aarch64] task processing CANCELLED
2022-Oct-02 14:32:47 :: [armh] #1100 trove4j.git 3.0.3-alt2: build OK (cached)
2022-Oct-02 14:32:47 :: [armh] task processing CANCELLED
2022-Oct-02 14:33:05 :: [i586] #2200 freeipa.git 4.9.10-alt3: build OK
2022-Oct-02 14:33:05 :: [i586] task processing CANCELLED
2022-Oct-02 14:32:32 :: [x86_64] build FAILED
2022-Oct-02 14:32:33 :: [ppc64le] build FAILED
2022-Oct-02 14:32:38 :: [aarch64] build FAILED
2022-Oct-02 14:32:47 :: [armh] build FAILED
2022-Oct-02 14:33:05 :: [i586] build FAILED
2022-Oct-02 14:33:05 :: task #305235 for p10 FAILED


^ permalink raw reply	[flat|nested] 14+ messages in thread

* [#305235] [test-only] p10 FAILED (try 13) srpm=java-17-openjdk-17.0.4.0.8-alt0.p10.1.src.rpm ...
  2022-08-13 19:31 [#305235] p10 FAILED srpm=java-17-openjdk-17.0.4.0.8-alt1.src.rpm Girar awaiter (cas)
                   ` (10 preceding siblings ...)
  2022-10-02 14:33 ` [#305235] p10 FAILED (try 12) srpm=java-17-openjdk-17.0.4.0.8-alt0.p10.1.src.rpm Girar awaiter (cas)
@ 2022-10-04 11:04 ` Girar awaiter (cas)
  2022-10-04 16:10 ` [#305235] p10 EPERM (try 14) srpm=java-17-openjdk-17.0.4.0.8-alt0.p10.1.src.rpm Girar awaiter (cas)
  12 siblings, 0 replies; 14+ messages in thread
From: Girar awaiter (cas) @ 2022-10-04 11:04 UTC (permalink / raw)
  To: Andrey Cherepanov
  Cc: girar-builder-p10, sisyphus-incominger, girar-builder-p10

https://git.altlinux.org/tasks/305235/logs/events.13.1.log

subtask  name              aarch64   armh   i586  ppc64le  x86_64
   #200  java-17-openjdk     25:00      -  14:46  2:11:19   13:55
   #300  java-atk-wrapper     1:18   2:00     47     1:30      44
   #400  jtoaster               50   1:18     31       55      29
   #500  mckoi                1:20   2:18     50     1:30      44
  #1100  trove4j                54   1:34     33     1:02      30
  #1300  protobuf             9:31  11:27  14:46    11:32   12:10
  #1400  jpcap                  58   1:27     37     1:07      35
  #2400  jss                  4:33   9:13   3:00     1:41    1:47
  #2500  tomcatjss              58   1:15     29       53      27



^ permalink raw reply	[flat|nested] 14+ messages in thread

* [#305235] p10 EPERM (try 14) srpm=java-17-openjdk-17.0.4.0.8-alt0.p10.1.src.rpm ...
  2022-08-13 19:31 [#305235] p10 FAILED srpm=java-17-openjdk-17.0.4.0.8-alt1.src.rpm Girar awaiter (cas)
                   ` (11 preceding siblings ...)
  2022-10-04 11:04 ` [#305235] [test-only] p10 FAILED (try 13) srpm=java-17-openjdk-17.0.4.0.8-alt0.p10.1.src.rpm Girar awaiter (cas)
@ 2022-10-04 16:10 ` Girar awaiter (cas)
  12 siblings, 0 replies; 14+ messages in thread
From: Girar awaiter (cas) @ 2022-10-04 16:10 UTC (permalink / raw)
  To: Andrey Cherepanov
  Cc: girar-builder-p10, sisyphus-incominger, girar-builder-p10

https://git.altlinux.org/tasks/305235/logs/events.14.1.log

subtask  name       aarch64   armh  i586  ppc64le  x86_64
  #2600  jss           4:36  10:12  2:58     1:46    1:52
  #2700  tomcatjss       48   1:47    30       55      27
  #3100  task-edu        23     50    12       25      12



^ permalink raw reply	[flat|nested] 14+ messages in thread

end of thread, other threads:[~2022-10-04 16:10 UTC | newest]

Thread overview: 14+ messages (download: mbox.gz / follow: Atom feed)
-- links below jump to the message on this page --
2022-08-13 19:31 [#305235] p10 FAILED srpm=java-17-openjdk-17.0.4.0.8-alt1.src.rpm Girar awaiter (cas)
2022-08-18 15:30 ` [#305235] p10 EPERM (try 2) srpm=java-17-openjdk-17.0.4.0.8-alt0.p10.1.src.rpm Girar awaiter (cas)
2022-09-21 18:30 ` [#305235] p10 FAILED (try 3) srpm=java-17-openjdk-17.0.4.0.8-alt0.p10.1.src.rpm Girar awaiter (cas)
2022-09-22  6:56 ` [#305235] p10 TESTED (try 4) srpm=java-17-openjdk-17.0.4.0.8-alt0.p10.1.src.rpm Girar awaiter (cas)
2022-09-22  8:48 ` [#305235] p10 TESTED (try 5) srpm=java-17-openjdk-17.0.4.0.8-alt0.p10.1.src.rpm Girar awaiter (cas)
2022-09-22 10:04 ` [#305235] [test-only] p10 FAILED (try 6) srpm=java-17-openjdk-17.0.4.0.8-alt0.p10.1.src.rpm Girar awaiter (cas)
2022-09-22 15:02 ` [#305235] p10 FAILED (try 7) srpm=java-17-openjdk-17.0.4.0.8-alt0.p10.1.src.rpm Girar awaiter (cas)
2022-09-22 15:41 ` [#305235] p10 EPERM (try 8) srpm=java-17-openjdk-17.0.4.0.8-alt0.p10.1.src.rpm Girar awaiter (cas)
2022-10-01 12:15 ` [#305235] [test-only] p10 FAILED (try 9) srpm=java-17-openjdk-17.0.4.0.8-alt0.p10.1.src.rpm Girar awaiter (cas)
2022-10-02 11:22 ` [#305235] p10 FAILED (try 10) srpm=java-17-openjdk-17.0.4.0.8-alt0.p10.1.src.rpm Girar awaiter (cas)
2022-10-02 11:45 ` [#305235] p10 FAILED (try 11) srpm=java-17-openjdk-17.0.4.0.8-alt0.p10.1.src.rpm Girar awaiter (cas)
2022-10-02 14:33 ` [#305235] p10 FAILED (try 12) srpm=java-17-openjdk-17.0.4.0.8-alt0.p10.1.src.rpm Girar awaiter (cas)
2022-10-04 11:04 ` [#305235] [test-only] p10 FAILED (try 13) srpm=java-17-openjdk-17.0.4.0.8-alt0.p10.1.src.rpm Girar awaiter (cas)
2022-10-04 16:10 ` [#305235] p10 EPERM (try 14) srpm=java-17-openjdk-17.0.4.0.8-alt0.p10.1.src.rpm Girar awaiter (cas)

ALT Linux Girar Builder robot reports

This inbox may be cloned and mirrored by anyone:

	git clone --mirror http://lore.altlinux.org/sisyphus-incominger/0 sisyphus-incominger/git/0.git

	# If you have public-inbox 1.1+ installed, you may
	# initialize and index your mirror using the following commands:
	public-inbox-init -V2 sisyphus-incominger sisyphus-incominger/ http://lore.altlinux.org/sisyphus-incominger \
		sisyphus-incominger@lists.altlinux.org sisyphus-incominger@lists.altlinux.ru sisyphus-incominger@lists.altlinux.com
	public-inbox-index sisyphus-incominger

Example config snippet for mirrors.
Newsgroup available over NNTP:
	nntp://lore.altlinux.org/org.altlinux.lists.sisyphus-incominger


AGPL code for this site: git clone https://public-inbox.org/public-inbox.git