* [#435104] [test-only] p11 FAILED pi-hole-ftl.git=6.7-alt1 pi-hole.git=6.4.3-alt1 ...
@ 2026-10-02 13:20 Girar awaiter (andy)
2026-10-02 13:42 ` [#435104] [test-only] p11 FAILED (try 2) mbedtls.git=4.2.0-alt1 " Girar awaiter (andy)
` (2 more replies)
0 siblings, 3 replies; 4+ messages in thread
From: Girar awaiter (andy) @ 2026-10-02 13:20 UTC (permalink / raw)
To: Andrew A. Vasilyev
Cc: sisyphus-incominger, girar-builder-p11, girar-builder-p11
https://git.altlinux.org/tasks/435104/logs/events.1.1.log
https://packages.altlinux.org/tasks/435104
subtask name aarch64 i586 x86_64
#100 pi-hole-ftl failed failed failed
2026-Oct-02 13:17:18 :: test-only task #435104 for p11 started by andy:
2026-Oct-02 13:17:18 :: message: Test
#100 build 6.7-alt1 from /gears/p/pi-hole-ftl.git fetched at 2026-Oct-02 13:17:14 from sisyphus
#200 build 6.4.3-alt1 from /gears/p/pi-hole.git fetched at 2026-Oct-02 13:17:16 from sisyphus
#300 build pi-hole-web-6.6-alt1.src.rpm from sisyphus
2026-Oct-02 13:17:19 :: created build repo
2026-Oct-02 13:17:20 :: [aarch64] #100 pi-hole-ftl.git 6.7-alt1: build start
2026-Oct-02 13:17:20 :: [i586] #100 pi-hole-ftl.git 6.7-alt1: build start
2026-Oct-02 13:17:20 :: [x86_64] #100 pi-hole-ftl.git 6.7-alt1: build start
[x86_64] [ 20%] Building C object src/database/CMakeFiles/sqlite3.dir/sqlite3.c.o
[x86_64] cd /usr/src/RPM/BUILD/pi-hole-ftl-6.7/x86_64-alt-linux/src/database && /usr/bin/cc -DHAVE_READLINE -DSQLITE_ENABLE_EXPLAIN_COMMENTS -DSQLITE_SHELL_INIT_PROC=pihole_sqlite3_initalize -std=c17 -pipe -Wall -Wextra -Wno-unused-parameter -D_FILE_OFFSET_BITS=64 -fstack-protector-strong -Wp,-U_FORTIFY_SOURCE -Wp,-D_FORTIFY_SOURCE=3 -Wl,-z,relro,-z,now -fexceptions -funwind-tables -fasynchronous-unwind-tables -Wl,-z,defs -Wl,-z,now -Wl,-z,relro -fno-common -pie -fPIE -rdynamic -fno-omit-frame-pointer -pipe -frecord-gcc-switches -Wall -g -O2 -DHAVE_POLL_H -DSQLITE_OMIT_LOAD_EXTENSION -DSQLITE_DEFAULT_MEMSTATUS=0 -DSQLITE_OMIT_DEPRECATED -DSQLITE_OMIT_PROGRESS_CALLBACK -DSQLITE_OMIT_SHARED_CACHE -DSQLITE_DEFAULT_FOREIGN_KEYS=1 -DSQLITE_DQS=0 -DSQLITE_ENABLE_DBPAGE_VTAB -DSQLITE_TEMP_STORE=1 -DSQLITE_DEFAULT_CACHE_SIZE=4096 -DSQLITE_DEFAULT_SYNCHRONOUS=1 -DSQLITE_DEFAULT_JOURNAL_SIZE_LIMIT=33554432 -DSQLITE_LIKE_DOESNT_MATCH_BLOBS -DHAVE_MALLOC_H -DHAVE_MALLOC_USABLE_SIZE -DHAVE_FDATASYNC -DSQLITE_DEFAULT_WORKER_THREADS=0 -DSQLITE_MAX_PREPARE_RETRY=200 -DSQLITE_ENABLE_CARRAY=1 -DSQLITE_ENABLE_PERCENTILE=1 -O3 -DNDEBUG -funroll-loops -g3 -std=gnu17 -Wno-implicit-fallthrough -Wno-cast-function-type -Wno-sign-compare -Wno-implicit-function-declaration -Wno-int-conversion -MD -MT src/database/CMakeFiles/sqlite3.dir/sqlite3.c.o -MF CMakeFiles/sqlite3.dir/sqlite3.c.o.d -o CMakeFiles/sqlite3.dir/sqlite3.c.o -c /usr/src/RPM/BUILD/pi-hole-ftl-6.7/src/database/sqlite3.c
[x86_64] gmake[2]: Leaving directory '/usr/src/RPM/BUILD/pi-hole-ftl-6.7/x86_64-alt-linux'
[x86_64] gmake[1]: Entering directory '/usr/src/RPM/BUILD/pi-hole-ftl-6.7/x86_64-alt-linux'
[x86_64] [ 53%] Built target sqlite3
[x86_64] gmake[1]: Leaving directory '/usr/src/RPM/BUILD/pi-hole-ftl-6.7/x86_64-alt-linux'
[x86_64] gmake: *** [Makefile:136: all] Error 2
[x86_64] error: Bad exit status from /usr/src/tmp/rpmb-tmp.Rk3jFW (%build)
[x86_64] RPM build errors:
[x86_64] Bad exit status from /usr/src/tmp/rpmb-tmp.Rk3jFW (%build)
2026-Oct-02 13:18:50 :: [x86_64] pi-hole-ftl.git 6.7-alt1: remote: build failed
2026-Oct-02 13:18:50 :: [x86_64] #100 pi-hole-ftl.git 6.7-alt1: build FAILED
2026-Oct-02 13:18:50 :: [x86_64] requesting cancellation of task processing
[i586] [ 12%] Building C object src/database/CMakeFiles/sqlite3.dir/sqlite3.c.o
[i586] cd /usr/src/RPM/BUILD/pi-hole-ftl-6.7/i586-alt-linux/src/database && /usr/bin/cc -DHAVE_READLINE -DSQLITE_ENABLE_EXPLAIN_COMMENTS -DSQLITE_SHELL_INIT_PROC=pihole_sqlite3_initalize -std=c17 -pipe -Wall -Wextra -Wno-unused-parameter -D_FILE_OFFSET_BITS=64 -fstack-protector-strong -Wp,-U_FORTIFY_SOURCE -Wp,-D_FORTIFY_SOURCE=3 -Wl,-z,relro,-z,now -fexceptions -funwind-tables -fasynchronous-unwind-tables -Wl,-z,defs -Wl,-z,now -Wl,-z,relro -fno-common -pie -fPIE -rdynamic -fno-omit-frame-pointer -pipe -frecord-gcc-switches -Wall -g -O2 -march=i586 -mtune=generic -DHAVE_POLL_H -DSQLITE_OMIT_LOAD_EXTENSION -DSQLITE_DEFAULT_MEMSTATUS=0 -DSQLITE_OMIT_DEPRECATED -DSQLITE_OMIT_PROGRESS_CALLBACK -DSQLITE_OMIT_SHARED_CACHE -DSQLITE_DEFAULT_FOREIGN_KEYS=1 -DSQLITE_DQS=0 -DSQLITE_ENABLE_DBPAGE_VTAB -DSQLITE_TEMP_STORE=1 -DSQLITE_DEFAULT_CACHE_SIZE=4096 -DSQLITE_DEFAULT_SYNCHRONOUS=1 -DSQLITE_DEFAULT_JOURNAL_SIZE_LIMIT=33554432 -DSQLITE_LIKE_DOESNT_MATCH_BLOBS -DHAVE_MALLOC_H -DHAVE_MALLOC_USABLE_SIZE -DHAVE_FDATASYNC -DSQLITE_DEFAULT_WORKER_THREADS=0 -DSQLITE_MAX_PREPARE_RETRY=200 -DSQLITE_ENABLE_CARRAY=1 -DSQLITE_ENABLE_PERCENTILE=1 -O3 -DNDEBUG -funroll-loops -g3 -std=gnu17 -Wno-implicit-fallthrough -Wno-cast-function-type -Wno-sign-compare -Wno-implicit-function-declaration -Wno-int-conversion -MD -MT src/database/CMakeFiles/sqlite3.dir/sqlite3.c.o -MF CMakeFiles/sqlite3.dir/sqlite3.c.o.d -o CMakeFiles/sqlite3.dir/sqlite3.c.o -c /usr/src/RPM/BUILD/pi-hole-ftl-6.7/src/database/sqlite3.c
[i586] gmake[2]: Leaving directory '/usr/src/RPM/BUILD/pi-hole-ftl-6.7/i586-alt-linux'
[i586] gmake[1]: Entering directory '/usr/src/RPM/BUILD/pi-hole-ftl-6.7/i586-alt-linux'
[i586] [ 68%] Built target sqlite3
[i586] gmake[1]: Leaving directory '/usr/src/RPM/BUILD/pi-hole-ftl-6.7/i586-alt-linux'
[i586] gmake: *** [Makefile:136: all] Error 2
[i586] error: Bad exit status from /usr/src/tmp/rpmb-tmp.spEPGO (%build)
[i586] RPM build errors:
[i586] Bad exit status from /usr/src/tmp/rpmb-tmp.spEPGO (%build)
2026-Oct-02 13:18:52 :: [i586] pi-hole-ftl.git 6.7-alt1: remote: build failed
2026-Oct-02 13:18:52 :: [i586] #100 pi-hole-ftl.git 6.7-alt1: build FAILED
[aarch64] [ 30%] Building C object src/database/CMakeFiles/sqlite3.dir/sqlite3.c.o
[aarch64] cd /usr/src/RPM/BUILD/pi-hole-ftl-6.7/aarch64-alt-linux/src/database && /usr/bin/cc -DHAVE_READLINE -DSQLITE_ENABLE_EXPLAIN_COMMENTS -DSQLITE_SHELL_INIT_PROC=pihole_sqlite3_initalize -std=c17 -pipe -Wall -Wextra -Wno-unused-parameter -D_FILE_OFFSET_BITS=64 -fstack-protector-strong -Wp,-U_FORTIFY_SOURCE -Wp,-D_FORTIFY_SOURCE=3 -Wl,-z,relro,-z,now -fexceptions -funwind-tables -fasynchronous-unwind-tables -Wl,-z,defs -Wl,-z,now -Wl,-z,relro -fno-common -pie -fPIE -rdynamic -fno-omit-frame-pointer -pipe -frecord-gcc-switches -Wall -g -O2 -DHAVE_POLL_H -DSQLITE_OMIT_LOAD_EXTENSION -DSQLITE_DEFAULT_MEMSTATUS=0 -DSQLITE_OMIT_DEPRECATED -DSQLITE_OMIT_PROGRESS_CALLBACK -DSQLITE_OMIT_SHARED_CACHE -DSQLITE_DEFAULT_FOREIGN_KEYS=1 -DSQLITE_DQS=0 -DSQLITE_ENABLE_DBPAGE_VTAB -DSQLITE_TEMP_STORE=1 -DSQLITE_DEFAULT_CACHE_SIZE=4096 -DSQLITE_DEFAULT_SYNCHRONOUS=1 -DSQLITE_DEFAULT_JOURNAL_SIZE_LIMIT=33554432 -DSQLITE_LIKE_DOESNT_MATCH_BLOBS -DHAVE_MALLOC_H -DHAVE_MALLOC_USABLE_SIZE -DHAVE_FDATASYNC -DSQLITE_DEFAULT_WORKER_THREADS=0 -DSQLITE_MAX_PREPARE_RETRY=200 -DSQLITE_ENABLE_CARRAY=1 -DSQLITE_ENABLE_PERCENTILE=1 -O3 -DNDEBUG -funroll-loops -g3 -std=gnu17 -Wno-implicit-fallthrough -Wno-cast-function-type -Wno-sign-compare -Wno-implicit-function-declaration -Wno-int-conversion -MD -MT src/database/CMakeFiles/sqlite3.dir/sqlite3.c.o -MF CMakeFiles/sqlite3.dir/sqlite3.c.o.d -o CMakeFiles/sqlite3.dir/sqlite3.c.o -c /usr/src/RPM/BUILD/pi-hole-ftl-6.7/src/database/sqlite3.c
[aarch64] gmake[2]: Leaving directory '/usr/src/RPM/BUILD/pi-hole-ftl-6.7/aarch64-alt-linux'
[aarch64] gmake[1]: Entering directory '/usr/src/RPM/BUILD/pi-hole-ftl-6.7/aarch64-alt-linux'
[aarch64] [ 90%] Built target sqlite3
[aarch64] gmake[1]: Leaving directory '/usr/src/RPM/BUILD/pi-hole-ftl-6.7/aarch64-alt-linux'
[aarch64] gmake: *** [Makefile:136: all] Error 2
[aarch64] error: Bad exit status from /usr/src/tmp/rpmb-tmp.Q8EFXO (%build)
[aarch64] RPM build errors:
[aarch64] Bad exit status from /usr/src/tmp/rpmb-tmp.Q8EFXO (%build)
2026-Oct-02 13:20:06 :: [aarch64] pi-hole-ftl.git 6.7-alt1: remote: build failed
2026-Oct-02 13:20:06 :: [aarch64] #100 pi-hole-ftl.git 6.7-alt1: build FAILED
2026-Oct-02 13:18:50 :: [x86_64] build FAILED
2026-Oct-02 13:18:52 :: [i586] build FAILED
2026-Oct-02 13:20:06 :: [aarch64] build FAILED
2026-Oct-02 13:20:06 :: task #435104 for p11 FAILED
^ permalink raw reply [flat|nested] 4+ messages in thread
* [#435104] [test-only] p11 FAILED (try 2) mbedtls.git=4.2.0-alt1 pi-hole-ftl.git=6.7-alt1 pi-hole.git=6.4.3-alt1 ...
2026-10-02 13:20 [#435104] [test-only] p11 FAILED pi-hole-ftl.git=6.7-alt1 pi-hole.git=6.4.3-alt1 Girar awaiter (andy)
@ 2026-10-02 13:42 ` Girar awaiter (andy)
2026-10-02 13:48 ` [#435104] [test-only] p11 FAILED (try 3) " Girar awaiter (andy)
2026-10-02 14:24 ` [#435104] [test-only] p11 FAILED (try 4) " Girar awaiter (andy)
2 siblings, 0 replies; 4+ messages in thread
From: Girar awaiter (andy) @ 2026-10-02 13:42 UTC (permalink / raw)
To: Andrew A. Vasilyev
Cc: sisyphus-incominger, girar-builder-p11, girar-builder-p11
https://git.altlinux.org/tasks/435104/logs/events.2.1.log
https://packages.altlinux.org/tasks/435104
subtask name aarch64 i586 x86_64
#40 mbedtls 3:21 3:05 2:14
#100 pi-hole-ftl 3:14 1:56 1:54
#200 pi-hole 42 25 27
#300 pi-hole-web 30 18 19
2026-Oct-02 13:31:15 :: test-only task #435104 for p11 resumed by andy:
2026-Oct-02 13:31:15 :: message: Test
#40 build 4.2.0-alt1 from /gears/m/mbedtls.git fetched at 2026-Oct-02 13:31:00 from sisyphus
#100 build 6.7-alt1 from /gears/p/pi-hole-ftl.git fetched at 2026-Oct-02 13:17:14 from sisyphus
#200 build 6.4.3-alt1 from /gears/p/pi-hole.git fetched at 2026-Oct-02 13:17:16 from sisyphus
#300 build pi-hole-web-6.6-alt1.src.rpm from sisyphus
2026-Oct-02 13:31:15 :: created build repo
2026-Oct-02 13:31:16 :: [i586] #40 mbedtls.git 4.2.0-alt1: build start
2026-Oct-02 13:31:16 :: [x86_64] #40 mbedtls.git 4.2.0-alt1: build start
2026-Oct-02 13:31:16 :: [aarch64] #40 mbedtls.git 4.2.0-alt1: build start
2026-Oct-02 13:33:30 :: [x86_64] #40 mbedtls.git 4.2.0-alt1: build OK
2026-Oct-02 13:33:31 :: [x86_64] #100 pi-hole-ftl.git 6.7-alt1: build start
2026-Oct-02 13:34:21 :: [i586] #40 mbedtls.git 4.2.0-alt1: build OK
2026-Oct-02 13:34:21 :: [i586] #100 pi-hole-ftl.git 6.7-alt1: build start
2026-Oct-02 13:34:37 :: [aarch64] #40 mbedtls.git 4.2.0-alt1: build OK
2026-Oct-02 13:34:37 :: [aarch64] #100 pi-hole-ftl.git 6.7-alt1: build start
2026-Oct-02 13:35:25 :: [x86_64] #100 pi-hole-ftl.git 6.7-alt1: build OK
2026-Oct-02 13:35:25 :: [x86_64] #200 pi-hole.git 6.4.3-alt1: build start
2026-Oct-02 13:35:52 :: [x86_64] #200 pi-hole.git 6.4.3-alt1: build OK
2026-Oct-02 13:35:52 :: [x86_64] #300 pi-hole-web-6.6-alt1.src.rpm: build start
2026-Oct-02 13:36:11 :: [x86_64] #300 pi-hole-web-6.6-alt1.src.rpm: build OK
2026-Oct-02 13:36:17 :: [i586] #100 pi-hole-ftl.git 6.7-alt1: build OK
2026-Oct-02 13:36:18 :: [i586] #200 pi-hole.git 6.4.3-alt1: build start
2026-Oct-02 13:36:43 :: [i586] #200 pi-hole.git 6.4.3-alt1: build OK
2026-Oct-02 13:36:43 :: [i586] #300 pi-hole-web-6.6-alt1.src.rpm: build start
2026-Oct-02 13:37:01 :: [i586] #300 pi-hole-web-6.6-alt1.src.rpm: build OK
2026-Oct-02 13:37:51 :: [aarch64] #100 pi-hole-ftl.git 6.7-alt1: build OK
2026-Oct-02 13:37:52 :: [aarch64] #200 pi-hole.git 6.4.3-alt1: build start
2026-Oct-02 13:38:34 :: [aarch64] #200 pi-hole.git 6.4.3-alt1: build OK
2026-Oct-02 13:38:34 :: [aarch64] #300 pi-hole-web-6.6-alt1.src.rpm: build start
2026-Oct-02 13:39:04 :: [aarch64] #300 pi-hole-web-6.6-alt1.src.rpm: build OK
2026-Oct-02 13:39:18 :: 40: build check OK
2026-Oct-02 13:39:21 :: 100: build check OK
2026-Oct-02 13:39:24 :: 200: build check OK
2026-Oct-02 13:39:26 :: 300: build check OK
2026-Oct-02 13:39:27 :: build check OK
2026-Oct-02 13:39:49 :: #40: mbedtls.git 4.2.0-alt1: version check OK
2026-Oct-02 13:39:52 :: #100: pi-hole-ftl.git 6.7-alt1: version check OK
2026-Oct-02 13:39:54 :: #200: pi-hole.git 6.4.3-alt1: version check OK
2026-Oct-02 13:39:55 :: #300: pi-hole-web-6.6-alt1.src.rpm: version check OK
2026-Oct-02 13:39:56 :: build version check OK
2026-Oct-02 13:40:13 :: noarch check OK
2026-Oct-02 13:40:15 :: plan: src +4 -1 =20704, aarch64 +14 -9 =37188, i586 +14 -9 =35583, noarch +2 -0 =21600, x86_64 +14 -9 =38206
#40 mbedtls 3.6.3-alt1 -> 4.2.0-alt1
Tue Jul 07 2026 Nazarov Denis <nenderus@altlinux> 4.2.0-alt1
- Update mbedTLS to 4.2.0
- Update TF PSA Crypto to 1.2.0
Sat May 16 2026 Nazarov Denis <nenderus@altlinux> 4.1.0-alt2
- Enable threading support
Tue Mar 31 2026 Nazarov Denis <nenderus@altlinux> 4.1.0-alt1
- Update mbedTLS to 4.1.0
- Update TF PSA Crypto to 1.1.0
Wed Oct 15 2025 Nazarov Denis <nenderus@altlinux> 4.0.0-alt1
- New version 4.0.0.
[...]
2026-Oct-02 13:41:04 :: patched apt indices
2026-Oct-02 13:41:15 :: created next repo
2026-Oct-02 13:41:26 :: duplicate provides check OK
x86_64: NEW unmet dependencies detected:
imhex#1.33.2-alt1.2:p11+398657.2640.21.1@1764768423 libmbedcrypto.so.16()(64bit) >= set:niZwZp7CTr5U1wmzhubTbRGG7m4C4vE1beToFhyImCs3E40S6zyLFqnRS4hYj2z6Qd7PdzPJrm0KZw3tRj7f2cGcm
imhex-debuginfo#1.33.2-alt1.2:p11+398657.2640.21.1@1764768423 debug64(libmbedcrypto.so.16)
libbctoolbox#5.4.36-alt1:p11+395809.40.4.1@1761835841 libmbedcrypto.so.16()(64bit) >= set:nhfZsr2HC4JQ0ceLLSsNhvljms2XZLioT9AdOZ06SZpZiGWfBMHIkHZCfIIbf00YLYqZtcRmJjvkZF8BA8oaGCfXHvFM7JUkZpHy2mqNSTDp2DfVkR2KoxgvIgTdjkq5S3wLs8tH7VMTr4fQzfpHhfp4
libbctoolbox#5.4.36-alt1:p11+395809.40.4.1@1761835841 libmbedtls.so.21()(64bit) >= set:mhqntvVqctH9ZeMZj2XnFPelsbqBHbRtA4q0E5GMfWkyPL4ltVDE8ju1utIn4sAQB0LEGE9dQdZj2
libbctoolbox#5.4.36-alt1:p11+395809.40.4.1@1761835841 libmbedx509.so.7()(64bit) >= set:kfqchaZ13QOyr830APDugHFd55CNNZAmG2fnvC2t0zw1
libbctoolbox-debuginfo#5.4.36-alt1:p11+395809.40.4.1@1761835841 debug64(libmbedcrypto.so.16)
libbctoolbox-debuginfo#5.4.36-alt1:p11+395809.40.4.1@1761835841 debug64(libmbedtls.so.21)
libbctoolbox-debuginfo#5.4.36-alt1:p11+395809.40.4.1@1761835841 debug64(libmbedx509.so.7)
yuzu#1734-alt9:p11+415808.100.1.1@1776764261 libmbedcrypto.so.16()(64bit) >= set:nhkOh05Z12ddpzAsFFPBkLHGuI8I4vQwB2oostRmrYGMW4aOZy7wMmGvaf2EQ8kWfptqcdhYjxihhsrC7ePhZGncGZv90AZI73SfXJFCwhQ4g
yuzu-debuginfo#1734-alt9:p11+415808.100.1.1@1776764261 debug64(libmbedcrypto.so.16)
i586: NEW unmet dependencies detected:
libbctoolbox#5.4.36-alt1:p11+395809.40.4.1@1761835842 libmbedcrypto.so.16 >= set:nhfZsr2HC4JQ0ceLLSsNhvljms2XZLioT9AdOZ06SZpZiGWfBMHIkHZCfIIbf00YLYqZtcRmJjvkZF8BA8oaGCfXHvFM7JUkZpHy2mqNSTDp2DfVkR2KoxgvIgTdjkq5S3wLs8tH7VMTr4fQzfpHhfp4
libbctoolbox#5.4.36-alt1:p11+395809.40.4.1@1761835842 libmbedtls.so.21 >= set:mhqntvVqctH9ZeMZj2XnFPelsbqBHbRtA4q0E5GMfWkyPL4ltVDE8ju1utIn4sAQB0LEGE9dQdZj2
libbctoolbox#5.4.36-alt1:p11+395809.40.4.1@1761835842 libmbedx509.so.7 >= set:kfqchaZ13QOyr830APDugHFd55CNNZAmG2fnvC2t0zw1
libbctoolbox-debuginfo#5.4.36-alt1:p11+395809.40.4.1@1761835842 debug(libmbedcrypto.so.16)
libbctoolbox-debuginfo#5.4.36-alt1:p11+395809.40.4.1@1761835842 debug(libmbedtls.so.21)
libbctoolbox-debuginfo#5.4.36-alt1:p11+395809.40.4.1@1761835842 debug(libmbedx509.so.7)
aarch64: NEW unmet dependencies detected:
imhex#1.33.2-alt1.2:p11+398657.2640.21.1@1764772468 libmbedcrypto.so.16()(64bit) >= set:niZwZp7CTr5U1wmzhubTbRGG7m4C4vE1beToFhyImCs3E40S6zyLFqnRS4hYj2z6Qd7PdzPJrm0KZw3tRj7f2cGcm
imhex-debuginfo#1.33.2-alt1.2:p11+398657.2640.21.1@1764772468 debug64(libmbedcrypto.so.16)
libbctoolbox#5.4.36-alt1:p11+395809.40.4.1@1761835887 libmbedcrypto.so.16()(64bit) >= set:nhfZsr2HC4JQ0ceLLSsNhvljms2XZLioT9AdOZ06SZpZiGWfBMHIkHZCfIIbf00YLYqZtcRmJjvkZF8BA8oaGCfXHvFM7JUkZpHy2mqNSTDp2DfVkR2KoxgvIgTdjkq5S3wLs8tH7VMTr4fQzfpHhfp4
libbctoolbox#5.4.36-alt1:p11+395809.40.4.1@1761835887 libmbedtls.so.21()(64bit) >= set:mhqntvVqctH9ZeMZj2XnFPelsbqBHbRtA4q0E5GMfWkyPL4ltVDE8ju1utIn4sAQB0LEGE9dQdZj2
libbctoolbox#5.4.36-alt1:p11+395809.40.4.1@1761835887 libmbedx509.so.7()(64bit) >= set:kfqchaZ13QOyr830APDugHFd55CNNZAmG2fnvC2t0zw1
libbctoolbox-debuginfo#5.4.36-alt1:p11+395809.40.4.1@1761835887 debug64(libmbedcrypto.so.16)
libbctoolbox-debuginfo#5.4.36-alt1:p11+395809.40.4.1@1761835887 debug64(libmbedtls.so.21)
libbctoolbox-debuginfo#5.4.36-alt1:p11+395809.40.4.1@1761835887 debug64(libmbedx509.so.7)
yuzu#1734-alt9:p11+415808.100.1.1@1776764590 libmbedcrypto.so.16()(64bit) >= set:nhkOh05Z12ddpzAsFFPBkLHGuI8I4vQwB2oostRmrYGMW4aOZy7wMmGvaf2EQ8kWfptqcdhYjxihhsrC7ePhZGncGZv90AZI73SfXJFCwhQ4g
yuzu-debuginfo#1734-alt9:p11+415808.100.1.1@1776764590 debug64(libmbedcrypto.so.16)
ACLs of affected packages (3):
imhex
libbctoolbox
yuzu
2026-Oct-02 13:42:08 :: unmets: x86_64 +10 -0 =10, i586 +6 -0 =6, aarch64 +10 -0 =13
2026-Oct-02 13:42:08 :: dependencies check FAILED
2026-Oct-02 13:42:08 :: task #435104 for p11 FAILED
^ permalink raw reply [flat|nested] 4+ messages in thread
* [#435104] [test-only] p11 FAILED (try 3) mbedtls.git=4.2.0-alt1 pi-hole-ftl.git=6.7-alt1 pi-hole.git=6.4.3-alt1 ...
2026-10-02 13:20 [#435104] [test-only] p11 FAILED pi-hole-ftl.git=6.7-alt1 pi-hole.git=6.4.3-alt1 Girar awaiter (andy)
2026-10-02 13:42 ` [#435104] [test-only] p11 FAILED (try 2) mbedtls.git=4.2.0-alt1 " Girar awaiter (andy)
@ 2026-10-02 13:48 ` Girar awaiter (andy)
2026-10-02 14:24 ` [#435104] [test-only] p11 FAILED (try 4) " Girar awaiter (andy)
2 siblings, 0 replies; 4+ messages in thread
From: Girar awaiter (andy) @ 2026-10-02 13:48 UTC (permalink / raw)
To: Andrew A. Vasilyev
Cc: sisyphus-incominger, girar-builder-p11, girar-builder-p11
https://git.altlinux.org/tasks/435104/logs/events.3.1.log
https://packages.altlinux.org/tasks/435104
subtask name aarch64 i586 x86_64
#400 libbctoolbox ? failed failed
2026-Oct-02 13:47:01 :: test-only task #435104 for p11 resumed by andy:
2026-Oct-02 13:47:01 :: message: Test
#40 build 4.2.0-alt1 from /gears/m/mbedtls.git fetched at 2026-Oct-02 13:31:00 from sisyphus
#100 build 6.7-alt1 from /gears/p/pi-hole-ftl.git fetched at 2026-Oct-02 13:17:14 from sisyphus
#200 build 6.4.3-alt1 from /gears/p/pi-hole.git fetched at 2026-Oct-02 13:17:16 from sisyphus
#300 build pi-hole-web-6.6-alt1.src.rpm from sisyphus
#400 build 5.4.36-alt1 from /gears/l/libbctoolbox.git fetched at 2026-Oct-02 13:46:26 from p11
#500 build 1.33.2-alt1.2 from /gears/i/imhex.git fetched at 2026-Oct-02 13:46:41 from p11
#600 build 1734-alt9 from /gears/y/yuzu.git fetched at 2026-Oct-02 13:46:53 from p11
2026-Oct-02 13:47:02 :: created build repo
2026-Oct-02 13:47:03 :: [i586] #40 mbedtls.git 4.2.0-alt1: build start
2026-Oct-02 13:47:03 :: [aarch64] #40 mbedtls.git 4.2.0-alt1: build start
2026-Oct-02 13:47:03 :: [x86_64] #40 mbedtls.git 4.2.0-alt1: build start
2026-Oct-02 13:47:16 :: [i586] #40 mbedtls.git 4.2.0-alt1: build OK (cached)
2026-Oct-02 13:47:16 :: [i586] #100 pi-hole-ftl.git 6.7-alt1: build start
2026-Oct-02 13:47:17 :: [x86_64] #40 mbedtls.git 4.2.0-alt1: build OK (cached)
2026-Oct-02 13:47:18 :: [x86_64] #100 pi-hole-ftl.git 6.7-alt1: build start
2026-Oct-02 13:47:29 :: [aarch64] #40 mbedtls.git 4.2.0-alt1: build OK (cached)
2026-Oct-02 13:47:29 :: [aarch64] #100 pi-hole-ftl.git 6.7-alt1: build start
2026-Oct-02 13:47:30 :: [i586] #100 pi-hole-ftl.git 6.7-alt1: build OK (cached)
2026-Oct-02 13:47:30 :: [i586] #200 pi-hole.git 6.4.3-alt1: build start
2026-Oct-02 13:47:32 :: [x86_64] #100 pi-hole-ftl.git 6.7-alt1: build OK (cached)
2026-Oct-02 13:47:32 :: [x86_64] #200 pi-hole.git 6.4.3-alt1: build start
2026-Oct-02 13:47:43 :: [i586] #200 pi-hole.git 6.4.3-alt1: build OK (cached)
2026-Oct-02 13:47:43 :: [i586] #300 pi-hole-web-6.6-alt1.src.rpm: build start
2026-Oct-02 13:47:46 :: [x86_64] #200 pi-hole.git 6.4.3-alt1: build OK (cached)
2026-Oct-02 13:47:46 :: [x86_64] #300 pi-hole-web-6.6-alt1.src.rpm: build start
2026-Oct-02 13:47:53 :: [aarch64] #100 pi-hole-ftl.git 6.7-alt1: build OK (cached)
2026-Oct-02 13:47:54 :: [aarch64] #200 pi-hole.git 6.4.3-alt1: build start
2026-Oct-02 13:47:56 :: [i586] #300 pi-hole-web-6.6-alt1.src.rpm: build OK (cached)
2026-Oct-02 13:47:56 :: [i586] #400 libbctoolbox.git 5.4.36-alt1: build start
2026-Oct-02 13:48:00 :: [x86_64] #300 pi-hole-web-6.6-alt1.src.rpm: build OK (cached)
2026-Oct-02 13:48:00 :: [x86_64] #400 libbctoolbox.git 5.4.36-alt1: build start
2026-Oct-02 13:48:18 :: [aarch64] #200 pi-hole.git 6.4.3-alt1: build OK (cached)
2026-Oct-02 13:48:18 :: [aarch64] #300 pi-hole-web-6.6-alt1.src.rpm: build start
[i586] cd /usr/src/RPM/BUILD/libbctoolbox-5.4.36/i586-alt-linux/src && /usr/bin/cc -DHAVE_CONFIG_H -Dbctoolbox_EXPORTS -I/usr/src/RPM/BUILD/libbctoolbox-5.4.36/include -I/usr/src/RPM/BUILD/libbctoolbox-5.4.36/src -I/usr/src/RPM/BUILD/libbctoolbox-5.4.36/i586-alt-linux -pipe -frecord-gcc-switches -Wall -g -O2 -flto=auto -march=i586 -mtune=generic -fPIC -Wall -Wuninitialized -Wno-error=pragmas -Werror -Wextra -Wunused-parameter -Wno-error=unknown-pragmas -Wuninitialized -Wno-missing-field-initializers -fno-strict-aliasing -Wno-error=deprecated -Wno-error=deprecated-declarations -Werror -Wstrict-prototypes -MD -MT src/CMakeFiles/bctoolbox.dir/crypto/mbedtls.c.o -MF CMakeFiles/bctoolbox.dir/crypto/mbedtls.c.o.d -o CMakeFiles/bctoolbox.dir/crypto/mbedtls.c.o -c /usr/src/RPM/BUILD/libbctoolbox-5.4.36/src/crypto/mbedtls.c
[i586] /usr/src/RPM/BUILD/libbctoolbox-5.4.36/src/crypto/mbedtls.c:28:10: fatal error: mbedtls/ctr_drbg.h: No such file or directory
[i586] 28 | #include <mbedtls/ctr_drbg.h>
2026-Oct-02 13:48:21 :: [i586] libbctoolbox.git 5.4.36-alt1: remote: build failed
2026-Oct-02 13:48:21 :: [i586] #400 libbctoolbox.git 5.4.36-alt1: build FAILED
2026-Oct-02 13:48:21 :: [i586] requesting cancellation of task processing
[x86_64] cd /usr/src/RPM/BUILD/libbctoolbox-5.4.36/x86_64-alt-linux/src && /usr/bin/cc -DHAVE_CONFIG_H -Dbctoolbox_EXPORTS -I/usr/src/RPM/BUILD/libbctoolbox-5.4.36/include -I/usr/src/RPM/BUILD/libbctoolbox-5.4.36/src -I/usr/src/RPM/BUILD/libbctoolbox-5.4.36/x86_64-alt-linux -pipe -frecord-gcc-switches -Wall -g -O2 -flto=auto -fPIC -Wall -Wuninitialized -Wno-error=pragmas -Werror -Wextra -Wunused-parameter -Wno-error=unknown-pragmas -Wuninitialized -Wno-missing-field-initializers -fno-strict-aliasing -Wno-error=deprecated -Wno-error=deprecated-declarations -Werror -Wstrict-prototypes -MD -MT src/CMakeFiles/bctoolbox.dir/crypto/mbedtls.c.o -MF CMakeFiles/bctoolbox.dir/crypto/mbedtls.c.o.d -o CMakeFiles/bctoolbox.dir/crypto/mbedtls.c.o -c /usr/src/RPM/BUILD/libbctoolbox-5.4.36/src/crypto/mbedtls.c
[x86_64] /usr/src/RPM/BUILD/libbctoolbox-5.4.36/src/crypto/mbedtls.c:28:10: fatal error: mbedtls/ctr_drbg.h: No such file or directory
[x86_64] 28 | #include <mbedtls/ctr_drbg.h>
2026-Oct-02 13:48:26 :: [x86_64] libbctoolbox.git 5.4.36-alt1: remote: build failed
2026-Oct-02 13:48:26 :: [x86_64] #400 libbctoolbox.git 5.4.36-alt1: build FAILED
2026-Oct-02 13:48:42 :: [aarch64] #300 pi-hole-web-6.6-alt1.src.rpm: build OK (cached)
2026-Oct-02 13:48:42 :: [aarch64] task processing CANCELLED
2026-Oct-02 13:48:21 :: [i586] build FAILED
2026-Oct-02 13:48:26 :: [x86_64] build FAILED
2026-Oct-02 13:48:42 :: [aarch64] build FAILED
2026-Oct-02 13:48:42 :: task #435104 for p11 FAILED
^ permalink raw reply [flat|nested] 4+ messages in thread
* [#435104] [test-only] p11 FAILED (try 4) mbedtls.git=4.2.0-alt1 pi-hole-ftl.git=6.7-alt1 pi-hole.git=6.4.3-alt1 ...
2026-10-02 13:20 [#435104] [test-only] p11 FAILED pi-hole-ftl.git=6.7-alt1 pi-hole.git=6.4.3-alt1 Girar awaiter (andy)
2026-10-02 13:42 ` [#435104] [test-only] p11 FAILED (try 2) mbedtls.git=4.2.0-alt1 " Girar awaiter (andy)
2026-10-02 13:48 ` [#435104] [test-only] p11 FAILED (try 3) " Girar awaiter (andy)
@ 2026-10-02 14:24 ` Girar awaiter (andy)
2 siblings, 0 replies; 4+ messages in thread
From: Girar awaiter (andy) @ 2026-10-02 14:24 UTC (permalink / raw)
To: Andrew A. Vasilyev
Cc: sisyphus-incominger, girar-builder-p11, girar-builder-p11
https://git.altlinux.org/tasks/435104/logs/events.4.1.log
https://packages.altlinux.org/tasks/435104
subtask name aarch64 i586 x86_64
#500 imhex ? - failed
#700 libbctoolbox ? failed ?
2026-Oct-02 14:21:56 :: test-only task #435104 for p11 resumed by andy:
2026-Oct-02 14:21:56 :: message: Test
#40 build 4.2.0-alt1 from /gears/m/mbedtls.git fetched at 2026-Oct-02 13:31:00 from sisyphus
#100 build 6.7-alt1 from /gears/p/pi-hole-ftl.git fetched at 2026-Oct-02 13:17:14 from sisyphus
#200 build 6.4.3-alt1 from /gears/p/pi-hole.git fetched at 2026-Oct-02 13:17:16 from sisyphus
#300 build pi-hole-web-6.6-alt1.src.rpm from sisyphus
#400 removed
#500 build 1.33.2-alt1.2 from /gears/i/imhex.git fetched at 2026-Oct-02 13:46:41 from p11
#600 build 1734-alt9 from /gears/y/yuzu.git fetched at 2026-Oct-02 13:46:53 from p11
#700 build 5.4.124-alt1 from /gears/l/libbctoolbox.git fetched at 2026-Oct-02 14:03:38 from sisyphus
2026-Oct-02 14:21:57 :: created build repo
2026-Oct-02 14:21:58 :: [i586] #40 mbedtls.git 4.2.0-alt1: build start
2026-Oct-02 14:21:58 :: [x86_64] #40 mbedtls.git 4.2.0-alt1: build start
2026-Oct-02 14:21:58 :: [aarch64] #40 mbedtls.git 4.2.0-alt1: build start
2026-Oct-02 14:22:14 :: [i586] #40 mbedtls.git 4.2.0-alt1: build OK (cached)
2026-Oct-02 14:22:15 :: [i586] #100 pi-hole-ftl.git 6.7-alt1: build start
2026-Oct-02 14:22:15 :: [x86_64] #40 mbedtls.git 4.2.0-alt1: build OK (cached)
2026-Oct-02 14:22:15 :: [x86_64] #100 pi-hole-ftl.git 6.7-alt1: build start
2026-Oct-02 14:22:28 :: [aarch64] #40 mbedtls.git 4.2.0-alt1: build OK (cached)
2026-Oct-02 14:22:28 :: [aarch64] #100 pi-hole-ftl.git 6.7-alt1: build start
2026-Oct-02 14:22:28 :: [i586] #100 pi-hole-ftl.git 6.7-alt1: build OK (cached)
2026-Oct-02 14:22:29 :: [i586] #200 pi-hole.git 6.4.3-alt1: build start
2026-Oct-02 14:22:29 :: [x86_64] #100 pi-hole-ftl.git 6.7-alt1: build OK (cached)
2026-Oct-02 14:22:30 :: [x86_64] #200 pi-hole.git 6.4.3-alt1: build start
2026-Oct-02 14:22:42 :: [i586] #200 pi-hole.git 6.4.3-alt1: build OK (cached)
2026-Oct-02 14:22:42 :: [i586] #300 pi-hole-web-6.6-alt1.src.rpm: build start
2026-Oct-02 14:22:44 :: [x86_64] #200 pi-hole.git 6.4.3-alt1: build OK (cached)
2026-Oct-02 14:22:44 :: [x86_64] #300 pi-hole-web-6.6-alt1.src.rpm: build start
2026-Oct-02 14:22:53 :: [aarch64] #100 pi-hole-ftl.git 6.7-alt1: build OK (cached)
2026-Oct-02 14:22:53 :: [aarch64] #200 pi-hole.git 6.4.3-alt1: build start
2026-Oct-02 14:22:56 :: [i586] #300 pi-hole-web-6.6-alt1.src.rpm: build OK (cached)
2026-Oct-02 14:22:56 :: [i586] #500 imhex.git 1.33.2-alt1.2: build start
2026-Oct-02 14:22:58 :: [x86_64] #300 pi-hole-web-6.6-alt1.src.rpm: build OK (cached)
2026-Oct-02 14:22:58 :: [x86_64] #500 imhex.git 1.33.2-alt1.2: build start
2026-Oct-02 14:23:11 :: [i586] #500 imhex.git 1.33.2-alt1.2: build SKIPPED
2026-Oct-02 14:23:11 :: [i586] #600 yuzu.git 1734-alt9: build start
2026-Oct-02 14:23:17 :: [aarch64] #200 pi-hole.git 6.4.3-alt1: build OK (cached)
2026-Oct-02 14:23:17 :: [aarch64] #300 pi-hole-web-6.6-alt1.src.rpm: build start
2026-Oct-02 14:23:25 :: [i586] #600 yuzu.git 1734-alt9: build SKIPPED
2026-Oct-02 14:23:25 :: [i586] #700 libbctoolbox.git 5.4.124-alt1: build start
[i586] <13>Oct 2 14:23:39 rpmi: libidn2-2.3.8-alt1 p11+393467.100.2.1 1758791484 installed
[i586] <13>Oct 2 14:23:39 rpmi: libnettle8-3.10.1-alt1 p11+372009.100.2.1 1738563806 installed
[i586] <13>Oct 2 14:23:39 rpmi: libp11-kit-1:0.26.5-alt1 p11+429276.100.1.1 1786546802 installed
[i586] <13>Oct 2 14:23:39 rpmi: libtasn1-4.21.0-alt2 p11+420752.100.2.1 1782199437 installed
[i586] <13>Oct 2 14:23:39 rpmi: libhogweed6-3.10.1-alt1 p11+372009.100.2.1 1738563806 installed
[i586] <13>Oct 2 14:23:39 rpmi: libgnutls30-3.8.13-alt1 p11+417121.100.2.1 1778247686 installed
[i586] <13>Oct 2 14:23:39 rpmi: libngtcp2.16-1.11.0-alt2 p11+375943.300.5.1 1744228751 installed
[i586] <13>Oct 2 14:23:39 rpmi: libngtcp2_crypto_gnutls8-1.11.0-alt2 p11+375943.300.5.1 1744228751 installed
[i586] <13>Oct 2 14:23:39 rpmi: cmake-modules-3.31.7-alt1.p11.1 p11+403032.1500.10.1 1769097360 installed
[i586] <13>Oct 2 14:23:39 rpmi: libuv-1.52.1-alt2 p11+426164.100.6.1 1786977633 installed
[i586] <13>Oct 2 14:23:39 rpmi: librhash-1.3.5-alt3 p11+349457.100.1.1 1716788945 installed
[i586] <13>Oct 2 14:23:39 rpmi: libjsoncpp24-1.9.4-alt2 sisyphus+346331.200.2.1 1716448553 installed
[i586] <13>Oct 2 14:23:39 rpmi: libexpat-2.7.1-alt1 p11+379972.100.3.1 1744981641 installed
[i586] <13>Oct 2 14:23:39 rpmi: publicsuffix-list-dafsa-20260624-alt1 p11+422797.100.2.1 1782914854 installed
[i586] <13>Oct 2 14:23:39 rpmi: libpsl-0.21.5-alt1 sisyphus+338474.100.1.1 1705684771 installed
[i586] <13>Oct 2 14:23:39 rpmi: libnghttp3.9-1.8.0-alt1 p11+375943.100.5.1 1744228695 installed
[i586] <13>Oct 2 14:23:39 rpmi: libnghttp2-1.69.0-alt2 p11+428573.300.2.1 1787170747 installed
[i586] <13>Oct 2 14:23:39 rpmi: openldap-common-2.6.13-alt1 p11+411714.200.1.1 1773763004 installed
[i586] <13>Oct 2 14:23:39 rpmi: libverto-0.3.2-alt1_1 sisyphus+321176.2200.10.2 1684806164 installed
[i586] <13>Oct 2 14:23:39 rpmi: liblmdb-0.9.35-alt1 p11+411714.100.1.1 1773761665 installed
[i586] <13>Oct 2 14:23:39 rpmi: libkeyutils-1.6.3-alt1 sisyphus+346336.200.2.2 1716472658 installed
[i586] <13>Oct 2 14:23:39 rpmi: libcom_err-1.47.1.0.10.ad56-alt2 p11+363484.200.2.1 1732737740 installed
[i586] <13>Oct 2 14:23:39 rpmi: libbrotlicommon-1.1.0-alt1 sisyphus+328501.100.1.1 1693598420 installed
[i586] <13>Oct 2 14:23:39 rpmi: libbrotlidec-1.1.0-alt1 sisyphus+328501.100.1.1 1693598420 installed
[i586] <13>Oct 2 14:23:39 rpmi: openssl-config-3.2.0-alt1 p11+370688.200.3.1 1738846989 installed
[i586] <13>Oct 2 14:23:39 rpmi: rpm-macros-cmake-3.29.1-alt1 sisyphus+344518.300.3.1 1712379787 installed
[i586] <13>Oct 2 14:23:39 rpmi: rpm-macros-alternatives-0.5.3-alt1 p11+371884.100.2.1 1738152096 installed
[i586] <13>Oct 2 14:23:39 rpmi: alternatives-0.5.3-alt1 p11+371884.100.2.1 1738152096 installed
[i586] <13>Oct 2 14:23:39 rpmi: ca-certificates-2026.04.22-alt1 p11+416631.100.4.1 1778259219 installed
[i586] <13>Oct 2 14:23:39 rpmi: ca-trust-0.2.0-alt1 sisyphus+344843.100.1.1 1712743326 installed
[i586] <13>Oct 2 14:23:39 rpmi: p11-kit-trust-1:0.26.5-alt1 p11+429276.100.1.1 1786546802 installed
[i586] <13>Oct 2 14:23:39 rpmi: libcrypto3-3.5.7-alt1 p11+425333.200.5.1 1786472203 installed
[i586] <13>Oct 2 14:23:39 rpmi: libssl3-3.5.7-alt1 p11+425333.200.5.1 1786472203 installed
[i586] <86>Oct 2 14:23:39 groupadd[2435968]: group added to /etc/group: name=_keytab, GID=999
[i586] <86>Oct 2 14:23:39 groupadd[2435968]: group added to /etc/gshadow: name=_keytab
[i586] <86>Oct 2 14:23:39 groupadd[2435968]: new group: name=_keytab, GID=999
[i586] <13>Oct 2 14:23:39 rpmi: libkrb5-1.21.3-alt2 p11+351858.100.3.1 1721055202 installed
[i586] <86>Oct 2 14:23:39 groupadd[2435975]: group added to /etc/group: name=sasl, GID=998
[i586] <86>Oct 2 14:23:39 groupadd[2435975]: group added to /etc/gshadow: name=sasl
[i586] <86>Oct 2 14:23:39 groupadd[2435975]: new group: name=sasl, GID=998
[i586] <13>Oct 2 14:23:39 rpmi: libsasl2-3-2.1.28-alt4 p11+418777.100.3.1 1780409773 installed
[i586] <13>Oct 2 14:23:39 rpmi: libldap2-2.6.13-alt1 p11+411714.200.1.1 1773762937 installed
[i586] <13>Oct 2 14:23:39 rpmi: libarchive13-3.8.5-alt1 p11+407700.100.1.1 1770634704 installed
[i586] <13>Oct 2 14:23:39 rpmi: libssh2-1.11.1-alt4 p11+428600.100.2.1 1786697727 installed
[i586] <13>Oct 2 14:23:40 rpmi: libcurl-8.22.0-alt1 p11+431629.100.2.1 1788808599 installed
[i586] <13>Oct 2 14:23:40 rpmi: cmake-3.31.7-alt1.p11.1 p11+403032.1500.10.1 1769096056 installed
[i586] Reading Package Lists...
[i586] Building Dependency Tree...
[i586] MI2a: marked for install (shallow): bcunit-devel
[i586] MI2a: satisfying Depends: bcunit = 5.4.46-alt1:p11+395809.20.4.1
[i586] MI2a: maybe install (a direct target): bcunit 5.4.46-alt1:p11+395809.20.4.1@1761835799
[i586] MI2a: target SELECTED: bcunit 5.4.46-alt1:p11+395809.20.4.1@1761835799
[i586] MI2a: requesting to install bcunit (unspec'd ver; inspect with Debug::pkgMark-shallow)
[i586] MI2a: marked for install (shallow): bcunit
[i586] MI2a: marked for install (shallow): gcc-c++
[i586] MI2a: satisfying Depends: gcc13-c++ (NULL)
[i586] MI2a: maybe install (a direct target): gcc13-c++ 13.2.1-alt3:sisyphus+339335.100.1.1@1706563095
[i586] MI2a: target SELECTED: gcc13-c++ 13.2.1-alt3:sisyphus+339335.100.1.1@1706563095
[i586] MI2a: requesting to install gcc13-c++ (unspec'd ver; inspect with Debug::pkgMark-shallow)
[i586] MI2a: marked for install (shallow): gcc13-c++
[i586] MI2a: satisfying Depends: libstdc++13-devel = 13.2.1-alt3:sisyphus+339335.100.1.1
[i586] MI2a: maybe install (a direct target): libstdc++13-devel 13.2.1-alt3:sisyphus+339335.100.1.1@1706563095
[i586] MI2a: target SELECTED: libstdc++13-devel 13.2.1-alt3:sisyphus+339335.100.1.1@1706563095
[i586] MI2a: requesting to install libstdc++13-devel (unspec'd ver; inspect with Debug::pkgMark-shallow)
[i586] MI2a: marked for install (shallow): libstdc++13-devel
[i586] MI2a: satisfying PreDepends: gcc-c++-common >= 1.4.7
[i586] MI2a: maybe install (a direct target): gcc-c++-common 1.4.28-alt1:sisyphus+348678.100.1.1@1716396142
[i586] MI2a: target SELECTED: gcc-c++-common 1.4.28-alt1:sisyphus+348678.100.1.1@1716396142
[i586] MI2a: requesting to install gcc-c++-common (unspec'd ver; inspect with Debug::pkgMark-shallow)
[i586] MI2a: marked for install (shallow): gcc-c++-common
[i586] cmake is already the newest version.
[i586] E: Couldn't find package libmbedtls-3.6-devel
[i586] hsh-install: Failed to calculate package file list.
[i586] hsh-install: Failed to generate package file list.
2026-Oct-02 14:23:41 :: [i586] libbctoolbox.git 5.4.124-alt1: remote: cannot build src.rpm
2026-Oct-02 14:23:41 :: [i586] #700 libbctoolbox.git 5.4.124-alt1: build FAILED
2026-Oct-02 14:23:41 :: [i586] requesting cancellation of task processing
2026-Oct-02 14:23:42 :: [aarch64] #300 pi-hole-web-6.6-alt1.src.rpm: build OK (cached)
2026-Oct-02 14:23:42 :: [aarch64] task processing CANCELLED
[x86_64] cd /usr/src/RPM/BUILD/imhex-1.33.2/x86_64-alt-linux/lib/libimhex && /usr/bin/c++ -DBACKTRACE_HEADER=\"execinfo.h\" -DFMT_SHARED -DHEX_HAS_EXECINFO -DIMHEX_PROJECT_NAME=\"libimhex\" -DNDEBUG -DOS_LINUX -DSYSTEM_PLUGINS_LOCATION=\"/usr/lib64/imhex\" -Dlibimhex_EXPORTS -I/usr/src/RPM/BUILD/imhex-1.33.2/lib/libimhex/include -I/usr/src/RPM/BUILD/imhex-1.33.2/lib/third_party/xdgpp -I/usr/src/RPM/BUILD/imhex-1.33.2/lib/third_party/microtar/include -I/usr/src/RPM/BUILD/imhex-1.33.2/lib/external/libwolv/libs/types/include -I/usr/src/RPM/BUILD/imhex-1.33.2/lib/external/libwolv/libs/utils/include -I/usr/src/RPM/BUILD/imhex-1.33.2/lib/external/libwolv/libs/io/include -I/usr/src/RPM/BUILD/imhex-1.33.2/lib/external/libwolv/libs/hash/include -I/usr/src/RPM/BUILD/imhex-1.33.2/lib/external/libwolv/libs/net/include -I/usr/src/RPM/BUILD/imhex-1.33.2/lib/external/libwolv/libs/containers/include -I/usr/src/RPM/BUILD/imhex-1.33.2/lib/external/libwolv/libs/math_eval/include -I/usr/src/RPM/BUILD/imhex-1.33.2/lib/third_party/jthread/includes -I/usr/src/RPM/BUILD/imhex-1.33.2/lib/external/pattern_language/lib/include -I/usr/src/RPM/BUILD/imhex-1.33.2/lib/third_party/imgui/imgui/include -I/usr/src/RPM/BUILD/imhex-1.33.2/lib/third_party/imgui/imgui/include/misc/freetype -I/usr/include/freetype2 -I/usr/src/RPM/BUILD/imhex-1.33.2/lib/third_party/imgui/implot/include -I/usr/src/RPM/BUILD/imhex-1.33.2/lib/third_party/imgui/imnodes/include -I/usr/src/RPM/BUILD/imhex-1.33.2/lib/third_party/imgui/custom/include -I/usr/src/RPM/BUILD/imhex-1.33.2/lib/third_party/imgui/ColorTextEditor/include -pipe -frecord-gcc-switches -Wall -g -O2 -flto=auto -Wall -Wextra -Wpedantic -Werror -rdynamic -Wno-unknown-warning-option -Wno-array-bounds -Wno-deprecated-declarations -Wno-unknown-pragmas -Wno-restrict -Wno-stringop-overread -Wno-stringop-overflow -Wno-dangling-reference -fexceptions -frtti -O2 -g -DNDEBUG -std=gnu++23 -fPIC -Wall -Wextra -Wpedantic -Werror -rdynamic -Wno-unknown-warning-option -Wno-array-bounds -Wno-deprecated-declarations -Wno-unknown-pragmas -Wno-restrict -Wno-stringop-overread -Wno-stringop-overflow -Wno-dangling-reference -MD -MT lib/libimhex/CMakeFiles/libimhex.dir/source/helpers/crypto.cpp.o -MF CMakeFiles/libimhex.dir/source/helpers/crypto.cpp.o.d -o CMakeFiles/libimhex.dir/source/helpers/crypto.cpp.o -c /usr/src/RPM/BUILD/imhex-1.33.2/lib/libimhex/source/helpers/crypto.cpp
[x86_64] /usr/src/RPM/BUILD/imhex-1.33.2/lib/libimhex/source/helpers/crypto.cpp:9:10: fatal error: mbedtls/bignum.h: No such file or directory
[x86_64] 9 | #include <mbedtls/bignum.h>
2026-Oct-02 14:24:29 :: [x86_64] imhex.git 1.33.2-alt1.2: remote: build failed
2026-Oct-02 14:24:29 :: [x86_64] #500 imhex.git 1.33.2-alt1.2: build FAILED
2026-Oct-02 14:23:41 :: [i586] build FAILED
2026-Oct-02 14:23:42 :: [aarch64] build FAILED
2026-Oct-02 14:24:29 :: [x86_64] build FAILED
2026-Oct-02 14:24:29 :: task #435104 for p11 FAILED
^ permalink raw reply [flat|nested] 4+ messages in thread
end of thread, other threads:[~2026-10-02 14:24 UTC | newest]
Thread overview: 4+ messages (download: mbox.gz / follow: Atom feed)
-- links below jump to the message on this page --
2026-10-02 13:20 [#435104] [test-only] p11 FAILED pi-hole-ftl.git=6.7-alt1 pi-hole.git=6.4.3-alt1 Girar awaiter (andy)
2026-10-02 13:42 ` [#435104] [test-only] p11 FAILED (try 2) mbedtls.git=4.2.0-alt1 " Girar awaiter (andy)
2026-10-02 13:48 ` [#435104] [test-only] p11 FAILED (try 3) " Girar awaiter (andy)
2026-10-02 14:24 ` [#435104] [test-only] p11 FAILED (try 4) " Girar awaiter (andy)
ALT Linux Girar Builder robot reports
This inbox may be cloned and mirrored by anyone:
# this inbox consists of 2 epochs:
git clone --mirror http://lore.altlinux.org/sisyphus-incominger/0 sisyphus-incominger/git/0.git # oldest
git clone --mirror http://lore.altlinux.org/sisyphus-incominger/1 sisyphus-incominger/git/1.git # newest
# If you have public-inbox 1.1+ installed, you may
# initialize and index your mirror using the following commands:
public-inbox-init -V2 sisyphus-incominger sisyphus-incominger/ http://lore.altlinux.org/sisyphus-incominger \
sisyphus-incominger@lists.altlinux.org sisyphus-incominger@lists.altlinux.ru sisyphus-incominger@lists.altlinux.com
public-inbox-index sisyphus-incominger
Example config snippet for mirrors.
Newsgroup available over NNTP:
nntp://lore.altlinux.org/org.altlinux.lists.sisyphus-incominger
AGPL code for this site: git clone https://public-inbox.org/public-inbox.git