ALT Linux Girar Builder robot reports
 help / color / mirror / Atom feed
* [#343887] [test-only] p10 FAILED tomcat10.git=10.1.20-alt1_jvm17
@ 2024-03-29  7:43 Girar awaiter (aminov)
  2024-03-29  8:08 ` [#343887] [test-only] p10 FAILED (try 2) srpm=jpackage-generic-compat-0.43-alt1.src.rpm Girar awaiter (aminov)
                   ` (2 more replies)
  0 siblings, 3 replies; 4+ messages in thread
From: Girar awaiter (aminov) @ 2024-03-29  7:43 UTC (permalink / raw)
  To: Ilfat Aminov; +Cc: girar-builder-p10, sisyphus-incominger, girar-builder-p10

https://git.altlinux.org/tasks/343887/logs/events.1.1.log

subtask  name      aarch64  armh    i586  ppc64le  x86_64
   #100  tomcat10   failed     -  failed   failed  failed

2024-Mar-29 07:43:08 :: test-only task #343887 for p10 started by aminov:
#100 build 10.1.20-alt1_jvm17 from /gears/t/tomcat10.git fetched at 2024-Mar-29 07:42:55 from sisyphus
2024-Mar-29 07:43:12 :: [aarch64] #100 tomcat10.git 10.1.20-alt1_jvm17: build start
2024-Mar-29 07:43:12 :: [armh] #100 tomcat10.git 10.1.20-alt1_jvm17: build start
2024-Mar-29 07:43:12 :: [x86_64] #100 tomcat10.git 10.1.20-alt1_jvm17: build start
2024-Mar-29 07:43:12 :: [i586] #100 tomcat10.git 10.1.20-alt1_jvm17: build start
2024-Mar-29 07:43:12 :: [ppc64le] #100 tomcat10.git 10.1.20-alt1_jvm17: build start
[i586] <13>Mar 29 07:43:22 rpmi: rpm-macros-java-1:5.3.0-alt1_15jpp11 sisyphus+278038.500.1.3 1625987751 installed
[i586] <13>Mar 29 07:43:22 rpmi: rpm-macros-alternatives-0.5.2-alt1 p10+309129.100.2.1 1668066636 installed
[i586] sh: /usr/share/java-utils/java-functions: No such file or directory
[i586] Reading Package Lists...
[i586] Building Dependency Tree...
[i586] MI2a: marked for install (shallow): rpm-build-java
[i586] MI2a:  satisfying Depends: python3  (NULL)
[i586] MI2a:   maybe install (a direct target): python3 3.9.18-alt1:p10+340781.400.5.1@1709555565
[i586] MI2a:  target SELECTED: python3 3.9.18-alt1:p10+340781.400.5.1@1709555565
[i586] MI2a:  requesting to install python3 (unspec'd ver; inspect with Debug::pkgMark-shallow)
[i586] MI2a:    marked for install (shallow): python3
[i586] MI2a:     satisfying Depends: python3-base = 3.9.18-alt1:p10+340781.400.5.1
[i586] MI2a:      maybe install (a direct target): python3-base 3.9.18-alt1:p10+340781.400.5.1@1709555565
[i586] MI2a:     target SELECTED: python3-base 3.9.18-alt1:p10+340781.400.5.1@1709555565
[i586] MI2a:     requesting to install python3-base (unspec'd ver; inspect with Debug::pkgMark-shallow)
[i586] MI2a:       marked for install (shallow): python3-base
[i586] MI2a:        satisfying Depends: libcrypto.so.1.1 >= set:qjvVyozNUGc9WsG7VIFPYfHMrhrfJYgsQGOmWGCgVZEeTZ3cW6ohfNyjEWIGMylk83WroOe8cvPBvDMJxj1EHIA8NcJhgZsZubMZ3n8WLt90Guhkrfl3MAsRNSE9EjmjidVpKZofuT86ioTKZKf8EB4PgGdTs1wCJderfDwMIu11WY3VxroBBL0WWhLaLkvG2dcqN5qFjpcMZdKztTSyjxzS8wKa4kvw0X9ziomSLa1mAKEgNWGjClqjdGA9WxgNcsSKoD7usW5NEHYZDL2VaeqOFOeSjZbP0CvmDlGUWpFt4IKh6ZhQwz9Pp77PWAt9PjND7Sgq0YyTXnW5K77cGZDYYy4RtH0
[i586] MI2a:         maybe install (a providing target): libcrypto1.1 1.1.1w-alt0.p10.1:p10+330586.100.4.1@1697561043
[i586] MI2a:        target SELECTED: libcrypto1.1 1.1.1w-alt0.p10.1:p10+330586.100.4.1@1697561043
[i586] MI2a:        requesting to install libcrypto1.1 (unspec'd ver; inspect with Debug::pkgMark-shallow)
[i586] MI2a:          marked for install (shallow): libcrypto1.1
[i586] MI2a:           satisfying Depends: ca-certificates  (NULL)
[i586] MI2a:            maybe install (a direct target): ca-certificates 2022.09.15-alt1:p10+308004.100.2.1@1665748370
[i586] MI2a:           target SELECTED: ca-certificates 2022.09.15-alt1:p10+308004.100.2.1@1665748370
[i586] MI2a:           requesting to install ca-certificates (unspec'd ver; inspect with Debug::pkgMark-shallow)
[i586] MI2a:             marked for install (shallow): ca-certificates
[i586] MI2a:              satisfying Depends: ca-trust  (NULL)
[i586] MI2a:               maybe install (a direct target): ca-trust 0.1.4-alt1:p10+308691.100.3.1@1667496283
[i586] MI2a:              target SELECTED: ca-trust 0.1.4-alt1:p10+308691.100.3.1@1667496283
[i586] MI2a:              requesting to install ca-trust (unspec'd ver; inspect with Debug::pkgMark-shallow)
[i586] MI2a:                marked for install (shallow): ca-trust
[i586] MI2a:                 satisfying Depends: p11-kit-trust  (NULL)
[i586] MI2a:                  maybe install (a direct target): p11-kit-trust 0.24.1-alt1:p10+305061.100.3.1@1660573407
[i586] MI2a:                 target SELECTED: p11-kit-trust 0.24.1-alt1:p10+305061.100.3.1@1660573407
[i586] MI2a:                 requesting to install p11-kit-trust (unspec'd ver; inspect with Debug::pkgMark-shallow)
[i586] MI2a:                   marked for install (shallow): p11-kit-trust
[i586] MI2a:                    satisfying Depends: /etc/alternatives/packages.d  (NULL)
[i586] MI2a:                     maybe install (a providing target): alternatives 0.5.2-alt1:p10+309129.100.2.1@1668066636
[i586] MI2a:                    target SELECTED: alternatives 0.5.2-alt1:p10+309129.100.2.1@1668066636
[i586] MI2a:                    requesting to install alternatives (unspec'd ver; inspect with Debug::pkgMark-shallow)
[i586] MI2a:                      marked for install (shallow): alternatives
[i586] MI2a:                    satisfying Depends: libtasn1.so.6 >= set:jfRaXblmF8mf5SLNNXDA2CDacDxCZqQOspDh1
[i586] MI2a:                     maybe install (a providing target): libtasn1 4.19.0-alt1:p10+309071.100.2.1@1668522764
[i586] MI2a:                    target SELECTED: libtasn1 4.19.0-alt1:p10+309071.100.2.1@1668522764
[i586] MI2a:                    requesting to install libtasn1 (unspec'd ver; inspect with Debug::pkgMark-shallow)
[i586] MI2a:                      marked for install (shallow): libtasn1
[i586] MI2a:                    satisfying Depends: libp11-kit = 0.24.1-alt1:p10+305061.100.3.1
[i586] MI2a:                     maybe install (a direct target): libp11-kit 0.24.1-alt1:p10+305061.100.3.1@1660573407
[i586] MI2a:                    target SELECTED: libp11-kit 0.24.1-alt1:p10+305061.100.3.1@1660573407
[i586] MI2a:                    requesting to install libp11-kit (unspec'd ver; inspect with Debug::pkgMark-shallow)
[i586] MI2a:                      marked for install (shallow): libp11-kit
[i586] MI2a:        satisfying Depends: libexpat.so.1 >= set:keKUFski4R0wXtka97olBOZ17REKhz7nL8ZKWHPFZ33uhaXbVkjsQcSJH5elImuwVDsGFzPXw0tsVy6wZI95ZiDLZowTr2df2WZv3q3kSPgdYNzXg
[i586] MI2a:         maybe install (a providing target): libexpat 2.5.0-alt1:p10+324220.100.1.1@1688465139
[i586] MI2a:        target SELECTED: libexpat 2.5.0-alt1:p10+324220.100.1.1@1688465139
[i586] MI2a:        requesting to install libexpat (unspec'd ver; inspect with Debug::pkgMark-shallow)
[i586] MI2a:          marked for install (shallow): libexpat
[i586] MI2a:        satisfying Depends: libgdbm.so.3 >= set:iejT6M96OmuT9HlYJ7ooGKIqQHH2
[i586] MI2a:         maybe install (a providing target): libgdbm 1.8.3-alt10:sisyphus+278100.1600.1.1@1626059138
[i586] MI2a:        target SELECTED: libgdbm 1.8.3-alt10:sisyphus+278100.1600.1.1@1626059138
[i586] MI2a:        requesting to install libgdbm (unspec'd ver; inspect with Debug::pkgMark-shallow)
[i586] MI2a:          marked for install (shallow): libgdbm
[i586] MI2a:        satisfying Depends: libssl.so.1.1 >= set:mfaB9uCfqgEZKlBwqPpgntxX2eJBMPNn4g1DtLmc9Y8ned8di2Akpva8awQUEZ6dZdsRvIlt2f6wZz9vQkhckwUWPRL2v7lRWwPb0I29PRV6VkgSw4c4yyLZBFr9cpkB0djb2kqvZiyUZlJTuYnJPH5MC1dJLCwASLNDaR1zA4dNZAg8MsyiFpQDCyvgKkMnoWXjSaBIByJ9D5FGpJ2kFynDnEsGfX0CCWF5
[i586] MI2a:         maybe install (a providing target): libssl1.1 1.1.1w-alt0.p10.1:p10+330586.100.4.1@1697561043
[i586] MI2a:        target SELECTED: libssl1.1 1.1.1w-alt0.p10.1:p10+330586.100.4.1@1697561043
[i586] MI2a:        requesting to install libssl1.1 (unspec'd ver; inspect with Debug::pkgMark-shallow)
[i586] MI2a:          marked for install (shallow): libssl1.1
[i586] MI2a:  satisfying Depends: javapackages-tools = 1:5.3.0-alt1_15jpp11:sisyphus+278038.500.1.3
[i586] MI2a:   maybe install (a direct target): javapackages-tools 1:5.3.0-alt1_15jpp11:sisyphus+278038.500.1.3@1625987751
[i586] MI2a:  target SELECTED: javapackages-tools 1:5.3.0-alt1_15jpp11:sisyphus+278038.500.1.3@1625987751
[i586] MI2a:  requesting to install javapackages-tools (unspec'd ver; inspect with Debug::pkgMark-shallow)
[i586] MI2a:    marked for install (shallow): javapackages-tools
[i586] MI2a:     satisfying Depends: javapackages-filesystem = 1:5.3.0-alt1_15jpp11:sisyphus+278038.500.1.3
[i586] MI2a:      maybe install (a direct target): javapackages-filesystem 1:5.3.0-alt1_15jpp11:sisyphus+278038.500.1.3@1625987751
[i586] MI2a:     target SELECTED: javapackages-filesystem 1:5.3.0-alt1_15jpp11:sisyphus+278038.500.1.3@1625987751
[i586] MI2a:     requesting to install javapackages-filesystem (unspec'd ver; inspect with Debug::pkgMark-shallow)
[i586] MI2a:       marked for install (shallow): javapackages-filesystem
[i586] MI2a:  satisfying Depends: python3-module-javapackages = 1:5.3.0-alt1_15jpp11:sisyphus+278038.500.1.3
[i586] MI2a:   maybe install (a direct target): python3-module-javapackages 1:5.3.0-alt1_15jpp11:sisyphus+278038.500.1.3@1625987751
[i586] MI2a:  target SELECTED: python3-module-javapackages 1:5.3.0-alt1_15jpp11:sisyphus+278038.500.1.3@1625987751
[i586] MI2a:  requesting to install python3-module-javapackages (unspec'd ver; inspect with Debug::pkgMark-shallow)
[i586] MI2a:    marked for install (shallow): python3-module-javapackages
[i586] MI2a:     satisfying Depends: python3-module-lxml  (NULL)
[i586] MI2a:      maybe install (a direct target): python3-module-lxml 4.9.3-alt1:p10+329617.100.2.1@1695317789
[i586] MI2a:     target SELECTED: python3-module-lxml 4.9.3-alt1:p10+329617.100.2.1@1695317789
[i586] MI2a:     requesting to install python3-module-lxml (unspec'd ver; inspect with Debug::pkgMark-shallow)
[i586] MI2a:       marked for install (shallow): python3-module-lxml
[i586] MI2a:        satisfying Depends: python3-module-cssselect  (NULL)
[i586] MI2a:         maybe install (a direct target): python3-module-cssselect 0.9.1-alt3:sisyphus+270533.2600.6.1@1619684675
[i586] MI2a:        target SELECTED: python3-module-cssselect 0.9.1-alt3:sisyphus+270533.2600.6.1@1619684675
[i586] MI2a:        requesting to install python3-module-cssselect (unspec'd ver; inspect with Debug::pkgMark-shallow)
[i586] MI2a:          marked for install (shallow): python3-module-cssselect
[i586] MI2a:        satisfying Depends: libexslt.so.0 >= set:ifFYpbWiXMSnz0
[i586] MI2a:         maybe install (a providing target): libxslt 1.1.34-alt3:sisyphus+275636.100.1.1@1624616871
[i586] MI2a:        target SELECTED: libxslt 1.1.34-alt3:sisyphus+275636.100.1.1@1624616871
[i586] MI2a:        requesting to install libxslt (unspec'd ver; inspect with Debug::pkgMark-shallow)
[i586] MI2a:          marked for install (shallow): libxslt
[i586] MI2a:        satisfying Depends: python3(html5lib) < 0
[i586] MI2a:         maybe install (a providing target): python3-module-html5lib 1:1.1-alt1:sisyphus+278096.120.5.1@1626086978
[i586] MI2a:        target SELECTED: python3-module-html5lib 1:1.1-alt1:sisyphus+278096.120.5.1@1626086978
[i586] MI2a:        requesting to install python3-module-html5lib (unspec'd ver; inspect with Debug::pkgMark-shallow)
[i586] MI2a:          marked for install (shallow): python3-module-html5lib
[i586] MI2a:           satisfying Depends: python3(genshi.core) < 0
[i586] MI2a:            maybe install (a providing target): python3-module-genshi 0.7.4-alt2:sisyphus+275930.100.2.1@1624873830
[i586] MI2a:           target SELECTED: python3-module-genshi 0.7.4-alt2:sisyphus+275930.100.2.1@1624873830
[i586] MI2a:           requesting to install python3-module-genshi (unspec'd ver; inspect with Debug::pkgMark-shallow)
[i586] MI2a:             marked for install (shallow): python3-module-genshi
[i586] MI2a:              satisfying Depends: python3(six) < 0
[i586] MI2a:               maybe install (a providing target): python3-module-six 1.16.0-alt1.p10:p10+340092.560.10.1@1707922977
[i586] MI2a:              target SELECTED: python3-module-six 1.16.0-alt1.p10:p10+340092.560.10.1@1707922977
[i586] MI2a:              requesting to install python3-module-six (unspec'd ver; inspect with Debug::pkgMark-shallow)
[i586] MI2a:                marked for install (shallow): python3-module-six
[i586] MI2a:           satisfying Depends: python3(webencodings) < 0
[i586] MI2a:            maybe install (a providing target): python3-module-webencodings 0.5.1-alt2:sisyphus+276020.100.1.1@1624812421
[i586] MI2a:           target SELECTED: python3-module-webencodings 0.5.1-alt2:sisyphus+276020.100.1.1@1624812421
[i586] MI2a:           requesting to install python3-module-webencodings (unspec'd ver; inspect with Debug::pkgMark-shallow)
[i586] MI2a:             marked for install (shallow): python3-module-webencodings
[i586] rpm-macros-alternatives is already the newest version.
[i586] rpm-macros-java is already the newest version.
[i586] Selecting filesystem for '/proc'
[i586] filesystem is already the newest version.
[i586] E: Couldn't find package jpackage-17-compat
[i586] hsh-install: Failed to calculate package file list.
[i586] hsh-install: Failed to generate package file list.
2024-Mar-29 07:43:23 :: [i586] tomcat10.git 10.1.20-alt1_jvm17: remote: cannot build src.rpm
2024-Mar-29 07:43:23 :: [i586] #100 tomcat10.git 10.1.20-alt1_jvm17: build FAILED
2024-Mar-29 07:43:23 :: [i586] requesting cancellation of task processing
[x86_64] <13>Mar 29 07:43:22 rpmi: rpm-macros-java-1:5.3.0-alt1_15jpp11 sisyphus+278038.500.1.3 1625987751 installed
[x86_64] <13>Mar 29 07:43:22 rpmi: rpm-macros-alternatives-0.5.2-alt1 p10+309129.100.2.1 1668066636 installed
[x86_64] sh: /usr/share/java-utils/java-functions: No such file or directory
[x86_64] Reading Package Lists...
[x86_64] Building Dependency Tree...
[x86_64] MI2a: marked for install (shallow): rpm-build-java
[x86_64] MI2a:  satisfying Depends: python3  (NULL)
[x86_64] MI2a:   maybe install (a direct target): python3 3.9.18-alt1:p10+340781.400.5.1@1709555259
[x86_64] MI2a:  target SELECTED: python3 3.9.18-alt1:p10+340781.400.5.1@1709555259
[x86_64] MI2a:  requesting to install python3 (unspec'd ver; inspect with Debug::pkgMark-shallow)
[x86_64] MI2a:    marked for install (shallow): python3
[x86_64] MI2a:     satisfying Depends: python3-base = 3.9.18-alt1:p10+340781.400.5.1
[x86_64] MI2a:      maybe install (a direct target): python3-base 3.9.18-alt1:p10+340781.400.5.1@1709555259
[x86_64] MI2a:     target SELECTED: python3-base 3.9.18-alt1:p10+340781.400.5.1@1709555259
[x86_64] MI2a:     requesting to install python3-base (unspec'd ver; inspect with Debug::pkgMark-shallow)
[x86_64] MI2a:       marked for install (shallow): python3-base
[x86_64] MI2a:        satisfying Depends: libcrypto.so.1.1()(64bit) >= set:qjvVyozNUGc9WsG7VIFPYfHMrhrfJYgsQGOmWGCgVZEeTZ3cW6ohfNyjEWIGMylk83WroOe8cvPBvDMJxj1EHIA8NcJhgZsZubMZ3n8WLt90Guhkrfl3MAsRNSE9EjmjidVpKZofuT86ioTKZKf8EB4PgGdTs1wCJderfDwMIu11WY3VxroBBL0WWhLaLkvG2dcqN5qFjpcMZdKztTSyjxzS8wKa4kvw0X9ziomSLa1mAKEgNWGjClqjdGA9WxgNcsSKoD7usW5NEHYZDL2VaeqOFOeSjZbP0CvmDlGUWpFt4IKh6ZhQwz9Pp77PWAt9PjND7Sgq0YyTXnW5K77cGZDYYy4RtH0
[x86_64] MI2a:         maybe install (a providing target): libcrypto1.1 1.1.1w-alt0.p10.1:p10+330586.100.4.1@1697560982
[x86_64] MI2a:        target SELECTED: libcrypto1.1 1.1.1w-alt0.p10.1:p10+330586.100.4.1@1697560982
[x86_64] MI2a:        requesting to install libcrypto1.1 (unspec'd ver; inspect with Debug::pkgMark-shallow)
[x86_64] MI2a:          marked for install (shallow): libcrypto1.1
[x86_64] MI2a:           satisfying Depends: ca-certificates  (NULL)
[x86_64] MI2a:            maybe install (a direct target): ca-certificates 2022.09.15-alt1:p10+308004.100.2.1@1665748370
[x86_64] MI2a:           target SELECTED: ca-certificates 2022.09.15-alt1:p10+308004.100.2.1@1665748370
[x86_64] MI2a:           requesting to install ca-certificates (unspec'd ver; inspect with Debug::pkgMark-shallow)
[x86_64] MI2a:             marked for install (shallow): ca-certificates
[x86_64] MI2a:              satisfying Depends: ca-trust  (NULL)
[x86_64] MI2a:               maybe install (a direct target): ca-trust 0.1.4-alt1:p10+308691.100.3.1@1667496283
[x86_64] MI2a:              target SELECTED: ca-trust 0.1.4-alt1:p10+308691.100.3.1@1667496283
[x86_64] MI2a:              requesting to install ca-trust (unspec'd ver; inspect with Debug::pkgMark-shallow)
[x86_64] MI2a:                marked for install (shallow): ca-trust
[x86_64] MI2a:                 satisfying Depends: p11-kit-trust  (NULL)
[x86_64] MI2a:                  maybe install (a direct target): p11-kit-trust 0.24.1-alt1:p10+305061.100.3.1@1660573397
[x86_64] MI2a:                 target SELECTED: p11-kit-trust 0.24.1-alt1:p10+305061.100.3.1@1660573397
[x86_64] MI2a:                 requesting to install p11-kit-trust (unspec'd ver; inspect with Debug::pkgMark-shallow)
[x86_64] MI2a:                   marked for install (shallow): p11-kit-trust
[x86_64] MI2a:                    satisfying Depends: /etc/alternatives/packages.d  (NULL)
[x86_64] MI2a:                     maybe install (a providing target): alternatives 0.5.2-alt1:p10+309129.100.2.1@1668066636
[x86_64] MI2a:                    target SELECTED: alternatives 0.5.2-alt1:p10+309129.100.2.1@1668066636
[x86_64] MI2a:                    requesting to install alternatives (unspec'd ver; inspect with Debug::pkgMark-shallow)
[x86_64] MI2a:                      marked for install (shallow): alternatives
[x86_64] MI2a:                    satisfying Depends: libtasn1.so.6()(64bit) >= set:jfRaXblmF8mf5SLNNXDA2CDacDxCZqQOspDh1
[x86_64] MI2a:                     maybe install (a providing target): libtasn1 4.19.0-alt1:p10+309071.100.2.1@1668522760
[x86_64] MI2a:                    target SELECTED: libtasn1 4.19.0-alt1:p10+309071.100.2.1@1668522760
[x86_64] MI2a:                    requesting to install libtasn1 (unspec'd ver; inspect with Debug::pkgMark-shallow)
[x86_64] MI2a:                      marked for install (shallow): libtasn1
[x86_64] MI2a:                    satisfying Depends: libp11-kit = 0.24.1-alt1:p10+305061.100.3.1
[x86_64] MI2a:                     maybe install (a direct target): libp11-kit 0.24.1-alt1:p10+305061.100.3.1@1660573397
[x86_64] MI2a:                    target SELECTED: libp11-kit 0.24.1-alt1:p10+305061.100.3.1@1660573397
[x86_64] MI2a:                    requesting to install libp11-kit (unspec'd ver; inspect with Debug::pkgMark-shallow)
[x86_64] MI2a:                      marked for install (shallow): libp11-kit
[x86_64] MI2a:        satisfying Depends: libexpat.so.1()(64bit) >= set:keKUFski4R0wXtka97olBOZ17REKhz7nL8ZKWHPFZ33uhaXbVkjsQcSJH5elImuwVDsGFzPXw0tsVy6wZI95ZiDLZowTr2df2WZv3q3kSPgdYNzXg
[x86_64] MI2a:         maybe install (a providing target): libexpat 2.5.0-alt1:p10+324220.100.1.1@1688465137
[x86_64] MI2a:        target SELECTED: libexpat 2.5.0-alt1:p10+324220.100.1.1@1688465137
[x86_64] MI2a:        requesting to install libexpat (unspec'd ver; inspect with Debug::pkgMark-shallow)
[x86_64] MI2a:          marked for install (shallow): libexpat
[x86_64] MI2a:        satisfying Depends: libgdbm.so.3()(64bit) >= set:iejT6M96OmuT9HlYJ7ooGKIqQHH2
[x86_64] MI2a:         maybe install (a providing target): libgdbm 1.8.3-alt10:sisyphus+278100.1600.1.1@1626058413
[x86_64] MI2a:        target SELECTED: libgdbm 1.8.3-alt10:sisyphus+278100.1600.1.1@1626058413
[x86_64] MI2a:        requesting to install libgdbm (unspec'd ver; inspect with Debug::pkgMark-shallow)
[x86_64] MI2a:          marked for install (shallow): libgdbm
[x86_64] MI2a:        satisfying Depends: libssl.so.1.1()(64bit) >= set:mfaB9uCfqgEZKlBwqPpgntxX2eJBMPNn4g1DtLmc9Y8ned8di2Akpva8awQUEZ6dZdsRvIlt2f6wZz9vQkhckwUWPRL2v7lRWwPb0I29PRV6VkgSw4c4yyLZBFr9cpkB0djb2kqvZiyUZlJTuYnJPH5MC1dJLCwASLNDaR1zA4dNZAg8MsyiFpQDCyvgKkMnoWXjSaBIByJ9D5FGpJ2kFynDnEsGfX0CCWF5
[x86_64] MI2a:         maybe install (a providing target): libssl1.1 1.1.1w-alt0.p10.1:p10+330586.100.4.1@1697560982
[x86_64] MI2a:        target SELECTED: libssl1.1 1.1.1w-alt0.p10.1:p10+330586.100.4.1@1697560982
[x86_64] MI2a:        requesting to install libssl1.1 (unspec'd ver; inspect with Debug::pkgMark-shallow)
[x86_64] MI2a:          marked for install (shallow): libssl1.1
[x86_64] MI2a:  satisfying Depends: javapackages-tools = 1:5.3.0-alt1_15jpp11:sisyphus+278038.500.1.3
[x86_64] MI2a:   maybe install (a direct target): javapackages-tools 1:5.3.0-alt1_15jpp11:sisyphus+278038.500.1.3@1625987751
[x86_64] MI2a:  target SELECTED: javapackages-tools 1:5.3.0-alt1_15jpp11:sisyphus+278038.500.1.3@1625987751
[x86_64] MI2a:  requesting to install javapackages-tools (unspec'd ver; inspect with Debug::pkgMark-shallow)
[x86_64] MI2a:    marked for install (shallow): javapackages-tools
[x86_64] MI2a:     satisfying Depends: javapackages-filesystem = 1:5.3.0-alt1_15jpp11:sisyphus+278038.500.1.3
[x86_64] MI2a:      maybe install (a direct target): javapackages-filesystem 1:5.3.0-alt1_15jpp11:sisyphus+278038.500.1.3@1625987751
[x86_64] MI2a:     target SELECTED: javapackages-filesystem 1:5.3.0-alt1_15jpp11:sisyphus+278038.500.1.3@1625987751
[x86_64] MI2a:     requesting to install javapackages-filesystem (unspec'd ver; inspect with Debug::pkgMark-shallow)
[x86_64] MI2a:       marked for install (shallow): javapackages-filesystem
[x86_64] MI2a:  satisfying Depends: python3-module-javapackages = 1:5.3.0-alt1_15jpp11:sisyphus+278038.500.1.3
[x86_64] MI2a:   maybe install (a direct target): python3-module-javapackages 1:5.3.0-alt1_15jpp11:sisyphus+278038.500.1.3@1625987751
[x86_64] MI2a:  target SELECTED: python3-module-javapackages 1:5.3.0-alt1_15jpp11:sisyphus+278038.500.1.3@1625987751
[x86_64] MI2a:  requesting to install python3-module-javapackages (unspec'd ver; inspect with Debug::pkgMark-shallow)
[x86_64] MI2a:    marked for install (shallow): python3-module-javapackages
[x86_64] MI2a:     satisfying Depends: python3-module-lxml  (NULL)
[x86_64] MI2a:      maybe install (a direct target): python3-module-lxml 4.9.3-alt1:p10+329617.100.2.1@1695317778
[x86_64] MI2a:     target SELECTED: python3-module-lxml 4.9.3-alt1:p10+329617.100.2.1@1695317778
[x86_64] MI2a:     requesting to install python3-module-lxml (unspec'd ver; inspect with Debug::pkgMark-shallow)
[x86_64] MI2a:       marked for install (shallow): python3-module-lxml
[x86_64] MI2a:        satisfying Depends: python3-module-cssselect  (NULL)
[x86_64] MI2a:         maybe install (a direct target): python3-module-cssselect 0.9.1-alt3:sisyphus+270533.2600.6.1@1619684675
[x86_64] MI2a:        target SELECTED: python3-module-cssselect 0.9.1-alt3:sisyphus+270533.2600.6.1@1619684675
[x86_64] MI2a:        requesting to install python3-module-cssselect (unspec'd ver; inspect with Debug::pkgMark-shallow)
[x86_64] MI2a:          marked for install (shallow): python3-module-cssselect
[x86_64] MI2a:        satisfying Depends: libexslt.so.0()(64bit) >= set:ifFYpbWiXMSnz0
[x86_64] MI2a:         maybe install (a providing target): libxslt 1.1.34-alt3:sisyphus+275636.100.1.1@1624616833
[x86_64] MI2a:        target SELECTED: libxslt 1.1.34-alt3:sisyphus+275636.100.1.1@1624616833
[x86_64] MI2a:        requesting to install libxslt (unspec'd ver; inspect with Debug::pkgMark-shallow)
[x86_64] MI2a:          marked for install (shallow): libxslt
[x86_64] MI2a:        satisfying Depends: python3(html5lib) < 0
[x86_64] MI2a:         maybe install (a providing target): python3-module-html5lib 1:1.1-alt1:sisyphus+278096.120.5.1@1626086978
[x86_64] MI2a:        target SELECTED: python3-module-html5lib 1:1.1-alt1:sisyphus+278096.120.5.1@1626086978
[x86_64] MI2a:        requesting to install python3-module-html5lib (unspec'd ver; inspect with Debug::pkgMark-shallow)
[x86_64] MI2a:          marked for install (shallow): python3-module-html5lib
[x86_64] MI2a:           satisfying Depends: python3(genshi.core) < 0
[x86_64] MI2a:            maybe install (a providing target): python3-module-genshi 0.7.4-alt2:sisyphus+275930.100.2.1@1624873830
[x86_64] MI2a:           target SELECTED: python3-module-genshi 0.7.4-alt2:sisyphus+275930.100.2.1@1624873830
[x86_64] MI2a:           requesting to install python3-module-genshi (unspec'd ver; inspect with Debug::pkgMark-shallow)
[x86_64] MI2a:             marked for install (shallow): python3-module-genshi
[x86_64] MI2a:              satisfying Depends: python3(six) < 0
[x86_64] MI2a:               maybe install (a providing target): python3-module-six 1.16.0-alt1.p10:p10+340092.560.10.1@1707922977
[x86_64] MI2a:              target SELECTED: python3-module-six 1.16.0-alt1.p10:p10+340092.560.10.1@1707922977
[x86_64] MI2a:              requesting to install python3-module-six (unspec'd ver; inspect with Debug::pkgMark-shallow)
[x86_64] MI2a:                marked for install (shallow): python3-module-six
[x86_64] MI2a:           satisfying Depends: python3(webencodings) < 0
[x86_64] MI2a:            maybe install (a providing target): python3-module-webencodings 0.5.1-alt2:sisyphus+276020.100.1.1@1624812421
[x86_64] MI2a:           target SELECTED: python3-module-webencodings 0.5.1-alt2:sisyphus+276020.100.1.1@1624812421
[x86_64] MI2a:           requesting to install python3-module-webencodings (unspec'd ver; inspect with Debug::pkgMark-shallow)
[x86_64] MI2a:             marked for install (shallow): python3-module-webencodings
[x86_64] rpm-macros-alternatives is already the newest version.
[x86_64] rpm-macros-java is already the newest version.
[x86_64] Selecting filesystem for '/proc'
[x86_64] filesystem is already the newest version.
[x86_64] E: Couldn't find package jpackage-17-compat
[x86_64] hsh-install: Failed to calculate package file list.
[x86_64] hsh-install: Failed to generate package file list.
2024-Mar-29 07:43:23 :: [x86_64] tomcat10.git 10.1.20-alt1_jvm17: remote: cannot build src.rpm
2024-Mar-29 07:43:23 :: [x86_64] #100 tomcat10.git 10.1.20-alt1_jvm17: build FAILED
[aarch64] <13>Mar 29 07:43:28 rpmi: rpm-macros-java-1:5.3.0-alt1_15jpp11 sisyphus+278038.500.1.3 1625987751 installed
[aarch64] <13>Mar 29 07:43:28 rpmi: rpm-macros-alternatives-0.5.2-alt1 p10+309129.100.2.1 1668066636 installed
[aarch64] sh: /usr/share/java-utils/java-functions: No such file or directory
[aarch64] Reading Package Lists...
[aarch64] Building Dependency Tree...
[aarch64] MI2a: marked for install (shallow): rpm-build-java
[aarch64] MI2a:  satisfying Depends: python3  (NULL)
[aarch64] MI2a:   maybe install (a direct target): python3 3.9.18-alt1:p10+340781.400.5.1@1709557340
[aarch64] MI2a:  target SELECTED: python3 3.9.18-alt1:p10+340781.400.5.1@1709557340
[aarch64] MI2a:  requesting to install python3 (unspec'd ver; inspect with Debug::pkgMark-shallow)
[aarch64] MI2a:    marked for install (shallow): python3
[aarch64] MI2a:     satisfying Depends: python3-base = 3.9.18-alt1:p10+340781.400.5.1
[aarch64] MI2a:      maybe install (a direct target): python3-base 3.9.18-alt1:p10+340781.400.5.1@1709557340
[aarch64] MI2a:     target SELECTED: python3-base 3.9.18-alt1:p10+340781.400.5.1@1709557340
[aarch64] MI2a:     requesting to install python3-base (unspec'd ver; inspect with Debug::pkgMark-shallow)
[aarch64] MI2a:       marked for install (shallow): python3-base
[aarch64] MI2a:        satisfying Depends: libcrypto.so.1.1()(64bit) >= set:qjvVyozNUGc9WsG7VIFPYfHMrhrfJYgsQGOmWGCgVZEeTZ3cW6ohfNyjEWIGMylk83WroOe8cvPBvDMJxj1EHIA8NcJhgZsZubMZ3n8WLt90Guhkrfl3MAsRNSE9EjmjidVpKZofuT86ioTKZKf8EB4PgGdTs1wCJderfDwMIu11WY3VxroBBL0WWhLaLkvG2dcqN5qFjpcMZdKztTSyjxzS8wKa4kvw0X9ziomSLa1mAKEgNWGjClqjdGA9WxgNcsSKoD7usW5NEHYZDL2VaeqOFOeSjZbP0CvmDlGUWpFt4IKh6ZhQwz9Pp77PWAt9PjND7Sgq0YyTXnW5K77cGZDYYy4RtH0
[aarch64] MI2a:         maybe install (a providing target): libcrypto1.1 1.1.1w-alt0.p10.1:p10+330586.100.4.1@1697561153
[aarch64] MI2a:        target SELECTED: libcrypto1.1 1.1.1w-alt0.p10.1:p10+330586.100.4.1@1697561153
[aarch64] MI2a:        requesting to install libcrypto1.1 (unspec'd ver; inspect with Debug::pkgMark-shallow)
[aarch64] MI2a:          marked for install (shallow): libcrypto1.1
[aarch64] MI2a:           satisfying Depends: ca-certificates  (NULL)
[aarch64] MI2a:            maybe install (a direct target): ca-certificates 2022.09.15-alt1:p10+308004.100.2.1@1665748370
[aarch64] MI2a:           target SELECTED: ca-certificates 2022.09.15-alt1:p10+308004.100.2.1@1665748370
[aarch64] MI2a:           requesting to install ca-certificates (unspec'd ver; inspect with Debug::pkgMark-shallow)
[aarch64] MI2a:             marked for install (shallow): ca-certificates
[aarch64] MI2a:              satisfying Depends: ca-trust  (NULL)
[aarch64] MI2a:               maybe install (a direct target): ca-trust 0.1.4-alt1:p10+308691.100.3.1@1667496283
[aarch64] MI2a:              target SELECTED: ca-trust 0.1.4-alt1:p10+308691.100.3.1@1667496283
[aarch64] MI2a:              requesting to install ca-trust (unspec'd ver; inspect with Debug::pkgMark-shallow)
[aarch64] MI2a:                marked for install (shallow): ca-trust
[aarch64] MI2a:                 satisfying Depends: p11-kit-trust  (NULL)
[aarch64] MI2a:                  maybe install (a direct target): p11-kit-trust 0.24.1-alt1:p10+305061.100.3.1@1660573491
[aarch64] MI2a:                 target SELECTED: p11-kit-trust 0.24.1-alt1:p10+305061.100.3.1@1660573491
[aarch64] MI2a:                 requesting to install p11-kit-trust (unspec'd ver; inspect with Debug::pkgMark-shallow)
[aarch64] MI2a:                   marked for install (shallow): p11-kit-trust
[aarch64] MI2a:                    satisfying Depends: /etc/alternatives/packages.d  (NULL)
[aarch64] MI2a:                     maybe install (a providing target): alternatives 0.5.2-alt1:p10+309129.100.2.1@1668066636
[aarch64] MI2a:                    target SELECTED: alternatives 0.5.2-alt1:p10+309129.100.2.1@1668066636
[aarch64] MI2a:                    requesting to install alternatives (unspec'd ver; inspect with Debug::pkgMark-shallow)
[aarch64] MI2a:                      marked for install (shallow): alternatives
[aarch64] MI2a:                    satisfying Depends: libtasn1.so.6()(64bit) >= set:jfRaXblmF8mf5SLNNXDA2CDacDxCZqQOspDh1
[aarch64] MI2a:                     maybe install (a providing target): libtasn1 4.19.0-alt1:p10+309071.100.2.1@1668522795
[aarch64] MI2a:                    target SELECTED: libtasn1 4.19.0-alt1:p10+309071.100.2.1@1668522795
[aarch64] MI2a:                    requesting to install libtasn1 (unspec'd ver; inspect with Debug::pkgMark-shallow)
[aarch64] MI2a:                      marked for install (shallow): libtasn1
[aarch64] MI2a:                    satisfying Depends: libp11-kit = 0.24.1-alt1:p10+305061.100.3.1
[aarch64] MI2a:                     maybe install (a direct target): libp11-kit 0.24.1-alt1:p10+305061.100.3.1@1660573491
[aarch64] MI2a:                    target SELECTED: libp11-kit 0.24.1-alt1:p10+305061.100.3.1@1660573491
[aarch64] MI2a:                    requesting to install libp11-kit (unspec'd ver; inspect with Debug::pkgMark-shallow)
[aarch64] MI2a:                      marked for install (shallow): libp11-kit
[aarch64] MI2a:        satisfying Depends: libexpat.so.1()(64bit) >= set:keKUFski4R0wXtka97olBOZ17REKhz7nL8ZKWHPFZ33uhaXbVkjsQcSJH5elImuwVDsGFzPXw0tsVy6wZI95ZiDLZowTr2df2WZv3q3kSPgdYNzXg
[aarch64] MI2a:         maybe install (a providing target): libexpat 2.5.0-alt1:p10+324220.100.1.1@1688465160
[aarch64] MI2a:        target SELECTED: libexpat 2.5.0-alt1:p10+324220.100.1.1@1688465160
[aarch64] MI2a:        requesting to install libexpat (unspec'd ver; inspect with Debug::pkgMark-shallow)
[aarch64] MI2a:          marked for install (shallow): libexpat
[aarch64] MI2a:        satisfying Depends: libgdbm.so.3()(64bit) >= set:iejT6M96OmuT9HlYJ7ooGKIqQHH2
[aarch64] MI2a:         maybe install (a providing target): libgdbm 1.8.3-alt10:sisyphus+278100.1600.1.1@1626059407
[aarch64] MI2a:        target SELECTED: libgdbm 1.8.3-alt10:sisyphus+278100.1600.1.1@1626059407
[aarch64] MI2a:        requesting to install libgdbm (unspec'd ver; inspect with Debug::pkgMark-shallow)
[aarch64] MI2a:          marked for install (shallow): libgdbm
[aarch64] MI2a:        satisfying Depends: libssl.so.1.1()(64bit) >= set:mfaB9uCfqgEZKlBwqPpgntxX2eJBMPNn4g1DtLmc9Y8ned8di2Akpva8awQUEZ6dZdsRvIlt2f6wZz9vQkhckwUWPRL2v7lRWwPb0I29PRV6VkgSw4c4yyLZBFr9cpkB0djb2kqvZiyUZlJTuYnJPH5MC1dJLCwASLNDaR1zA4dNZAg8MsyiFpQDCyvgKkMnoWXjSaBIByJ9D5FGpJ2kFynDnEsGfX0CCWF5
[aarch64] MI2a:         maybe install (a providing target): libssl1.1 1.1.1w-alt0.p10.1:p10+330586.100.4.1@1697561153
[aarch64] MI2a:        target SELECTED: libssl1.1 1.1.1w-alt0.p10.1:p10+330586.100.4.1@1697561153
[aarch64] MI2a:        requesting to install libssl1.1 (unspec'd ver; inspect with Debug::pkgMark-shallow)
[aarch64] MI2a:          marked for install (shallow): libssl1.1
[aarch64] MI2a:  satisfying Depends: javapackages-tools = 1:5.3.0-alt1_15jpp11:sisyphus+278038.500.1.3
[aarch64] MI2a:   maybe install (a direct target): javapackages-tools 1:5.3.0-alt1_15jpp11:sisyphus+278038.500.1.3@1625987751
[aarch64] MI2a:  target SELECTED: javapackages-tools 1:5.3.0-alt1_15jpp11:sisyphus+278038.500.1.3@1625987751
[aarch64] MI2a:  requesting to install javapackages-tools (unspec'd ver; inspect with Debug::pkgMark-shallow)
[aarch64] MI2a:    marked for install (shallow): javapackages-tools
[aarch64] MI2a:     satisfying Depends: javapackages-filesystem = 1:5.3.0-alt1_15jpp11:sisyphus+278038.500.1.3
[aarch64] MI2a:      maybe install (a direct target): javapackages-filesystem 1:5.3.0-alt1_15jpp11:sisyphus+278038.500.1.3@1625987751
[aarch64] MI2a:     target SELECTED: javapackages-filesystem 1:5.3.0-alt1_15jpp11:sisyphus+278038.500.1.3@1625987751
[aarch64] MI2a:     requesting to install javapackages-filesystem (unspec'd ver; inspect with Debug::pkgMark-shallow)
[aarch64] MI2a:       marked for install (shallow): javapackages-filesystem
[aarch64] MI2a:  satisfying Depends: python3-module-javapackages = 1:5.3.0-alt1_15jpp11:sisyphus+278038.500.1.3
[aarch64] MI2a:   maybe install (a direct target): python3-module-javapackages 1:5.3.0-alt1_15jpp11:sisyphus+278038.500.1.3@1625987751
[aarch64] MI2a:  target SELECTED: python3-module-javapackages 1:5.3.0-alt1_15jpp11:sisyphus+278038.500.1.3@1625987751
[aarch64] MI2a:  requesting to install python3-module-javapackages (unspec'd ver; inspect with Debug::pkgMark-shallow)
[aarch64] MI2a:    marked for install (shallow): python3-module-javapackages
[aarch64] MI2a:     satisfying Depends: python3-module-lxml  (NULL)
[aarch64] MI2a:      maybe install (a direct target): python3-module-lxml 4.9.3-alt1:p10+329617.100.2.1@1695317881
[aarch64] MI2a:     target SELECTED: python3-module-lxml 4.9.3-alt1:p10+329617.100.2.1@1695317881
[aarch64] MI2a:     requesting to install python3-module-lxml (unspec'd ver; inspect with Debug::pkgMark-shallow)
[aarch64] MI2a:       marked for install (shallow): python3-module-lxml
[aarch64] MI2a:        satisfying Depends: python3-module-cssselect  (NULL)
[aarch64] MI2a:         maybe install (a direct target): python3-module-cssselect 0.9.1-alt3:sisyphus+270533.2600.6.1@1619684675
[aarch64] MI2a:        target SELECTED: python3-module-cssselect 0.9.1-alt3:sisyphus+270533.2600.6.1@1619684675
[aarch64] MI2a:        requesting to install python3-module-cssselect (unspec'd ver; inspect with Debug::pkgMark-shallow)
[aarch64] MI2a:          marked for install (shallow): python3-module-cssselect
[aarch64] MI2a:        satisfying Depends: libexslt.so.0()(64bit) >= set:ifFYpbWiXMSnz0
[aarch64] MI2a:         maybe install (a providing target): libxslt 1.1.34-alt3:sisyphus+275636.100.1.1@1624616841
[aarch64] MI2a:        target SELECTED: libxslt 1.1.34-alt3:sisyphus+275636.100.1.1@1624616841
[aarch64] MI2a:        requesting to install libxslt (unspec'd ver; inspect with Debug::pkgMark-shallow)
[aarch64] MI2a:          marked for install (shallow): libxslt
[aarch64] MI2a:        satisfying Depends: python3(html5lib) < 0
[aarch64] MI2a:         maybe install (a providing target): python3-module-html5lib 1:1.1-alt1:sisyphus+278096.120.5.1@1626086978
[aarch64] MI2a:        target SELECTED: python3-module-html5lib 1:1.1-alt1:sisyphus+278096.120.5.1@1626086978
[aarch64] MI2a:        requesting to install python3-module-html5lib (unspec'd ver; inspect with Debug::pkgMark-shallow)
[aarch64] MI2a:          marked for install (shallow): python3-module-html5lib
[aarch64] MI2a:           satisfying Depends: python3(genshi.core) < 0
[aarch64] MI2a:            maybe install (a providing target): python3-module-genshi 0.7.4-alt2:sisyphus+275930.100.2.1@1624873830
[aarch64] MI2a:           target SELECTED: python3-module-genshi 0.7.4-alt2:sisyphus+275930.100.2.1@1624873830
[aarch64] MI2a:           requesting to install python3-module-genshi (unspec'd ver; inspect with Debug::pkgMark-shallow)
[aarch64] MI2a:             marked for install (shallow): python3-module-genshi
[aarch64] MI2a:              satisfying Depends: python3(six) < 0
[aarch64] MI2a:               maybe install (a providing target): python3-module-six 1.16.0-alt1.p10:p10+340092.560.10.1@1707922977
[aarch64] MI2a:              target SELECTED: python3-module-six 1.16.0-alt1.p10:p10+340092.560.10.1@1707922977
[aarch64] MI2a:              requesting to install python3-module-six (unspec'd ver; inspect with Debug::pkgMark-shallow)
[aarch64] MI2a:                marked for install (shallow): python3-module-six
[aarch64] MI2a:           satisfying Depends: python3(webencodings) < 0
[aarch64] MI2a:            maybe install (a providing target): python3-module-webencodings 0.5.1-alt2:sisyphus+276020.100.1.1@1624812421
[aarch64] MI2a:           target SELECTED: python3-module-webencodings 0.5.1-alt2:sisyphus+276020.100.1.1@1624812421
[aarch64] MI2a:           requesting to install python3-module-webencodings (unspec'd ver; inspect with Debug::pkgMark-shallow)
[aarch64] MI2a:             marked for install (shallow): python3-module-webencodings
[aarch64] rpm-macros-alternatives is already the newest version.
[aarch64] rpm-macros-java is already the newest version.
[aarch64] Selecting filesystem for '/proc'
[aarch64] filesystem is already the newest version.
[aarch64] E: Couldn't find package jpackage-17-compat
[aarch64] hsh-install: Failed to calculate package file list.
[aarch64] hsh-install: Failed to generate package file list.
2024-Mar-29 07:43:29 :: [aarch64] tomcat10.git 10.1.20-alt1_jvm17: remote: cannot build src.rpm
2024-Mar-29 07:43:29 :: [aarch64] #100 tomcat10.git 10.1.20-alt1_jvm17: build FAILED
[ppc64le] <13>Mar 29 07:43:30 rpmi: rpm-macros-java-1:5.3.0-alt1_15jpp11 sisyphus+278038.500.1.3 1625987751 installed
[ppc64le] <13>Mar 29 07:43:30 rpmi: rpm-macros-alternatives-0.5.2-alt1 p10+309129.100.2.1 1668066636 installed
[ppc64le] sh: /usr/share/java-utils/java-functions: No such file or directory
[ppc64le] Reading Package Lists...
[ppc64le] Building Dependency Tree...
[ppc64le] MI2a: marked for install (shallow): rpm-build-java
[ppc64le] MI2a:  satisfying Depends: python3  (NULL)
[ppc64le] MI2a:   maybe install (a direct target): python3 3.9.18-alt1:p10+340781.400.5.1@1709557170
[ppc64le] MI2a:  target SELECTED: python3 3.9.18-alt1:p10+340781.400.5.1@1709557170
[ppc64le] MI2a:  requesting to install python3 (unspec'd ver; inspect with Debug::pkgMark-shallow)
[ppc64le] MI2a:    marked for install (shallow): python3
[ppc64le] MI2a:     satisfying Depends: python3-base = 3.9.18-alt1:p10+340781.400.5.1
[ppc64le] MI2a:      maybe install (a direct target): python3-base 3.9.18-alt1:p10+340781.400.5.1@1709557170
[ppc64le] MI2a:     target SELECTED: python3-base 3.9.18-alt1:p10+340781.400.5.1@1709557170
[ppc64le] MI2a:     requesting to install python3-base (unspec'd ver; inspect with Debug::pkgMark-shallow)
[ppc64le] MI2a:       marked for install (shallow): python3-base
[ppc64le] MI2a:        satisfying Depends: libcrypto.so.1.1()(64bit) >= set:qjvVyozNUGc9WsG7VIFPYfHMrhrfJYgsQGOmWGCgVZEeTZ3cW6ohfNyjEWIGMylk83WroOe8cvPBvDMJxj1EHIA8NcJhgZsZubMZ3n8WLt90Guhkrfl3MAsRNSE9EjmjidVpKZofuT86ioTKZKf8EB4PgGdTs1wCJderfDwMIu11WY3VxroBBL0WWhLaLkvG2dcqN5qFjpcMZdKztTSyjxzS8wKa4kvw0X9ziomSLa1mAKEgNWGjClqjdGA9WxgNcsSKoD7usW5NEHYZDL2VaeqOFOeSjZbP0CvmDlGUWpFt4IKh6ZhQwz9Pp77PWAt9PjND7Sgq0YyTXnW5K77cGZDYYy4RtH0
[ppc64le] MI2a:         maybe install (a providing target): libcrypto1.1 1.1.1w-alt0.p10.1:p10+330586.100.4.1@1697561268
[ppc64le] MI2a:        target SELECTED: libcrypto1.1 1.1.1w-alt0.p10.1:p10+330586.100.4.1@1697561268
[ppc64le] MI2a:        requesting to install libcrypto1.1 (unspec'd ver; inspect with Debug::pkgMark-shallow)
[ppc64le] MI2a:          marked for install (shallow): libcrypto1.1
[ppc64le] MI2a:           satisfying Depends: ca-certificates  (NULL)
[ppc64le] MI2a:            maybe install (a direct target): ca-certificates 2022.09.15-alt1:p10+308004.100.2.1@1665748370
[ppc64le] MI2a:           target SELECTED: ca-certificates 2022.09.15-alt1:p10+308004.100.2.1@1665748370
[ppc64le] MI2a:           requesting to install ca-certificates (unspec'd ver; inspect with Debug::pkgMark-shallow)
[ppc64le] MI2a:             marked for install (shallow): ca-certificates
[ppc64le] MI2a:              satisfying Depends: ca-trust  (NULL)
[ppc64le] MI2a:               maybe install (a direct target): ca-trust 0.1.4-alt1:p10+308691.100.3.1@1667496283
[ppc64le] MI2a:              target SELECTED: ca-trust 0.1.4-alt1:p10+308691.100.3.1@1667496283
[ppc64le] MI2a:              requesting to install ca-trust (unspec'd ver; inspect with Debug::pkgMark-shallow)
[ppc64le] MI2a:                marked for install (shallow): ca-trust
[ppc64le] MI2a:                 satisfying Depends: p11-kit-trust  (NULL)
[ppc64le] MI2a:                  maybe install (a direct target): p11-kit-trust 0.24.1-alt1:p10+305061.100.3.1@1660573521
[ppc64le] MI2a:                 target SELECTED: p11-kit-trust 0.24.1-alt1:p10+305061.100.3.1@1660573521
[ppc64le] MI2a:                 requesting to install p11-kit-trust (unspec'd ver; inspect with Debug::pkgMark-shallow)
[ppc64le] MI2a:                   marked for install (shallow): p11-kit-trust
[ppc64le] MI2a:                    satisfying Depends: /etc/alternatives/packages.d  (NULL)
[ppc64le] MI2a:                     maybe install (a providing target): alternatives 0.5.2-alt1:p10+309129.100.2.1@1668066636
[ppc64le] MI2a:                    target SELECTED: alternatives 0.5.2-alt1:p10+309129.100.2.1@1668066636
[ppc64le] MI2a:                    requesting to install alternatives (unspec'd ver; inspect with Debug::pkgMark-shallow)
[ppc64le] MI2a:                      marked for install (shallow): alternatives
[ppc64le] MI2a:                    satisfying Depends: libtasn1.so.6()(64bit) >= set:jfRaXblmF8mf5SLNNXDA2CDacDxCZqQOspDh1
[ppc64le] MI2a:                     maybe install (a providing target): libtasn1 4.19.0-alt1:p10+309071.100.2.1@1668522819
[ppc64le] MI2a:                    target SELECTED: libtasn1 4.19.0-alt1:p10+309071.100.2.1@1668522819
[ppc64le] MI2a:                    requesting to install libtasn1 (unspec'd ver; inspect with Debug::pkgMark-shallow)
[ppc64le] MI2a:                      marked for install (shallow): libtasn1
[ppc64le] MI2a:                    satisfying Depends: libp11-kit = 0.24.1-alt1:p10+305061.100.3.1
[ppc64le] MI2a:                     maybe install (a direct target): libp11-kit 0.24.1-alt1:p10+305061.100.3.1@1660573521
[ppc64le] MI2a:                    target SELECTED: libp11-kit 0.24.1-alt1:p10+305061.100.3.1@1660573521
[ppc64le] MI2a:                    requesting to install libp11-kit (unspec'd ver; inspect with Debug::pkgMark-shallow)
[ppc64le] MI2a:                      marked for install (shallow): libp11-kit
[ppc64le] MI2a:        satisfying Depends: libexpat.so.1()(64bit) >= set:keKUFski4R0wXtka97olBOZ17REKhz7nL8ZKWHPFZ33uhaXbVkjsQcSJH5elImuwVDsGFzPXw0tsVy6wZI95ZiDLZowTr2df2WZv3q3kSPgdYNzXg
[ppc64le] MI2a:         maybe install (a providing target): libexpat 2.5.0-alt1:p10+324220.100.1.1@1688465172
[ppc64le] MI2a:        target SELECTED: libexpat 2.5.0-alt1:p10+324220.100.1.1@1688465172
[ppc64le] MI2a:        requesting to install libexpat (unspec'd ver; inspect with Debug::pkgMark-shallow)
[ppc64le] MI2a:          marked for install (shallow): libexpat
[ppc64le] MI2a:        satisfying Depends: libgdbm.so.3()(64bit) >= set:iejT6M96OmuT9HlYJ7ooGKIqQHH2
[ppc64le] MI2a:         maybe install (a providing target): libgdbm 1.8.3-alt10:sisyphus+278100.1600.1.1@1626061027
[ppc64le] MI2a:        target SELECTED: libgdbm 1.8.3-alt10:sisyphus+278100.1600.1.1@1626061027
[ppc64le] MI2a:        requesting to install libgdbm (unspec'd ver; inspect with Debug::pkgMark-shallow)
[ppc64le] MI2a:          marked for install (shallow): libgdbm
[ppc64le] MI2a:        satisfying Depends: libssl.so.1.1()(64bit) >= set:mfaB9uCfqgEZKlBwqPpgntxX2eJBMPNn4g1DtLmc9Y8ned8di2Akpva8awQUEZ6dZdsRvIlt2f6wZz9vQkhckwUWPRL2v7lRWwPb0I29PRV6VkgSw4c4yyLZBFr9cpkB0djb2kqvZiyUZlJTuYnJPH5MC1dJLCwASLNDaR1zA4dNZAg8MsyiFpQDCyvgKkMnoWXjSaBIByJ9D5FGpJ2kFynDnEsGfX0CCWF5
[ppc64le] MI2a:         maybe install (a providing target): libssl1.1 1.1.1w-alt0.p10.1:p10+330586.100.4.1@1697561268
[ppc64le] MI2a:        target SELECTED: libssl1.1 1.1.1w-alt0.p10.1:p10+330586.100.4.1@1697561268
[ppc64le] MI2a:        requesting to install libssl1.1 (unspec'd ver; inspect with Debug::pkgMark-shallow)
[ppc64le] MI2a:          marked for install (shallow): libssl1.1
[ppc64le] MI2a:  satisfying Depends: javapackages-tools = 1:5.3.0-alt1_15jpp11:sisyphus+278038.500.1.3
[ppc64le] MI2a:   maybe install (a direct target): javapackages-tools 1:5.3.0-alt1_15jpp11:sisyphus+278038.500.1.3@1625987751
[ppc64le] MI2a:  target SELECTED: javapackages-tools 1:5.3.0-alt1_15jpp11:sisyphus+278038.500.1.3@1625987751
[ppc64le] MI2a:  requesting to install javapackages-tools (unspec'd ver; inspect with Debug::pkgMark-shallow)
[ppc64le] MI2a:    marked for install (shallow): javapackages-tools
[ppc64le] MI2a:     satisfying Depends: javapackages-filesystem = 1:5.3.0-alt1_15jpp11:sisyphus+278038.500.1.3
[ppc64le] MI2a:      maybe install (a direct target): javapackages-filesystem 1:5.3.0-alt1_15jpp11:sisyphus+278038.500.1.3@1625987751
[ppc64le] MI2a:     target SELECTED: javapackages-filesystem 1:5.3.0-alt1_15jpp11:sisyphus+278038.500.1.3@1625987751
[ppc64le] MI2a:     requesting to install javapackages-filesystem (unspec'd ver; inspect with Debug::pkgMark-shallow)
[ppc64le] MI2a:       marked for install (shallow): javapackages-filesystem
[ppc64le] MI2a:  satisfying Depends: python3-module-javapackages = 1:5.3.0-alt1_15jpp11:sisyphus+278038.500.1.3
[ppc64le] MI2a:   maybe install (a direct target): python3-module-javapackages 1:5.3.0-alt1_15jpp11:sisyphus+278038.500.1.3@1625987751
[ppc64le] MI2a:  target SELECTED: python3-module-javapackages 1:5.3.0-alt1_15jpp11:sisyphus+278038.500.1.3@1625987751
[ppc64le] MI2a:  requesting to install python3-module-javapackages (unspec'd ver; inspect with Debug::pkgMark-shallow)
[ppc64le] MI2a:    marked for install (shallow): python3-module-javapackages
[ppc64le] MI2a:     satisfying Depends: python3-module-lxml  (NULL)
[ppc64le] MI2a:      maybe install (a direct target): python3-module-lxml 4.9.3-alt1:p10+329617.100.2.1@1695317905
[ppc64le] MI2a:     target SELECTED: python3-module-lxml 4.9.3-alt1:p10+329617.100.2.1@1695317905
[ppc64le] MI2a:     requesting to install python3-module-lxml (unspec'd ver; inspect with Debug::pkgMark-shallow)
[ppc64le] MI2a:       marked for install (shallow): python3-module-lxml
[ppc64le] MI2a:        satisfying Depends: python3-module-cssselect  (NULL)
[ppc64le] MI2a:         maybe install (a direct target): python3-module-cssselect 0.9.1-alt3:sisyphus+270533.2600.6.1@1619684675
[ppc64le] MI2a:        target SELECTED: python3-module-cssselect 0.9.1-alt3:sisyphus+270533.2600.6.1@1619684675
[ppc64le] MI2a:        requesting to install python3-module-cssselect (unspec'd ver; inspect with Debug::pkgMark-shallow)
[ppc64le] MI2a:          marked for install (shallow): python3-module-cssselect
[ppc64le] MI2a:        satisfying Depends: libexslt.so.0()(64bit) >= set:ifFYpbWiXMSnz0
[ppc64le] MI2a:         maybe install (a providing target): libxslt 1.1.34-alt3:sisyphus+275636.100.1.1@1624616856
[ppc64le] MI2a:        target SELECTED: libxslt 1.1.34-alt3:sisyphus+275636.100.1.1@1624616856
[ppc64le] MI2a:        requesting to install libxslt (unspec'd ver; inspect with Debug::pkgMark-shallow)
[ppc64le] MI2a:          marked for install (shallow): libxslt
[ppc64le] MI2a:        satisfying Depends: python3(html5lib) < 0
[ppc64le] MI2a:         maybe install (a providing target): python3-module-html5lib 1:1.1-alt1:sisyphus+278096.120.5.1@1626086978
[ppc64le] MI2a:        target SELECTED: python3-module-html5lib 1:1.1-alt1:sisyphus+278096.120.5.1@1626086978
[ppc64le] MI2a:        requesting to install python3-module-html5lib (unspec'd ver; inspect with Debug::pkgMark-shallow)
[ppc64le] MI2a:          marked for install (shallow): python3-module-html5lib
[ppc64le] MI2a:           satisfying Depends: python3(genshi.core) < 0
[ppc64le] MI2a:            maybe install (a providing target): python3-module-genshi 0.7.4-alt2:sisyphus+275930.100.2.1@1624873830
[ppc64le] MI2a:           target SELECTED: python3-module-genshi 0.7.4-alt2:sisyphus+275930.100.2.1@1624873830
[ppc64le] MI2a:           requesting to install python3-module-genshi (unspec'd ver; inspect with Debug::pkgMark-shallow)
[ppc64le] MI2a:             marked for install (shallow): python3-module-genshi
[ppc64le] MI2a:              satisfying Depends: python3(six) < 0
[ppc64le] MI2a:               maybe install (a providing target): python3-module-six 1.16.0-alt1.p10:p10+340092.560.10.1@1707922977
[ppc64le] MI2a:              target SELECTED: python3-module-six 1.16.0-alt1.p10:p10+340092.560.10.1@1707922977
[ppc64le] MI2a:              requesting to install python3-module-six (unspec'd ver; inspect with Debug::pkgMark-shallow)
[ppc64le] MI2a:                marked for install (shallow): python3-module-six
[ppc64le] MI2a:           satisfying Depends: python3(webencodings) < 0
[ppc64le] MI2a:            maybe install (a providing target): python3-module-webencodings 0.5.1-alt2:sisyphus+276020.100.1.1@1624812421
[ppc64le] MI2a:           target SELECTED: python3-module-webencodings 0.5.1-alt2:sisyphus+276020.100.1.1@1624812421
[ppc64le] MI2a:           requesting to install python3-module-webencodings (unspec'd ver; inspect with Debug::pkgMark-shallow)
[ppc64le] MI2a:             marked for install (shallow): python3-module-webencodings
[ppc64le] rpm-macros-alternatives is already the newest version.
[ppc64le] rpm-macros-java is already the newest version.
[ppc64le] Selecting filesystem for '/proc'
[ppc64le] filesystem is already the newest version.
[ppc64le] E: Couldn't find package jpackage-17-compat
[ppc64le] hsh-install: Failed to calculate package file list.
[ppc64le] hsh-install: Failed to generate package file list.
2024-Mar-29 07:43:31 :: [ppc64le] tomcat10.git 10.1.20-alt1_jvm17: remote: cannot build src.rpm
2024-Mar-29 07:43:31 :: [ppc64le] #100 tomcat10.git 10.1.20-alt1_jvm17: build FAILED
[armh] <13>Mar 29 07:43:37 rpmi: rpm-macros-java-1:5.3.0-alt1_15jpp11 sisyphus+278038.500.1.3 1625987751 installed
[armh] <13>Mar 29 07:43:37 rpmi: rpm-macros-alternatives-0.5.2-alt1 p10+309129.100.2.1 1668066636 installed
[armh] sh: /usr/share/java-utils/java-functions: No such file or directory
[armh] Reading Package Lists...
[armh] Building Dependency Tree...
[armh] MI2a: marked for install (shallow): rpm-build-java
[armh] MI2a:  satisfying Depends: python3  (NULL)
[armh] MI2a:   maybe install (a direct target): python3 3.9.18-alt1:p10+340781.400.5.1@1709555698
[armh] MI2a:  target SELECTED: python3 3.9.18-alt1:p10+340781.400.5.1@1709555698
[armh] MI2a:  requesting to install python3 (unspec'd ver; inspect with Debug::pkgMark-shallow)
[armh] MI2a:    marked for install (shallow): python3
[armh] MI2a:     satisfying Depends: python3-base = 3.9.18-alt1:p10+340781.400.5.1
[armh] MI2a:      maybe install (a direct target): python3-base 3.9.18-alt1:p10+340781.400.5.1@1709555698
[armh] MI2a:     target SELECTED: python3-base 3.9.18-alt1:p10+340781.400.5.1@1709555698
[armh] MI2a:     requesting to install python3-base (unspec'd ver; inspect with Debug::pkgMark-shallow)
[armh] MI2a:       marked for install (shallow): python3-base
[armh] MI2a:        satisfying Depends: libcrypto.so.1.1 >= set:qjvVyozNUGc9WsG7VIFPYfHMrhrfJYgsQGOmWGCgVZEeTZ3cW6ohfNyjEWIGMylk83WroOe8cvPBvDMJxj1EHIA8NcJhgZsZubMZ3n8WLt90Guhkrfl3MAsRNSE9EjmjidVpKZofuT86ioTKZKf8EB4PgGdTs1wCJderfDwMIu11WY3VxroBBL0WWhLaLkvG2dcqN5qFjpcMZdKztTSyjxzS8wKa4kvw0X9ziomSLa1mAKEgNWGjClqjdGA9WxgNcsSKoD7usW5NEHYZDL2VaeqOFOeSjZbP0CvmDlGUWpFt4IKh6ZhQwz9Pp77PWAt9PjND7Sgq0YyTXnW5K77cGZDYYy4RtH0
[armh] MI2a:         maybe install (a providing target): libcrypto1.1 1.1.1w-alt0.p10.1:p10+330586.100.4.1@1697561590
[armh] MI2a:        target SELECTED: libcrypto1.1 1.1.1w-alt0.p10.1:p10+330586.100.4.1@1697561590
[armh] MI2a:        requesting to install libcrypto1.1 (unspec'd ver; inspect with Debug::pkgMark-shallow)
[armh] MI2a:          marked for install (shallow): libcrypto1.1
[armh] MI2a:           satisfying Depends: ca-certificates  (NULL)
[armh] MI2a:            maybe install (a direct target): ca-certificates 2022.09.15-alt1:p10+308004.100.2.1@1665748370
[armh] MI2a:           target SELECTED: ca-certificates 2022.09.15-alt1:p10+308004.100.2.1@1665748370
[armh] MI2a:           requesting to install ca-certificates (unspec'd ver; inspect with Debug::pkgMark-shallow)
[armh] MI2a:             marked for install (shallow): ca-certificates
[armh] MI2a:              satisfying Depends: ca-trust  (NULL)
[armh] MI2a:               maybe install (a direct target): ca-trust 0.1.4-alt1:p10+308691.100.3.1@1667496283
[armh] MI2a:              target SELECTED: ca-trust 0.1.4-alt1:p10+308691.100.3.1@1667496283
[armh] MI2a:              requesting to install ca-trust (unspec'd ver; inspect with Debug::pkgMark-shallow)
[armh] MI2a:                marked for install (shallow): ca-trust
[armh] MI2a:                 satisfying Depends: p11-kit-trust  (NULL)
[armh] MI2a:                  maybe install (a direct target): p11-kit-trust 0.24.1-alt1:p10+305061.100.3.1@1660573569
[armh] MI2a:                 target SELECTED: p11-kit-trust 0.24.1-alt1:p10+305061.100.3.1@1660573569
[armh] MI2a:                 requesting to install p11-kit-trust (unspec'd ver; inspect with Debug::pkgMark-shallow)
[armh] MI2a:                   marked for install (shallow): p11-kit-trust
[armh] MI2a:                    satisfying Depends: /etc/alternatives/packages.d  (NULL)
[armh] MI2a:                     maybe install (a providing target): alternatives 0.5.2-alt1:p10+309129.100.2.1@1668066636
[armh] MI2a:                    target SELECTED: alternatives 0.5.2-alt1:p10+309129.100.2.1@1668066636
[armh] MI2a:                    requesting to install alternatives (unspec'd ver; inspect with Debug::pkgMark-shallow)
[armh] MI2a:                      marked for install (shallow): alternatives
[armh] MI2a:                    satisfying Depends: libtasn1.so.6 >= set:jfRaXblmF8mf5SLNNXDA2CDacDxCZqQOspDh1
[armh] MI2a:                     maybe install (a providing target): libtasn1 4.19.0-alt1:p10+309071.100.2.1@1668522838
[armh] MI2a:                    target SELECTED: libtasn1 4.19.0-alt1:p10+309071.100.2.1@1668522838
[armh] MI2a:                    requesting to install libtasn1 (unspec'd ver; inspect with Debug::pkgMark-shallow)
[armh] MI2a:                      marked for install (shallow): libtasn1
[armh] MI2a:                    satisfying Depends: libp11-kit = 0.24.1-alt1:p10+305061.100.3.1
[armh] MI2a:                     maybe install (a direct target): libp11-kit 0.24.1-alt1:p10+305061.100.3.1@1660573569
[armh] MI2a:                    target SELECTED: libp11-kit 0.24.1-alt1:p10+305061.100.3.1@1660573569
[armh] MI2a:                    requesting to install libp11-kit (unspec'd ver; inspect with Debug::pkgMark-shallow)
[armh] MI2a:                      marked for install (shallow): libp11-kit
[armh] MI2a:        satisfying Depends: libexpat.so.1 >= set:keKUFski4R0wXtka97olBOZ17REKhz7nL8ZKWHPFZ33uhaXbVkjsQcSJH5elImuwVDsGFzPXw0tsVy6wZI95ZiDLZowTr2df2WZv3q3kSPgdYNzXg
[armh] MI2a:         maybe install (a providing target): libexpat 2.5.0-alt1:p10+324220.100.1.1@1688465185
[armh] MI2a:        target SELECTED: libexpat 2.5.0-alt1:p10+324220.100.1.1@1688465185
[armh] MI2a:        requesting to install libexpat (unspec'd ver; inspect with Debug::pkgMark-shallow)
[armh] MI2a:          marked for install (shallow): libexpat
[armh] MI2a:        satisfying Depends: libgdbm.so.3 >= set:iejT6M96OmuT9HlYJ7ooGKIqQHH2
[armh] MI2a:         maybe install (a providing target): libgdbm 1.8.3-alt10:sisyphus+278100.1600.1.1@1626060299
[armh] MI2a:        target SELECTED: libgdbm 1.8.3-alt10:sisyphus+278100.1600.1.1@1626060299
[armh] MI2a:        requesting to install libgdbm (unspec'd ver; inspect with Debug::pkgMark-shallow)
[armh] MI2a:          marked for install (shallow): libgdbm
[armh] MI2a:        satisfying Depends: libssl.so.1.1 >= set:mfaB9uCfqgEZKlBwqPpgntxX2eJBMPNn4g1DtLmc9Y8ned8di2Akpva8awQUEZ6dZdsRvIlt2f6wZz9vQkhckwUWPRL2v7lRWwPb0I29PRV6VkgSw4c4yyLZBFr9cpkB0djb2kqvZiyUZlJTuYnJPH5MC1dJLCwASLNDaR1zA4dNZAg8MsyiFpQDCyvgKkMnoWXjSaBIByJ9D5FGpJ2kFynDnEsGfX0CCWF5
[armh] MI2a:         maybe install (a providing target): libssl1.1 1.1.1w-alt0.p10.1:p10+330586.100.4.1@1697561590
[armh] MI2a:        target SELECTED: libssl1.1 1.1.1w-alt0.p10.1:p10+330586.100.4.1@1697561590
[armh] MI2a:        requesting to install libssl1.1 (unspec'd ver; inspect with Debug::pkgMark-shallow)
[armh] MI2a:          marked for install (shallow): libssl1.1
[armh] MI2a:  satisfying Depends: javapackages-tools = 1:5.3.0-alt1_15jpp11:sisyphus+278038.500.1.3
[armh] MI2a:   maybe install (a direct target): javapackages-tools 1:5.3.0-alt1_15jpp11:sisyphus+278038.500.1.3@1625987751
[armh] MI2a:  target SELECTED: javapackages-tools 1:5.3.0-alt1_15jpp11:sisyphus+278038.500.1.3@1625987751
[armh] MI2a:  requesting to install javapackages-tools (unspec'd ver; inspect with Debug::pkgMark-shallow)
[armh] MI2a:    marked for install (shallow): javapackages-tools
[armh] MI2a:     satisfying Depends: javapackages-filesystem = 1:5.3.0-alt1_15jpp11:sisyphus+278038.500.1.3
[armh] MI2a:      maybe install (a direct target): javapackages-filesystem 1:5.3.0-alt1_15jpp11:sisyphus+278038.500.1.3@1625987751
[armh] MI2a:     target SELECTED: javapackages-filesystem 1:5.3.0-alt1_15jpp11:sisyphus+278038.500.1.3@1625987751
[armh] MI2a:     requesting to install javapackages-filesystem (unspec'd ver; inspect with Debug::pkgMark-shallow)
[armh] MI2a:       marked for install (shallow): javapackages-filesystem
[armh] MI2a:  satisfying Depends: python3-module-javapackages = 1:5.3.0-alt1_15jpp11:sisyphus+278038.500.1.3
[armh] MI2a:   maybe install (a direct target): python3-module-javapackages 1:5.3.0-alt1_15jpp11:sisyphus+278038.500.1.3@1625987751
[armh] MI2a:  target SELECTED: python3-module-javapackages 1:5.3.0-alt1_15jpp11:sisyphus+278038.500.1.3@1625987751
[armh] MI2a:  requesting to install python3-module-javapackages (unspec'd ver; inspect with Debug::pkgMark-shallow)
[armh] MI2a:    marked for install (shallow): python3-module-javapackages
[armh] MI2a:     satisfying Depends: python3-module-lxml  (NULL)
[armh] MI2a:      maybe install (a direct target): python3-module-lxml 4.9.3-alt1:p10+329617.100.2.1@1695317987
[armh] MI2a:     target SELECTED: python3-module-lxml 4.9.3-alt1:p10+329617.100.2.1@1695317987
[armh] MI2a:     requesting to install python3-module-lxml (unspec'd ver; inspect with Debug::pkgMark-shallow)
[armh] MI2a:       marked for install (shallow): python3-module-lxml
[armh] MI2a:        satisfying Depends: python3-module-cssselect  (NULL)
[armh] MI2a:         maybe install (a direct target): python3-module-cssselect 0.9.1-alt3:sisyphus+270533.2600.6.1@1619684675
[armh] MI2a:        target SELECTED: python3-module-cssselect 0.9.1-alt3:sisyphus+270533.2600.6.1@1619684675
[armh] MI2a:        requesting to install python3-module-cssselect (unspec'd ver; inspect with Debug::pkgMark-shallow)
[armh] MI2a:          marked for install (shallow): python3-module-cssselect
[armh] MI2a:        satisfying Depends: libexslt.so.0 >= set:ifFYpbWiXMSnz0
[armh] MI2a:         maybe install (a providing target): libxslt 1.1.34-alt3:sisyphus+275636.100.1.1@1624616875
[armh] MI2a:        target SELECTED: libxslt 1.1.34-alt3:sisyphus+275636.100.1.1@1624616875
[armh] MI2a:        requesting to install libxslt (unspec'd ver; inspect with Debug::pkgMark-shallow)
[armh] MI2a:          marked for install (shallow): libxslt
[armh] MI2a:        satisfying Depends: python3(html5lib) < 0
[armh] MI2a:         maybe install (a providing target): python3-module-html5lib 1:1.1-alt1:sisyphus+278096.120.5.1@1626086978
[armh] MI2a:        target SELECTED: python3-module-html5lib 1:1.1-alt1:sisyphus+278096.120.5.1@1626086978
[armh] MI2a:        requesting to install python3-module-html5lib (unspec'd ver; inspect with Debug::pkgMark-shallow)
[armh] MI2a:          marked for install (shallow): python3-module-html5lib
[armh] MI2a:           satisfying Depends: python3(genshi.core) < 0
[armh] MI2a:            maybe install (a providing target): python3-module-genshi 0.7.4-alt2:sisyphus+275930.100.2.1@1624873830
[armh] MI2a:           target SELECTED: python3-module-genshi 0.7.4-alt2:sisyphus+275930.100.2.1@1624873830
[armh] MI2a:           requesting to install python3-module-genshi (unspec'd ver; inspect with Debug::pkgMark-shallow)
[armh] MI2a:             marked for install (shallow): python3-module-genshi
[armh] MI2a:              satisfying Depends: python3(six) < 0
[armh] MI2a:               maybe install (a providing target): python3-module-six 1.16.0-alt1.p10:p10+340092.560.10.1@1707922977
[armh] MI2a:              target SELECTED: python3-module-six 1.16.0-alt1.p10:p10+340092.560.10.1@1707922977
[armh] MI2a:              requesting to install python3-module-six (unspec'd ver; inspect with Debug::pkgMark-shallow)
[armh] MI2a:                marked for install (shallow): python3-module-six
[armh] MI2a:           satisfying Depends: python3(webencodings) < 0
[armh] MI2a:            maybe install (a providing target): python3-module-webencodings 0.5.1-alt2:sisyphus+276020.100.1.1@1624812421
[armh] MI2a:           target SELECTED: python3-module-webencodings 0.5.1-alt2:sisyphus+276020.100.1.1@1624812421
[armh] MI2a:           requesting to install python3-module-webencodings (unspec'd ver; inspect with Debug::pkgMark-shallow)
[armh] MI2a:             marked for install (shallow): python3-module-webencodings
[armh] rpm-macros-alternatives is already the newest version.
[armh] rpm-macros-java is already the newest version.
[armh] Selecting filesystem for '/proc'
[armh] filesystem is already the newest version.
[armh] E: Couldn't find package jpackage-17-compat
[armh] hsh-install: Failed to calculate package file list.
[armh] hsh-install: Failed to generate package file list.
2024-Mar-29 07:43:38 :: [armh] tomcat10.git 10.1.20-alt1_jvm17: remote: cannot build src.rpm, but we don't care
2024-Mar-29 07:43:38 :: [armh] #100 tomcat10.git 10.1.20-alt1_jvm17: build SKIPPED
2024-Mar-29 07:43:23 :: [i586] build FAILED
2024-Mar-29 07:43:23 :: [x86_64] build FAILED
2024-Mar-29 07:43:30 :: [aarch64] build FAILED
2024-Mar-29 07:43:31 :: [ppc64le] build FAILED
2024-Mar-29 07:43:39 :: task #343887 for p10 FAILED


^ permalink raw reply	[flat|nested] 4+ messages in thread

* [#343887] [test-only] p10 FAILED (try 2) srpm=jpackage-generic-compat-0.43-alt1.src.rpm ...
  2024-03-29  7:43 [#343887] [test-only] p10 FAILED tomcat10.git=10.1.20-alt1_jvm17 Girar awaiter (aminov)
@ 2024-03-29  8:08 ` Girar awaiter (aminov)
  2024-04-01 14:54 ` [#343887] [test-only] p10 FAILED (try 3) srpm=jpackage-generic-compat-0.43-alt1.src.rpm Girar awaiter (aminov)
  2024-04-01 15:56 ` [#343887] [test-only] p10 FAILED (try 4) srpm=jpackage-generic-compat-0.43-alt1.src.rpm Girar awaiter (aminov)
  2 siblings, 0 replies; 4+ messages in thread
From: Girar awaiter (aminov) @ 2024-03-29  8:08 UTC (permalink / raw)
  To: Ilfat Aminov; +Cc: girar-builder-p10, sisyphus-incominger, girar-builder-p10

https://git.altlinux.org/tasks/343887/logs/events.2.1.log

subtask  name                     aarch64  armh    i586  ppc64le  x86_64
    #40  jpackage-generic-compat       23    33      14       24      15
   #100  tomcat10                  failed     -  failed   failed  failed

2024-Mar-29 08:06:16 :: test-only task #343887 for p10 resumed by aminov:
#40 build jpackage-generic-compat-0.43-alt1.src.rpm from sisyphus
#100 build 10.1.20-alt1_jvm17 from /gears/t/tomcat10.git fetched at 2024-Mar-29 07:42:55 from sisyphus
2024-Mar-29 08:06:16 :: created build repo
2024-Mar-29 08:06:17 :: #100: force rebuild
2024-Mar-29 08:06:18 :: [ppc64le] #40 jpackage-generic-compat-0.43-alt1.src.rpm: build start
2024-Mar-29 08:06:18 :: [armh] #40 jpackage-generic-compat-0.43-alt1.src.rpm: build start
2024-Mar-29 08:06:18 :: [aarch64] #40 jpackage-generic-compat-0.43-alt1.src.rpm: build start
2024-Mar-29 08:06:18 :: [x86_64] #40 jpackage-generic-compat-0.43-alt1.src.rpm: build start
2024-Mar-29 08:06:18 :: [i586] #40 jpackage-generic-compat-0.43-alt1.src.rpm: build start
2024-Mar-29 08:06:32 :: [i586] #40 jpackage-generic-compat-0.43-alt1.src.rpm: build OK
2024-Mar-29 08:06:33 :: [x86_64] #40 jpackage-generic-compat-0.43-alt1.src.rpm: build OK
2024-Mar-29 08:06:33 :: [i586] #100 tomcat10.git 10.1.20-alt1_jvm17: build start
2024-Mar-29 08:06:33 :: [x86_64] #100 tomcat10.git 10.1.20-alt1_jvm17: build start
2024-Mar-29 08:06:41 :: [aarch64] #40 jpackage-generic-compat-0.43-alt1.src.rpm: build OK
2024-Mar-29 08:06:41 :: [aarch64] #100 tomcat10.git 10.1.20-alt1_jvm17: build start
2024-Mar-29 08:06:42 :: [ppc64le] #40 jpackage-generic-compat-0.43-alt1.src.rpm: build OK
2024-Mar-29 08:06:42 :: [ppc64le] #100 tomcat10.git 10.1.20-alt1_jvm17: build start
2024-Mar-29 08:06:51 :: [armh] #40 jpackage-generic-compat-0.43-alt1.src.rpm: build OK
2024-Mar-29 08:06:51 :: [armh] #100 tomcat10.git 10.1.20-alt1_jvm17: build start
[armh] <13>Mar 29 08:07:21 rpmi: rpm-macros-java-1:5.3.0-alt1_15jpp11 sisyphus+278038.500.1.3 1625987751 installed
[armh] <13>Mar 29 08:07:21 rpmi: rpm-macros-alternatives-0.5.2-alt1 p10+309129.100.2.1 1668066636 installed
[armh] sh: /usr/share/java-utils/java-functions: No such file or directory
[armh] Reading Package Lists...
[armh] Building Dependency Tree...
[armh] MI2a: marked for install (shallow): rpm-build-java
[armh] MI2a:  satisfying Depends: python3  (NULL)
[armh] MI2a:   maybe install (a direct target): python3 3.9.18-alt1:p10+340781.400.5.1@1709555698
[armh] MI2a:  target SELECTED: python3 3.9.18-alt1:p10+340781.400.5.1@1709555698
[armh] MI2a:  requesting to install python3 (unspec'd ver; inspect with Debug::pkgMark-shallow)
[armh] MI2a:    marked for install (shallow): python3
[armh] MI2a:     satisfying Depends: python3-base = 3.9.18-alt1:p10+340781.400.5.1
[armh] MI2a:      maybe install (a direct target): python3-base 3.9.18-alt1:p10+340781.400.5.1@1709555698
[armh] MI2a:     target SELECTED: python3-base 3.9.18-alt1:p10+340781.400.5.1@1709555698
[armh] MI2a:     requesting to install python3-base (unspec'd ver; inspect with Debug::pkgMark-shallow)
[armh] MI2a:       marked for install (shallow): python3-base
[armh] MI2a:        satisfying Depends: libcrypto.so.1.1 >= set:qjvVyozNUGc9WsG7VIFPYfHMrhrfJYgsQGOmWGCgVZEeTZ3cW6ohfNyjEWIGMylk83WroOe8cvPBvDMJxj1EHIA8NcJhgZsZubMZ3n8WLt90Guhkrfl3MAsRNSE9EjmjidVpKZofuT86ioTKZKf8EB4PgGdTs1wCJderfDwMIu11WY3VxroBBL0WWhLaLkvG2dcqN5qFjpcMZdKztTSyjxzS8wKa4kvw0X9ziomSLa1mAKEgNWGjClqjdGA9WxgNcsSKoD7usW5NEHYZDL2VaeqOFOeSjZbP0CvmDlGUWpFt4IKh6ZhQwz9Pp77PWAt9PjND7Sgq0YyTXnW5K77cGZDYYy4RtH0
[armh] MI2a:         maybe install (a providing target): libcrypto1.1 1.1.1w-alt0.p10.1:p10+330586.100.4.1@1697561590
[armh] MI2a:        target SELECTED: libcrypto1.1 1.1.1w-alt0.p10.1:p10+330586.100.4.1@1697561590
[armh] MI2a:        requesting to install libcrypto1.1 (unspec'd ver; inspect with Debug::pkgMark-shallow)
[armh] MI2a:          marked for install (shallow): libcrypto1.1
[armh] MI2a:           satisfying Depends: ca-certificates  (NULL)
[armh] MI2a:            maybe install (a direct target): ca-certificates 2022.09.15-alt1:p10+308004.100.2.1@1665748370
[armh] MI2a:           target SELECTED: ca-certificates 2022.09.15-alt1:p10+308004.100.2.1@1665748370
[armh] MI2a:           requesting to install ca-certificates (unspec'd ver; inspect with Debug::pkgMark-shallow)
[armh] MI2a:             marked for install (shallow): ca-certificates
[armh] MI2a:              satisfying Depends: ca-trust  (NULL)
[armh] MI2a:               maybe install (a direct target): ca-trust 0.1.4-alt1:p10+308691.100.3.1@1667496283
[armh] MI2a:              target SELECTED: ca-trust 0.1.4-alt1:p10+308691.100.3.1@1667496283
[armh] MI2a:              requesting to install ca-trust (unspec'd ver; inspect with Debug::pkgMark-shallow)
[armh] MI2a:                marked for install (shallow): ca-trust
[armh] MI2a:                 satisfying Depends: p11-kit-trust  (NULL)
[armh] MI2a:                  maybe install (a direct target): p11-kit-trust 0.24.1-alt1:p10+305061.100.3.1@1660573569
[armh] MI2a:                 target SELECTED: p11-kit-trust 0.24.1-alt1:p10+305061.100.3.1@1660573569
[armh] MI2a:                 requesting to install p11-kit-trust (unspec'd ver; inspect with Debug::pkgMark-shallow)
[armh] MI2a:                   marked for install (shallow): p11-kit-trust
[armh] MI2a:                    satisfying Depends: /etc/alternatives/packages.d  (NULL)
[armh] MI2a:                     maybe install (a providing target): alternatives 0.5.2-alt1:p10+309129.100.2.1@1668066636
[armh] MI2a:                    target SELECTED: alternatives 0.5.2-alt1:p10+309129.100.2.1@1668066636
[armh] MI2a:                    requesting to install alternatives (unspec'd ver; inspect with Debug::pkgMark-shallow)
[armh] MI2a:                      marked for install (shallow): alternatives
[armh] MI2a:                    satisfying Depends: libtasn1.so.6 >= set:jfRaXblmF8mf5SLNNXDA2CDacDxCZqQOspDh1
[armh] MI2a:                     maybe install (a providing target): libtasn1 4.19.0-alt1:p10+309071.100.2.1@1668522838
[armh] MI2a:                    target SELECTED: libtasn1 4.19.0-alt1:p10+309071.100.2.1@1668522838
[armh] MI2a:                    requesting to install libtasn1 (unspec'd ver; inspect with Debug::pkgMark-shallow)
[armh] MI2a:                      marked for install (shallow): libtasn1
[armh] MI2a:                    satisfying Depends: libp11-kit = 0.24.1-alt1:p10+305061.100.3.1
[armh] MI2a:                     maybe install (a direct target): libp11-kit 0.24.1-alt1:p10+305061.100.3.1@1660573569
[armh] MI2a:                    target SELECTED: libp11-kit 0.24.1-alt1:p10+305061.100.3.1@1660573569
[armh] MI2a:                    requesting to install libp11-kit (unspec'd ver; inspect with Debug::pkgMark-shallow)
[armh] MI2a:                      marked for install (shallow): libp11-kit
[armh] MI2a:        satisfying Depends: libexpat.so.1 >= set:keKUFski4R0wXtka97olBOZ17REKhz7nL8ZKWHPFZ33uhaXbVkjsQcSJH5elImuwVDsGFzPXw0tsVy6wZI95ZiDLZowTr2df2WZv3q3kSPgdYNzXg
[armh] MI2a:         maybe install (a providing target): libexpat 2.5.0-alt1:p10+324220.100.1.1@1688465185
[armh] MI2a:        target SELECTED: libexpat 2.5.0-alt1:p10+324220.100.1.1@1688465185
[armh] MI2a:        requesting to install libexpat (unspec'd ver; inspect with Debug::pkgMark-shallow)
[armh] MI2a:          marked for install (shallow): libexpat
[armh] MI2a:        satisfying Depends: libgdbm.so.3 >= set:iejT6M96OmuT9HlYJ7ooGKIqQHH2
[armh] MI2a:         maybe install (a providing target): libgdbm 1.8.3-alt10:sisyphus+278100.1600.1.1@1626060299
[armh] MI2a:        target SELECTED: libgdbm 1.8.3-alt10:sisyphus+278100.1600.1.1@1626060299
[armh] MI2a:        requesting to install libgdbm (unspec'd ver; inspect with Debug::pkgMark-shallow)
[armh] MI2a:          marked for install (shallow): libgdbm
[armh] MI2a:        satisfying Depends: libssl.so.1.1 >= set:mfaB9uCfqgEZKlBwqPpgntxX2eJBMPNn4g1DtLmc9Y8ned8di2Akpva8awQUEZ6dZdsRvIlt2f6wZz9vQkhckwUWPRL2v7lRWwPb0I29PRV6VkgSw4c4yyLZBFr9cpkB0djb2kqvZiyUZlJTuYnJPH5MC1dJLCwASLNDaR1zA4dNZAg8MsyiFpQDCyvgKkMnoWXjSaBIByJ9D5FGpJ2kFynDnEsGfX0CCWF5
[armh] MI2a:         maybe install (a providing target): libssl1.1 1.1.1w-alt0.p10.1:p10+330586.100.4.1@1697561590
[armh] MI2a:        target SELECTED: libssl1.1 1.1.1w-alt0.p10.1:p10+330586.100.4.1@1697561590
[armh] MI2a:        requesting to install libssl1.1 (unspec'd ver; inspect with Debug::pkgMark-shallow)
[armh] MI2a:          marked for install (shallow): libssl1.1
[armh] MI2a:  satisfying Depends: javapackages-tools = 1:5.3.0-alt1_15jpp11:sisyphus+278038.500.1.3
[armh] MI2a:   maybe install (a direct target): javapackages-tools 1:5.3.0-alt1_15jpp11:sisyphus+278038.500.1.3@1625987751
[armh] MI2a:  target SELECTED: javapackages-tools 1:5.3.0-alt1_15jpp11:sisyphus+278038.500.1.3@1625987751
[armh] MI2a:  requesting to install javapackages-tools (unspec'd ver; inspect with Debug::pkgMark-shallow)
[armh] MI2a:    marked for install (shallow): javapackages-tools
[armh] MI2a:     satisfying Depends: javapackages-filesystem = 1:5.3.0-alt1_15jpp11:sisyphus+278038.500.1.3
[armh] MI2a:      maybe install (a direct target): javapackages-filesystem 1:5.3.0-alt1_15jpp11:sisyphus+278038.500.1.3@1625987751
[armh] MI2a:     target SELECTED: javapackages-filesystem 1:5.3.0-alt1_15jpp11:sisyphus+278038.500.1.3@1625987751
[armh] MI2a:     requesting to install javapackages-filesystem (unspec'd ver; inspect with Debug::pkgMark-shallow)
[armh] MI2a:       marked for install (shallow): javapackages-filesystem
[armh] MI2a:  satisfying Depends: python3-module-javapackages = 1:5.3.0-alt1_15jpp11:sisyphus+278038.500.1.3
[armh] MI2a:   maybe install (a direct target): python3-module-javapackages 1:5.3.0-alt1_15jpp11:sisyphus+278038.500.1.3@1625987751
[armh] MI2a:  target SELECTED: python3-module-javapackages 1:5.3.0-alt1_15jpp11:sisyphus+278038.500.1.3@1625987751
[armh] MI2a:  requesting to install python3-module-javapackages (unspec'd ver; inspect with Debug::pkgMark-shallow)
[armh] MI2a:    marked for install (shallow): python3-module-javapackages
[armh] MI2a:     satisfying Depends: python3-module-lxml  (NULL)
[armh] MI2a:      maybe install (a direct target): python3-module-lxml 4.9.3-alt1:p10+329617.100.2.1@1695317987
[armh] MI2a:     target SELECTED: python3-module-lxml 4.9.3-alt1:p10+329617.100.2.1@1695317987
[armh] MI2a:     requesting to install python3-module-lxml (unspec'd ver; inspect with Debug::pkgMark-shallow)
[armh] MI2a:       marked for install (shallow): python3-module-lxml
[armh] MI2a:        satisfying Depends: python3-module-cssselect  (NULL)
[armh] MI2a:         maybe install (a direct target): python3-module-cssselect 0.9.1-alt3:sisyphus+270533.2600.6.1@1619684675
[armh] MI2a:        target SELECTED: python3-module-cssselect 0.9.1-alt3:sisyphus+270533.2600.6.1@1619684675
[armh] MI2a:        requesting to install python3-module-cssselect (unspec'd ver; inspect with Debug::pkgMark-shallow)
[armh] MI2a:          marked for install (shallow): python3-module-cssselect
[armh] MI2a:        satisfying Depends: libexslt.so.0 >= set:ifFYpbWiXMSnz0
[armh] MI2a:         maybe install (a providing target): libxslt 1.1.34-alt3:sisyphus+275636.100.1.1@1624616875
[armh] MI2a:        target SELECTED: libxslt 1.1.34-alt3:sisyphus+275636.100.1.1@1624616875
[armh] MI2a:        requesting to install libxslt (unspec'd ver; inspect with Debug::pkgMark-shallow)
[armh] MI2a:          marked for install (shallow): libxslt
[armh] MI2a:        satisfying Depends: python3(html5lib) < 0
[armh] MI2a:         maybe install (a providing target): python3-module-html5lib 1:1.1-alt1:sisyphus+278096.120.5.1@1626086978
[armh] MI2a:        target SELECTED: python3-module-html5lib 1:1.1-alt1:sisyphus+278096.120.5.1@1626086978
[armh] MI2a:        requesting to install python3-module-html5lib (unspec'd ver; inspect with Debug::pkgMark-shallow)
[armh] MI2a:          marked for install (shallow): python3-module-html5lib
[armh] MI2a:           satisfying Depends: python3(genshi.core) < 0
[armh] MI2a:            maybe install (a providing target): python3-module-genshi 0.7.4-alt2:sisyphus+275930.100.2.1@1624873830
[armh] MI2a:           target SELECTED: python3-module-genshi 0.7.4-alt2:sisyphus+275930.100.2.1@1624873830
[armh] MI2a:           requesting to install python3-module-genshi (unspec'd ver; inspect with Debug::pkgMark-shallow)
[armh] MI2a:             marked for install (shallow): python3-module-genshi
[armh] MI2a:              satisfying Depends: python3(six) < 0
[armh] MI2a:               maybe install (a providing target): python3-module-six 1.16.0-alt1.p10:p10+340092.560.10.1@1707922977
[armh] MI2a:              target SELECTED: python3-module-six 1.16.0-alt1.p10:p10+340092.560.10.1@1707922977
[armh] MI2a:              requesting to install python3-module-six (unspec'd ver; inspect with Debug::pkgMark-shallow)
[armh] MI2a:                marked for install (shallow): python3-module-six
[armh] MI2a:           satisfying Depends: python3(webencodings) < 0
[armh] MI2a:            maybe install (a providing target): python3-module-webencodings 0.5.1-alt2:sisyphus+276020.100.1.1@1624812421
[armh] MI2a:           target SELECTED: python3-module-webencodings 0.5.1-alt2:sisyphus+276020.100.1.1@1624812421
[armh] MI2a:           requesting to install python3-module-webencodings (unspec'd ver; inspect with Debug::pkgMark-shallow)
[armh] MI2a:             marked for install (shallow): python3-module-webencodings
[armh] rpm-macros-alternatives is already the newest version.
[armh] rpm-macros-java is already the newest version.
[armh] Selecting filesystem for '/proc'
[armh] filesystem is already the newest version.
[armh] E: Couldn't find package jpackage-17-compat
[armh] hsh-install: Failed to calculate package file list.
[armh] hsh-install: Failed to generate package file list.
2024-Mar-29 08:07:23 :: [armh] tomcat10.git 10.1.20-alt1_jvm17: remote: cannot build src.rpm, but we don't care
2024-Mar-29 08:07:23 :: [armh] #100 tomcat10.git 10.1.20-alt1_jvm17: build SKIPPED
[aarch64] /usr/bin/build-classpath: Could not find aqute-bnd Java extension for this JVM
[aarch64] /usr/bin/build-classpath: error: Some specified jars were not found
[aarch64] ++ build-classpath slf4j/slf4j-api
[aarch64] --
[aarch64] /usr/bin/build-classpath: Could not find osgi-compendium Java extension for this JVM
[aarch64] /usr/bin/build-classpath: error: Some specified jars were not found
[aarch64] + JAVA_HOME=/usr/lib/jvm/java
[aarch64] --
[aarch64]     [javac]                                        ^
[aarch64]     [javac] /usr/src/RPM/BUILD/apache-tomcat-10.1.20-src/java/org/apache/jasper/compiler/JDTCompiler.java:315: error: cannot find symbol
[aarch64]     [javac]                 settings.put(CompilerOptions.OPTION_Source, CompilerOptions.VERSION_17);
[aarch64] --
[aarch64]     [javac]   location: class CompilerOptions
[aarch64]     [javac] /usr/src/RPM/BUILD/apache-tomcat-10.1.20-src/java/org/apache/jasper/compiler/JDTCompiler.java:394: error: cannot find symbol
[aarch64]     [javac]                 settings.put(CompilerOptions.OPTION_TargetPlatform, CompilerOptions.VERSION_17);
[aarch64] --
[aarch64]     [javac]   location: class CompilerOptions
[aarch64]     [javac] /usr/src/RPM/BUILD/apache-tomcat-10.1.20-src/java/org/apache/jasper/compiler/JDTCompiler.java:395: error: cannot find symbol
[aarch64]     [javac]                 settings.put(CompilerOptions.OPTION_Compliance, CompilerOptions.VERSION_17);
[aarch64] --
[aarch64]     [javac] 20 warnings
[aarch64] BUILD FAILED
[aarch64] /usr/src/RPM/BUILD/apache-tomcat-10.1.20-src/build.xml:1007: Compile failed; see the compiler error output for details.
2024-Mar-29 08:07:48 :: [aarch64] tomcat10.git 10.1.20-alt1_jvm17: remote: build failed
2024-Mar-29 08:07:48 :: [aarch64] #100 tomcat10.git 10.1.20-alt1_jvm17: build FAILED
2024-Mar-29 08:07:48 :: [aarch64] requesting cancellation of task processing
[ppc64le] /usr/bin/build-classpath: Could not find aqute-bnd Java extension for this JVM
[ppc64le] /usr/bin/build-classpath: error: Some specified jars were not found
[ppc64le] ++ build-classpath slf4j/slf4j-api
[ppc64le] --
[ppc64le] /usr/bin/build-classpath: Could not find osgi-compendium Java extension for this JVM
[ppc64le] /usr/bin/build-classpath: error: Some specified jars were not found
[ppc64le] + JAVA_HOME=/usr/lib/jvm/java
[ppc64le] --
[ppc64le]     [javac]                                        ^
[ppc64le]     [javac] /usr/src/RPM/BUILD/apache-tomcat-10.1.20-src/java/org/apache/jasper/compiler/JDTCompiler.java:315: error: cannot find symbol
[ppc64le]     [javac]                 settings.put(CompilerOptions.OPTION_Source, CompilerOptions.VERSION_17);
[ppc64le] --
[ppc64le]     [javac]   location: class CompilerOptions
[ppc64le]     [javac] /usr/src/RPM/BUILD/apache-tomcat-10.1.20-src/java/org/apache/jasper/compiler/JDTCompiler.java:394: error: cannot find symbol
[ppc64le]     [javac]                 settings.put(CompilerOptions.OPTION_TargetPlatform, CompilerOptions.VERSION_17);
[ppc64le] --
[ppc64le]     [javac]   location: class CompilerOptions
[ppc64le]     [javac] /usr/src/RPM/BUILD/apache-tomcat-10.1.20-src/java/org/apache/jasper/compiler/JDTCompiler.java:395: error: cannot find symbol
[ppc64le]     [javac]                 settings.put(CompilerOptions.OPTION_Compliance, CompilerOptions.VERSION_17);
[ppc64le] --
[ppc64le]     [javac] 20 warnings
[ppc64le] BUILD FAILED
[ppc64le] /usr/src/RPM/BUILD/apache-tomcat-10.1.20-src/build.xml:1007: Compile failed; see the compiler error output for details.
2024-Mar-29 08:07:56 :: [ppc64le] tomcat10.git 10.1.20-alt1_jvm17: remote: build failed
2024-Mar-29 08:07:56 :: [ppc64le] #100 tomcat10.git 10.1.20-alt1_jvm17: build FAILED
[x86_64] /usr/bin/build-classpath: Could not find aqute-bnd Java extension for this JVM
[x86_64] /usr/bin/build-classpath: error: Some specified jars were not found
[x86_64] ++ build-classpath slf4j/slf4j-api
[x86_64] --
[x86_64] /usr/bin/build-classpath: Could not find osgi-compendium Java extension for this JVM
[x86_64] /usr/bin/build-classpath: error: Some specified jars were not found
[x86_64] + JAVA_HOME=/usr/lib/jvm/java
[x86_64] --
[x86_64]     [javac]                                        ^
[x86_64]     [javac] /usr/src/RPM/BUILD/apache-tomcat-10.1.20-src/java/org/apache/jasper/compiler/JDTCompiler.java:315: error: cannot find symbol
[x86_64]     [javac]                 settings.put(CompilerOptions.OPTION_Source, CompilerOptions.VERSION_17);
[x86_64] --
[x86_64]     [javac]   location: class CompilerOptions
[x86_64]     [javac] /usr/src/RPM/BUILD/apache-tomcat-10.1.20-src/java/org/apache/jasper/compiler/JDTCompiler.java:394: error: cannot find symbol
[x86_64]     [javac]                 settings.put(CompilerOptions.OPTION_TargetPlatform, CompilerOptions.VERSION_17);
[x86_64] --
[x86_64]     [javac]   location: class CompilerOptions
[x86_64]     [javac] /usr/src/RPM/BUILD/apache-tomcat-10.1.20-src/java/org/apache/jasper/compiler/JDTCompiler.java:395: error: cannot find symbol
[x86_64]     [javac]                 settings.put(CompilerOptions.OPTION_Compliance, CompilerOptions.VERSION_17);
[x86_64] --
[x86_64]     [javac] 20 warnings
[x86_64] BUILD FAILED
[x86_64] /usr/src/RPM/BUILD/apache-tomcat-10.1.20-src/build.xml:1007: Compile failed; see the compiler error output for details.
2024-Mar-29 08:07:57 :: [x86_64] tomcat10.git 10.1.20-alt1_jvm17: remote: build failed
2024-Mar-29 08:07:57 :: [x86_64] #100 tomcat10.git 10.1.20-alt1_jvm17: build FAILED
[i586] /usr/bin/build-classpath: Could not find aqute-bnd Java extension for this JVM
[i586] /usr/bin/build-classpath: error: Some specified jars were not found
[i586] ++ build-classpath slf4j/slf4j-api
[i586] --
[i586] /usr/bin/build-classpath: Could not find osgi-compendium Java extension for this JVM
[i586] /usr/bin/build-classpath: error: Some specified jars were not found
[i586] + JAVA_HOME=/usr/lib/jvm/java
[i586] --
[i586]     [javac]                                        ^
[i586]     [javac] /usr/src/RPM/BUILD/apache-tomcat-10.1.20-src/java/org/apache/jasper/compiler/JDTCompiler.java:315: error: cannot find symbol
[i586]     [javac]                 settings.put(CompilerOptions.OPTION_Source, CompilerOptions.VERSION_17);
[i586] --
[i586]     [javac]   location: class CompilerOptions
[i586]     [javac] /usr/src/RPM/BUILD/apache-tomcat-10.1.20-src/java/org/apache/jasper/compiler/JDTCompiler.java:394: error: cannot find symbol
[i586]     [javac]                 settings.put(CompilerOptions.OPTION_TargetPlatform, CompilerOptions.VERSION_17);
[i586] --
[i586]     [javac]   location: class CompilerOptions
[i586]     [javac] /usr/src/RPM/BUILD/apache-tomcat-10.1.20-src/java/org/apache/jasper/compiler/JDTCompiler.java:395: error: cannot find symbol
[i586]     [javac]                 settings.put(CompilerOptions.OPTION_Compliance, CompilerOptions.VERSION_17);
[i586] --
[i586]     [javac] 20 warnings
[i586] BUILD FAILED
[i586] /usr/src/RPM/BUILD/apache-tomcat-10.1.20-src/build.xml:1007: Compile failed; see the compiler error output for details.
2024-Mar-29 08:08:00 :: [i586] tomcat10.git 10.1.20-alt1_jvm17: remote: build failed
2024-Mar-29 08:08:00 :: [i586] #100 tomcat10.git 10.1.20-alt1_jvm17: build FAILED
2024-Mar-29 08:07:48 :: [aarch64] build FAILED
2024-Mar-29 08:07:56 :: [ppc64le] build FAILED
2024-Mar-29 08:07:57 :: [x86_64] build FAILED
2024-Mar-29 08:08:00 :: [i586] build FAILED
2024-Mar-29 08:08:00 :: task #343887 for p10 FAILED


^ permalink raw reply	[flat|nested] 4+ messages in thread

* [#343887] [test-only] p10 FAILED (try 3) srpm=jpackage-generic-compat-0.43-alt1.src.rpm ...
  2024-03-29  7:43 [#343887] [test-only] p10 FAILED tomcat10.git=10.1.20-alt1_jvm17 Girar awaiter (aminov)
  2024-03-29  8:08 ` [#343887] [test-only] p10 FAILED (try 2) srpm=jpackage-generic-compat-0.43-alt1.src.rpm Girar awaiter (aminov)
@ 2024-04-01 14:54 ` Girar awaiter (aminov)
  2024-04-01 15:56 ` [#343887] [test-only] p10 FAILED (try 4) srpm=jpackage-generic-compat-0.43-alt1.src.rpm Girar awaiter (aminov)
  2 siblings, 0 replies; 4+ messages in thread
From: Girar awaiter (aminov) @ 2024-04-01 14:54 UTC (permalink / raw)
  To: Ilfat Aminov; +Cc: girar-builder-p10, sisyphus-incominger, girar-builder-p10

https://git.altlinux.org/tasks/343887/logs/events.3.1.log

subtask  name      aarch64  armh  i586  ppc64le  x86_64
   #200  tomcat10     2:02     -  1:30     2:17    1:23

2024-Apr-01 14:43:38 :: test-only task #343887 for p10 resumed by aminov:
#40 build jpackage-generic-compat-0.43-alt1.src.rpm from sisyphus
#100 removed
#200 build 10.1.20-alt2_jvm17 from /gears/t/tomcat10.git fetched at 2024-Apr-01 14:43:25 from sisyphus
2024-Apr-01 14:43:39 :: created build repo
2024-Apr-01 14:43:41 :: [ppc64le] #40 jpackage-generic-compat-0.43-alt1.src.rpm: build start
2024-Apr-01 14:43:41 :: [i586] #40 jpackage-generic-compat-0.43-alt1.src.rpm: build start
2024-Apr-01 14:43:41 :: [armh] #40 jpackage-generic-compat-0.43-alt1.src.rpm: build start
2024-Apr-01 14:43:41 :: [aarch64] #40 jpackage-generic-compat-0.43-alt1.src.rpm: build start
2024-Apr-01 14:43:41 :: [x86_64] #40 jpackage-generic-compat-0.43-alt1.src.rpm: build start
2024-Apr-01 14:43:57 :: [i586] #40 jpackage-generic-compat-0.43-alt1.src.rpm: build OK (cached)
2024-Apr-01 14:43:57 :: [i586] #200 tomcat10.git 10.1.20-alt2_jvm17: build start
2024-Apr-01 14:43:57 :: [x86_64] #40 jpackage-generic-compat-0.43-alt1.src.rpm: build OK (cached)
2024-Apr-01 14:43:58 :: [x86_64] #200 tomcat10.git 10.1.20-alt2_jvm17: build start
2024-Apr-01 14:44:10 :: [aarch64] #40 jpackage-generic-compat-0.43-alt1.src.rpm: build OK (cached)
2024-Apr-01 14:44:11 :: [aarch64] #200 tomcat10.git 10.1.20-alt2_jvm17: build start
2024-Apr-01 14:44:16 :: [ppc64le] #40 jpackage-generic-compat-0.43-alt1.src.rpm: build OK (cached)
2024-Apr-01 14:44:16 :: [ppc64le] #200 tomcat10.git 10.1.20-alt2_jvm17: build start
2024-Apr-01 14:44:22 :: [armh] #40 jpackage-generic-compat-0.43-alt1.src.rpm: build OK (cached)
2024-Apr-01 14:44:22 :: [armh] #200 tomcat10.git 10.1.20-alt2_jvm17: build start
[armh] <13>Apr  1 14:44:53 rpmi: rpm-macros-java-1:5.3.0-alt1_15jpp11 sisyphus+278038.500.1.3 1625987751 installed
[armh] <13>Apr  1 14:44:53 rpmi: rpm-macros-alternatives-0.5.2-alt1 p10+309129.100.2.1 1668066636 installed
[armh] sh: /usr/share/java-utils/java-functions: No such file or directory
[armh] Reading Package Lists...
[armh] Building Dependency Tree...
[armh] MI2a: marked for install (shallow): rpm-build-java
[armh] MI2a:  satisfying Depends: python3  (NULL)
[armh] MI2a:   maybe install (a direct target): python3 3.9.18-alt1:p10+340781.400.5.1@1709555698
[armh] MI2a:  target SELECTED: python3 3.9.18-alt1:p10+340781.400.5.1@1709555698
[armh] MI2a:  requesting to install python3 (unspec'd ver; inspect with Debug::pkgMark-shallow)
[armh] MI2a:    marked for install (shallow): python3
[armh] MI2a:     satisfying Depends: python3-base = 3.9.18-alt1:p10+340781.400.5.1
[armh] MI2a:      maybe install (a direct target): python3-base 3.9.18-alt1:p10+340781.400.5.1@1709555698
[armh] MI2a:     target SELECTED: python3-base 3.9.18-alt1:p10+340781.400.5.1@1709555698
[armh] MI2a:     requesting to install python3-base (unspec'd ver; inspect with Debug::pkgMark-shallow)
[armh] MI2a:       marked for install (shallow): python3-base
[armh] MI2a:        satisfying Depends: libcrypto.so.1.1 >= set:qjvVyozNUGc9WsG7VIFPYfHMrhrfJYgsQGOmWGCgVZEeTZ3cW6ohfNyjEWIGMylk83WroOe8cvPBvDMJxj1EHIA8NcJhgZsZubMZ3n8WLt90Guhkrfl3MAsRNSE9EjmjidVpKZofuT86ioTKZKf8EB4PgGdTs1wCJderfDwMIu11WY3VxroBBL0WWhLaLkvG2dcqN5qFjpcMZdKztTSyjxzS8wKa4kvw0X9ziomSLa1mAKEgNWGjClqjdGA9WxgNcsSKoD7usW5NEHYZDL2VaeqOFOeSjZbP0CvmDlGUWpFt4IKh6ZhQwz9Pp77PWAt9PjND7Sgq0YyTXnW5K77cGZDYYy4RtH0
[armh] MI2a:         maybe install (a providing target): libcrypto1.1 1.1.1w-alt0.p10.1:p10+330586.100.4.1@1697561590
[armh] MI2a:        target SELECTED: libcrypto1.1 1.1.1w-alt0.p10.1:p10+330586.100.4.1@1697561590
[armh] MI2a:        requesting to install libcrypto1.1 (unspec'd ver; inspect with Debug::pkgMark-shallow)
[armh] MI2a:          marked for install (shallow): libcrypto1.1
[armh] MI2a:           satisfying Depends: ca-certificates  (NULL)
[armh] MI2a:            maybe install (a direct target): ca-certificates 2022.09.15-alt1:p10+308004.100.2.1@1665748370
[armh] MI2a:           target SELECTED: ca-certificates 2022.09.15-alt1:p10+308004.100.2.1@1665748370
[armh] MI2a:           requesting to install ca-certificates (unspec'd ver; inspect with Debug::pkgMark-shallow)
[armh] MI2a:             marked for install (shallow): ca-certificates
[armh] MI2a:              satisfying Depends: ca-trust  (NULL)
[armh] MI2a:               maybe install (a direct target): ca-trust 0.1.4-alt1:p10+308691.100.3.1@1667496283
[armh] MI2a:              target SELECTED: ca-trust 0.1.4-alt1:p10+308691.100.3.1@1667496283
[armh] MI2a:              requesting to install ca-trust (unspec'd ver; inspect with Debug::pkgMark-shallow)
[armh] MI2a:                marked for install (shallow): ca-trust
[armh] MI2a:                 satisfying Depends: p11-kit-trust  (NULL)
[armh] MI2a:                  maybe install (a direct target): p11-kit-trust 0.24.1-alt1:p10+305061.100.3.1@1660573569
[armh] MI2a:                 target SELECTED: p11-kit-trust 0.24.1-alt1:p10+305061.100.3.1@1660573569
[armh] MI2a:                 requesting to install p11-kit-trust (unspec'd ver; inspect with Debug::pkgMark-shallow)
[armh] MI2a:                   marked for install (shallow): p11-kit-trust
[armh] MI2a:                    satisfying Depends: /etc/alternatives/packages.d  (NULL)
[armh] MI2a:                     maybe install (a providing target): alternatives 0.5.2-alt1:p10+309129.100.2.1@1668066636
[armh] MI2a:                    target SELECTED: alternatives 0.5.2-alt1:p10+309129.100.2.1@1668066636
[armh] MI2a:                    requesting to install alternatives (unspec'd ver; inspect with Debug::pkgMark-shallow)
[armh] MI2a:                      marked for install (shallow): alternatives
[armh] MI2a:                    satisfying Depends: libtasn1.so.6 >= set:jfRaXblmF8mf5SLNNXDA2CDacDxCZqQOspDh1
[armh] MI2a:                     maybe install (a providing target): libtasn1 4.19.0-alt1:p10+309071.100.2.1@1668522838
[armh] MI2a:                    target SELECTED: libtasn1 4.19.0-alt1:p10+309071.100.2.1@1668522838
[armh] MI2a:                    requesting to install libtasn1 (unspec'd ver; inspect with Debug::pkgMark-shallow)
[armh] MI2a:                      marked for install (shallow): libtasn1
[armh] MI2a:                    satisfying Depends: libp11-kit = 0.24.1-alt1:p10+305061.100.3.1
[armh] MI2a:                     maybe install (a direct target): libp11-kit 0.24.1-alt1:p10+305061.100.3.1@1660573569
[armh] MI2a:                    target SELECTED: libp11-kit 0.24.1-alt1:p10+305061.100.3.1@1660573569
[armh] MI2a:                    requesting to install libp11-kit (unspec'd ver; inspect with Debug::pkgMark-shallow)
[armh] MI2a:                      marked for install (shallow): libp11-kit
[armh] MI2a:        satisfying Depends: libexpat.so.1 >= set:keKUFski4R0wXtka97olBOZ17REKhz7nL8ZKWHPFZ33uhaXbVkjsQcSJH5elImuwVDsGFzPXw0tsVy6wZI95ZiDLZowTr2df2WZv3q3kSPgdYNzXg
[armh] MI2a:         maybe install (a providing target): libexpat 2.5.0-alt1:p10+324220.100.1.1@1688465185
[armh] MI2a:        target SELECTED: libexpat 2.5.0-alt1:p10+324220.100.1.1@1688465185
[armh] MI2a:        requesting to install libexpat (unspec'd ver; inspect with Debug::pkgMark-shallow)
[armh] MI2a:          marked for install (shallow): libexpat
[armh] MI2a:        satisfying Depends: libgdbm.so.3 >= set:iejT6M96OmuT9HlYJ7ooGKIqQHH2
[armh] MI2a:         maybe install (a providing target): libgdbm 1.8.3-alt10:sisyphus+278100.1600.1.1@1626060299
[armh] MI2a:        target SELECTED: libgdbm 1.8.3-alt10:sisyphus+278100.1600.1.1@1626060299
[armh] MI2a:        requesting to install libgdbm (unspec'd ver; inspect with Debug::pkgMark-shallow)
[armh] MI2a:          marked for install (shallow): libgdbm
[armh] MI2a:        satisfying Depends: libssl.so.1.1 >= set:mfaB9uCfqgEZKlBwqPpgntxX2eJBMPNn4g1DtLmc9Y8ned8di2Akpva8awQUEZ6dZdsRvIlt2f6wZz9vQkhckwUWPRL2v7lRWwPb0I29PRV6VkgSw4c4yyLZBFr9cpkB0djb2kqvZiyUZlJTuYnJPH5MC1dJLCwASLNDaR1zA4dNZAg8MsyiFpQDCyvgKkMnoWXjSaBIByJ9D5FGpJ2kFynDnEsGfX0CCWF5
[armh] MI2a:         maybe install (a providing target): libssl1.1 1.1.1w-alt0.p10.1:p10+330586.100.4.1@1697561590
[armh] MI2a:        target SELECTED: libssl1.1 1.1.1w-alt0.p10.1:p10+330586.100.4.1@1697561590
[armh] MI2a:        requesting to install libssl1.1 (unspec'd ver; inspect with Debug::pkgMark-shallow)
[armh] MI2a:          marked for install (shallow): libssl1.1
[armh] MI2a:  satisfying Depends: javapackages-tools = 1:5.3.0-alt1_15jpp11:sisyphus+278038.500.1.3
[armh] MI2a:   maybe install (a direct target): javapackages-tools 1:5.3.0-alt1_15jpp11:sisyphus+278038.500.1.3@1625987751
[armh] MI2a:  target SELECTED: javapackages-tools 1:5.3.0-alt1_15jpp11:sisyphus+278038.500.1.3@1625987751
[armh] MI2a:  requesting to install javapackages-tools (unspec'd ver; inspect with Debug::pkgMark-shallow)
[armh] MI2a:    marked for install (shallow): javapackages-tools
[armh] MI2a:     satisfying Depends: javapackages-filesystem = 1:5.3.0-alt1_15jpp11:sisyphus+278038.500.1.3
[armh] MI2a:      maybe install (a direct target): javapackages-filesystem 1:5.3.0-alt1_15jpp11:sisyphus+278038.500.1.3@1625987751
[armh] MI2a:     target SELECTED: javapackages-filesystem 1:5.3.0-alt1_15jpp11:sisyphus+278038.500.1.3@1625987751
[armh] MI2a:     requesting to install javapackages-filesystem (unspec'd ver; inspect with Debug::pkgMark-shallow)
[armh] MI2a:       marked for install (shallow): javapackages-filesystem
[armh] MI2a:  satisfying Depends: python3-module-javapackages = 1:5.3.0-alt1_15jpp11:sisyphus+278038.500.1.3
[armh] MI2a:   maybe install (a direct target): python3-module-javapackages 1:5.3.0-alt1_15jpp11:sisyphus+278038.500.1.3@1625987751
[armh] MI2a:  target SELECTED: python3-module-javapackages 1:5.3.0-alt1_15jpp11:sisyphus+278038.500.1.3@1625987751
[armh] MI2a:  requesting to install python3-module-javapackages (unspec'd ver; inspect with Debug::pkgMark-shallow)
[armh] MI2a:    marked for install (shallow): python3-module-javapackages
[armh] MI2a:     satisfying Depends: python3-module-lxml  (NULL)
[armh] MI2a:      maybe install (a direct target): python3-module-lxml 4.9.3-alt1:p10+329617.100.2.1@1695317987
[armh] MI2a:     target SELECTED: python3-module-lxml 4.9.3-alt1:p10+329617.100.2.1@1695317987
[armh] MI2a:     requesting to install python3-module-lxml (unspec'd ver; inspect with Debug::pkgMark-shallow)
[armh] MI2a:       marked for install (shallow): python3-module-lxml
[armh] MI2a:        satisfying Depends: python3-module-cssselect  (NULL)
[armh] MI2a:         maybe install (a direct target): python3-module-cssselect 0.9.1-alt3:sisyphus+270533.2600.6.1@1619684675
[armh] MI2a:        target SELECTED: python3-module-cssselect 0.9.1-alt3:sisyphus+270533.2600.6.1@1619684675
[armh] MI2a:        requesting to install python3-module-cssselect (unspec'd ver; inspect with Debug::pkgMark-shallow)
[armh] MI2a:          marked for install (shallow): python3-module-cssselect
[armh] MI2a:        satisfying Depends: libexslt.so.0 >= set:ifFYpbWiXMSnz0
[armh] MI2a:         maybe install (a providing target): libxslt 1.1.34-alt3:sisyphus+275636.100.1.1@1624616875
[armh] MI2a:        target SELECTED: libxslt 1.1.34-alt3:sisyphus+275636.100.1.1@1624616875
[armh] MI2a:        requesting to install libxslt (unspec'd ver; inspect with Debug::pkgMark-shallow)
[armh] MI2a:          marked for install (shallow): libxslt
[armh] MI2a:        satisfying Depends: python3(html5lib) < 0
[armh] MI2a:         maybe install (a providing target): python3-module-html5lib 1:1.1-alt1:sisyphus+278096.120.5.1@1626086978
[armh] MI2a:        target SELECTED: python3-module-html5lib 1:1.1-alt1:sisyphus+278096.120.5.1@1626086978
[armh] MI2a:        requesting to install python3-module-html5lib (unspec'd ver; inspect with Debug::pkgMark-shallow)
[armh] MI2a:          marked for install (shallow): python3-module-html5lib
[armh] MI2a:           satisfying Depends: python3(genshi.core) < 0
[armh] MI2a:            maybe install (a providing target): python3-module-genshi 0.7.4-alt2:sisyphus+275930.100.2.1@1624873830
[armh] MI2a:           target SELECTED: python3-module-genshi 0.7.4-alt2:sisyphus+275930.100.2.1@1624873830
[armh] MI2a:           requesting to install python3-module-genshi (unspec'd ver; inspect with Debug::pkgMark-shallow)
[armh] MI2a:             marked for install (shallow): python3-module-genshi
[armh] MI2a:              satisfying Depends: python3(six) < 0
[armh] MI2a:               maybe install (a providing target): python3-module-six 1.16.0-alt1.p10:p10+340092.560.10.1@1707922977
[armh] MI2a:              target SELECTED: python3-module-six 1.16.0-alt1.p10:p10+340092.560.10.1@1707922977
[armh] MI2a:              requesting to install python3-module-six (unspec'd ver; inspect with Debug::pkgMark-shallow)
[armh] MI2a:                marked for install (shallow): python3-module-six
[armh] MI2a:           satisfying Depends: python3(webencodings) < 0
[armh] MI2a:            maybe install (a providing target): python3-module-webencodings 0.5.1-alt2:sisyphus+276020.100.1.1@1624812421
[armh] MI2a:           target SELECTED: python3-module-webencodings 0.5.1-alt2:sisyphus+276020.100.1.1@1624812421
[armh] MI2a:           requesting to install python3-module-webencodings (unspec'd ver; inspect with Debug::pkgMark-shallow)
[armh] MI2a:             marked for install (shallow): python3-module-webencodings
[armh] rpm-macros-alternatives is already the newest version.
[armh] rpm-macros-java is already the newest version.
[armh] Selecting filesystem for '/proc'
[armh] filesystem is already the newest version.
[armh] E: Couldn't find package jpackage-17-compat
[armh] hsh-install: Failed to calculate package file list.
[armh] hsh-install: Failed to generate package file list.
2024-Apr-01 14:44:55 :: [armh] tomcat10.git 10.1.20-alt2_jvm17: remote: cannot build src.rpm, but we don't care
2024-Apr-01 14:44:55 :: [armh] #200 tomcat10.git 10.1.20-alt2_jvm17: build SKIPPED
2024-Apr-01 14:45:21 :: [x86_64] #200 tomcat10.git 10.1.20-alt2_jvm17: build OK
2024-Apr-01 14:45:27 :: [i586] #200 tomcat10.git 10.1.20-alt2_jvm17: build OK
2024-Apr-01 14:46:13 :: [aarch64] #200 tomcat10.git 10.1.20-alt2_jvm17: build OK
2024-Apr-01 14:46:33 :: [ppc64le] #200 tomcat10.git 10.1.20-alt2_jvm17: build OK
2024-Apr-01 14:46:53 :: #40: jpackage-generic-compat-0.43-alt1.src.rpm: build check OK
2024-Apr-01 14:47:25 :: #200: tomcat10.git 10.1.20-alt2_jvm17: build check OK
2024-Apr-01 14:47:28 :: build check OK
warning (#200): armh: non-verifiable noarch packages due to ExclusiveArch
2024-Apr-01 14:47:40 :: noarch check OK
2024-Apr-01 14:47:43 :: plan: src +2 -2 =18809, aarch64 +2 -0 =31200, armh +1 -0 =29135, i586 +2 -0 =31573, noarch +10 -10 =20198, ppc64le +2 -0 =30609, x86_64 +2 -0 =32503
#40 jpackage-generic-compat 0.38-alt0.p10.1 -> 0.43-alt1
 Fri Jan 12 2024 Igor Vlasenko <viy@altlinux> 0.43-alt1
 - added jpackage-17-compat
 Sun Jun 12 2022 Igor Vlasenko <viy@altlinux> 0.42-alt1
 - added jpackage-11 provides
 Thu Jun 09 2022 Igor Vlasenko <viy@altlinux> 0.41-alt1
 - added Conflicts for maven-openjdkXX
 Wed Jun 08 2022 Igor Vlasenko <viy@altlinux> 0.40-alt1
 - added Conflicts for maven-local-openjdkXX
 Wed Sep 01 2021 Igor Vlasenko <viy@altlinux> 0.39-alt1
 - restored jpackage-generic-compat dependency on latest jvm
#200 tomcat10 10.1.5-alt1_jvm11.p10 -> 1:10.1.20-alt2_jvm17
 Fri Mar 29 2024 Ilfat Aminov <aminov@altlinux> 1:10.1.20-alt2_jvm17
 - fix tomcat-10.1-JDTCompiler.patch for java 17 build
 Thu Mar 28 2024 Ilfat Aminov <aminov@altlinux> 1:10.1.20-alt1_jvm17
 - 10.1.20
 Fri Sep 01 2023 Ilfat Aminov <aminov@altlinux> 1:10.1.5-alt2_jvm11
 - change Provides to differ from tomcat 9
2024-Apr-01 14:48:43 :: patched apt indices
2024-Apr-01 14:49:01 :: created next repo
2024-Apr-01 14:49:10 :: duplicate provides check OK
2024-Apr-01 14:49:56 :: dependencies check OK
2024-Apr-01 14:49:59 :: [x86_64 i586 aarch64 ppc64le armh] ELF symbols check OK
2024-Apr-01 14:50:19 :: [x86_64] #40 jpackage-1.8-compat: install check OK
2024-Apr-01 14:50:21 :: [i586] #40 jpackage-1.8-compat: install check OK
2024-Apr-01 14:50:28 :: [aarch64] #40 jpackage-1.8-compat: install check OK
2024-Apr-01 14:50:31 :: [ppc64le] #40 jpackage-1.8-compat: install check OK
2024-Apr-01 14:50:32 :: [x86_64] #40 jpackage-11-compat: install check OK
2024-Apr-01 14:50:35 :: [i586] #40 jpackage-11-compat: install check OK
2024-Apr-01 14:50:44 :: [x86_64] #40 jpackage-17-compat: install check OK
2024-Apr-01 14:50:45 :: [armh] #40 jpackage-1.8-compat: install check OK
2024-Apr-01 14:50:46 :: [aarch64] #40 jpackage-11-compat: install check OK
2024-Apr-01 14:50:50 :: [i586] #40 jpackage-17-compat: install check OK
2024-Apr-01 14:50:51 :: [ppc64le] #40 jpackage-11-compat: install check OK
2024-Apr-01 14:50:57 :: [x86_64] #40 jpackage-generic-compat: install check OK
2024-Apr-01 14:51:05 :: [i586] #40 jpackage-generic-compat: install check OK
2024-Apr-01 14:51:05 :: [aarch64] #40 jpackage-17-compat: install check OK
2024-Apr-01 14:51:05 :: [x86_64] #200 tomcat10: install check OK
2024-Apr-01 14:51:12 :: [ppc64le] #40 jpackage-17-compat: install check OK
2024-Apr-01 14:51:13 :: [i586] #200 tomcat10: install check OK
2024-Apr-01 14:51:13 :: [x86_64] #200 tomcat10-admin-webapps: install check OK
2024-Apr-01 14:51:17 :: [armh] #40 jpackage-11-compat: install check OK
2024-Apr-01 14:51:21 :: [i586] #200 tomcat10-admin-webapps: install check OK
2024-Apr-01 14:51:21 :: [x86_64] #200 tomcat10-docs-webapp: install check OK
2024-Apr-01 14:51:23 :: [aarch64] #40 jpackage-generic-compat: install check OK
	x86_64: tomcat10-el-5.0-api=1:10.1.20-alt2_jvm17 post-install unowned files:
 /usr/share/java/tomcat
2024-Apr-01 14:51:28 :: [x86_64] #200 tomcat10-el-5.0-api: install check OK
2024-Apr-01 14:51:29 :: [i586] #200 tomcat10-docs-webapp: install check OK
2024-Apr-01 14:51:34 :: [ppc64le] #40 jpackage-generic-compat: install check OK
2024-Apr-01 14:51:34 :: [x86_64] #200 tomcat10-jsp-3.1-api: install check OK
	i586: tomcat10-el-5.0-api=1:10.1.20-alt2_jvm17 post-install unowned files:
 /usr/share/java/tomcat
2024-Apr-01 14:51:35 :: [i586] #200 tomcat10-el-5.0-api: install check OK
2024-Apr-01 14:51:36 :: [aarch64] #200 tomcat10: install check OK
2024-Apr-01 14:51:41 :: [i586] #200 tomcat10-jsp-3.1-api: install check OK
	x86_64: tomcat10-lib=1:10.1.20-alt2_jvm17 post-install unowned files:
 /usr/share/tomcat
 /usr/share/tomcat/bin
2024-Apr-01 14:51:41 :: [x86_64] #200 tomcat10-lib: install check OK
	i586: tomcat10-lib=1:10.1.20-alt2_jvm17 post-install unowned files:
 /usr/share/tomcat
 /usr/share/tomcat/bin
2024-Apr-01 14:51:48 :: [ppc64le] #200 tomcat10: install check OK
2024-Apr-01 14:51:48 :: [i586] #200 tomcat10-lib: install check OK
2024-Apr-01 14:51:48 :: [aarch64] #200 tomcat10-admin-webapps: install check OK
2024-Apr-01 14:51:48 :: [x86_64] #200 tomcat10-servlet-6.0-api: install check OK
2024-Apr-01 14:51:49 :: [armh] #40 jpackage-generic-compat: install check OK
2024-Apr-01 14:51:54 :: [i586] #200 tomcat10-servlet-6.0-api: install check OK
2024-Apr-01 14:51:56 :: [x86_64] #200 tomcat10-webapps: install check OK
2024-Apr-01 14:52:00 :: [aarch64] #200 tomcat10-docs-webapp: install check OK
2024-Apr-01 14:52:01 :: [ppc64le] #200 tomcat10-admin-webapps: install check OK
2024-Apr-01 14:52:02 :: [i586] #200 tomcat10-webapps: install check OK
2024-Apr-01 14:52:09 :: [armh] #200 tomcat10: install check OK
	aarch64: tomcat10-el-5.0-api=1:10.1.20-alt2_jvm17 post-install unowned files:
 /usr/share/java/tomcat
2024-Apr-01 14:52:10 :: [aarch64] #200 tomcat10-el-5.0-api: install check OK
2024-Apr-01 14:52:15 :: [ppc64le] #200 tomcat10-docs-webapp: install check OK
2024-Apr-01 14:52:20 :: [aarch64] #200 tomcat10-jsp-3.1-api: install check OK
	ppc64le: tomcat10-el-5.0-api=1:10.1.20-alt2_jvm17 post-install unowned files:
 /usr/share/java/tomcat
2024-Apr-01 14:52:26 :: [ppc64le] #200 tomcat10-el-5.0-api: install check OK
2024-Apr-01 14:52:28 :: [armh] #200 tomcat10-admin-webapps: install check OK
	aarch64: tomcat10-lib=1:10.1.20-alt2_jvm17 post-install unowned files:
 /usr/share/tomcat
 /usr/share/tomcat/bin
2024-Apr-01 14:52:30 :: [aarch64] #200 tomcat10-lib: install check OK
2024-Apr-01 14:52:37 :: [ppc64le] #200 tomcat10-jsp-3.1-api: install check OK
2024-Apr-01 14:52:40 :: [aarch64] #200 tomcat10-servlet-6.0-api: install check OK
2024-Apr-01 14:52:47 :: [armh] #200 tomcat10-docs-webapp: install check OK
	ppc64le: tomcat10-lib=1:10.1.20-alt2_jvm17 post-install unowned files:
 /usr/share/tomcat
 /usr/share/tomcat/bin
2024-Apr-01 14:52:49 :: [ppc64le] #200 tomcat10-lib: install check OK
2024-Apr-01 14:52:52 :: [aarch64] #200 tomcat10-webapps: install check OK
2024-Apr-01 14:53:01 :: [ppc64le] #200 tomcat10-servlet-6.0-api: install check OK
	armh: tomcat10-el-5.0-api=1:10.1.20-alt2_jvm17 post-install unowned files:
 /usr/share/java/tomcat
2024-Apr-01 14:53:03 :: [armh] #200 tomcat10-el-5.0-api: install check OK
2024-Apr-01 14:53:15 :: [ppc64le] #200 tomcat10-webapps: install check OK
2024-Apr-01 14:53:19 :: [armh] #200 tomcat10-jsp-3.1-api: install check OK
	armh: tomcat10-lib=1:10.1.20-alt2_jvm17 post-install unowned files:
 /usr/share/tomcat
 /usr/share/tomcat/bin
2024-Apr-01 14:53:36 :: [armh] #200 tomcat10-lib: install check OK
2024-Apr-01 14:53:52 :: [armh] #200 tomcat10-servlet-6.0-api: install check OK
2024-Apr-01 14:54:11 :: [armh] #200 tomcat10-webapps: install check OK
2024-Apr-01 14:54:34 :: [x86_64-i586] generated apt indices
2024-Apr-01 14:54:34 :: [x86_64-i586] created next repo
2024-Apr-01 14:54:45 :: [x86_64-i586] dependencies check OK
error: #200: tomcat10.git tag `10.1.20-alt2_jvm17' is not inherited from /gears/t/tomcat10.git branch `p10'
2024-Apr-01 14:54:47 :: gears inheritance check FAILED for: #200 
2024-Apr-01 14:54:47 :: task #343887 for p10 FAILED


^ permalink raw reply	[flat|nested] 4+ messages in thread

* [#343887] [test-only] p10 FAILED (try 4) srpm=jpackage-generic-compat-0.43-alt1.src.rpm ...
  2024-03-29  7:43 [#343887] [test-only] p10 FAILED tomcat10.git=10.1.20-alt1_jvm17 Girar awaiter (aminov)
  2024-03-29  8:08 ` [#343887] [test-only] p10 FAILED (try 2) srpm=jpackage-generic-compat-0.43-alt1.src.rpm Girar awaiter (aminov)
  2024-04-01 14:54 ` [#343887] [test-only] p10 FAILED (try 3) srpm=jpackage-generic-compat-0.43-alt1.src.rpm Girar awaiter (aminov)
@ 2024-04-01 15:56 ` Girar awaiter (aminov)
  2 siblings, 0 replies; 4+ messages in thread
From: Girar awaiter (aminov) @ 2024-04-01 15:56 UTC (permalink / raw)
  To: Ilfat Aminov; +Cc: girar-builder-p10, sisyphus-incominger, girar-builder-p10

https://git.altlinux.org/tasks/343887/logs/events.4.1.log

subtask  name      aarch64  armh  i586  ppc64le  x86_64
   #300  tomcat10     1:59     -  1:29     2:18    1:23

2024-Apr-01 15:47:09 :: test-only task #343887 for p10 resumed by aminov:
#40 build jpackage-generic-compat-0.43-alt1.src.rpm from sisyphus
#100 removed
#200 removed
#300 build 10.1.20-alt1_jvm17.p10 from /people/aminov/packages/tomcat10.git fetched at 2024-Apr-01 15:46:50
2024-Apr-01 15:47:10 :: created build repo
2024-Apr-01 15:47:11 :: [aarch64] #40 jpackage-generic-compat-0.43-alt1.src.rpm: build start
2024-Apr-01 15:47:11 :: [i586] #40 jpackage-generic-compat-0.43-alt1.src.rpm: build start
2024-Apr-01 15:47:11 :: [ppc64le] #40 jpackage-generic-compat-0.43-alt1.src.rpm: build start
2024-Apr-01 15:47:11 :: [armh] #40 jpackage-generic-compat-0.43-alt1.src.rpm: build start
2024-Apr-01 15:47:11 :: [x86_64] #40 jpackage-generic-compat-0.43-alt1.src.rpm: build start
2024-Apr-01 15:47:27 :: [i586] #40 jpackage-generic-compat-0.43-alt1.src.rpm: build OK (cached)
2024-Apr-01 15:47:27 :: [x86_64] #40 jpackage-generic-compat-0.43-alt1.src.rpm: build OK (cached)
2024-Apr-01 15:47:28 :: [i586] #300 tomcat10.git 10.1.20-alt1_jvm17.p10: build start
2024-Apr-01 15:47:28 :: [x86_64] #300 tomcat10.git 10.1.20-alt1_jvm17.p10: build start
2024-Apr-01 15:47:40 :: [aarch64] #40 jpackage-generic-compat-0.43-alt1.src.rpm: build OK (cached)
2024-Apr-01 15:47:40 :: [aarch64] #300 tomcat10.git 10.1.20-alt1_jvm17.p10: build start
2024-Apr-01 15:47:46 :: [ppc64le] #40 jpackage-generic-compat-0.43-alt1.src.rpm: build OK (cached)
2024-Apr-01 15:47:47 :: [ppc64le] #300 tomcat10.git 10.1.20-alt1_jvm17.p10: build start
2024-Apr-01 15:47:52 :: [armh] #40 jpackage-generic-compat-0.43-alt1.src.rpm: build OK (cached)
2024-Apr-01 15:47:53 :: [armh] #300 tomcat10.git 10.1.20-alt1_jvm17.p10: build start
[armh] <13>Apr  1 15:48:24 rpmi: rpm-macros-java-1:5.3.0-alt1_15jpp11 sisyphus+278038.500.1.3 1625987751 installed
[armh] <13>Apr  1 15:48:24 rpmi: rpm-macros-alternatives-0.5.2-alt1 p10+309129.100.2.1 1668066636 installed
[armh] sh: /usr/share/java-utils/java-functions: No such file or directory
[armh] Reading Package Lists...
[armh] Building Dependency Tree...
[armh] MI2a: marked for install (shallow): rpm-build-java
[armh] MI2a:  satisfying Depends: python3  (NULL)
[armh] MI2a:   maybe install (a direct target): python3 3.9.18-alt1:p10+340781.400.5.1@1709555698
[armh] MI2a:  target SELECTED: python3 3.9.18-alt1:p10+340781.400.5.1@1709555698
[armh] MI2a:  requesting to install python3 (unspec'd ver; inspect with Debug::pkgMark-shallow)
[armh] MI2a:    marked for install (shallow): python3
[armh] MI2a:     satisfying Depends: python3-base = 3.9.18-alt1:p10+340781.400.5.1
[armh] MI2a:      maybe install (a direct target): python3-base 3.9.18-alt1:p10+340781.400.5.1@1709555698
[armh] MI2a:     target SELECTED: python3-base 3.9.18-alt1:p10+340781.400.5.1@1709555698
[armh] MI2a:     requesting to install python3-base (unspec'd ver; inspect with Debug::pkgMark-shallow)
[armh] MI2a:       marked for install (shallow): python3-base
[armh] MI2a:        satisfying Depends: libcrypto.so.1.1 >= set:qjvVyozNUGc9WsG7VIFPYfHMrhrfJYgsQGOmWGCgVZEeTZ3cW6ohfNyjEWIGMylk83WroOe8cvPBvDMJxj1EHIA8NcJhgZsZubMZ3n8WLt90Guhkrfl3MAsRNSE9EjmjidVpKZofuT86ioTKZKf8EB4PgGdTs1wCJderfDwMIu11WY3VxroBBL0WWhLaLkvG2dcqN5qFjpcMZdKztTSyjxzS8wKa4kvw0X9ziomSLa1mAKEgNWGjClqjdGA9WxgNcsSKoD7usW5NEHYZDL2VaeqOFOeSjZbP0CvmDlGUWpFt4IKh6ZhQwz9Pp77PWAt9PjND7Sgq0YyTXnW5K77cGZDYYy4RtH0
[armh] MI2a:         maybe install (a providing target): libcrypto1.1 1.1.1w-alt0.p10.1:p10+330586.100.4.1@1697561590
[armh] MI2a:        target SELECTED: libcrypto1.1 1.1.1w-alt0.p10.1:p10+330586.100.4.1@1697561590
[armh] MI2a:        requesting to install libcrypto1.1 (unspec'd ver; inspect with Debug::pkgMark-shallow)
[armh] MI2a:          marked for install (shallow): libcrypto1.1
[armh] MI2a:           satisfying Depends: ca-certificates  (NULL)
[armh] MI2a:            maybe install (a direct target): ca-certificates 2022.09.15-alt1:p10+308004.100.2.1@1665748370
[armh] MI2a:           target SELECTED: ca-certificates 2022.09.15-alt1:p10+308004.100.2.1@1665748370
[armh] MI2a:           requesting to install ca-certificates (unspec'd ver; inspect with Debug::pkgMark-shallow)
[armh] MI2a:             marked for install (shallow): ca-certificates
[armh] MI2a:              satisfying Depends: ca-trust  (NULL)
[armh] MI2a:               maybe install (a direct target): ca-trust 0.1.4-alt1:p10+308691.100.3.1@1667496283
[armh] MI2a:              target SELECTED: ca-trust 0.1.4-alt1:p10+308691.100.3.1@1667496283
[armh] MI2a:              requesting to install ca-trust (unspec'd ver; inspect with Debug::pkgMark-shallow)
[armh] MI2a:                marked for install (shallow): ca-trust
[armh] MI2a:                 satisfying Depends: p11-kit-trust  (NULL)
[armh] MI2a:                  maybe install (a direct target): p11-kit-trust 0.24.1-alt1:p10+305061.100.3.1@1660573569
[armh] MI2a:                 target SELECTED: p11-kit-trust 0.24.1-alt1:p10+305061.100.3.1@1660573569
[armh] MI2a:                 requesting to install p11-kit-trust (unspec'd ver; inspect with Debug::pkgMark-shallow)
[armh] MI2a:                   marked for install (shallow): p11-kit-trust
[armh] MI2a:                    satisfying Depends: /etc/alternatives/packages.d  (NULL)
[armh] MI2a:                     maybe install (a providing target): alternatives 0.5.2-alt1:p10+309129.100.2.1@1668066636
[armh] MI2a:                    target SELECTED: alternatives 0.5.2-alt1:p10+309129.100.2.1@1668066636
[armh] MI2a:                    requesting to install alternatives (unspec'd ver; inspect with Debug::pkgMark-shallow)
[armh] MI2a:                      marked for install (shallow): alternatives
[armh] MI2a:                    satisfying Depends: libtasn1.so.6 >= set:jfRaXblmF8mf5SLNNXDA2CDacDxCZqQOspDh1
[armh] MI2a:                     maybe install (a providing target): libtasn1 4.19.0-alt1:p10+309071.100.2.1@1668522838
[armh] MI2a:                    target SELECTED: libtasn1 4.19.0-alt1:p10+309071.100.2.1@1668522838
[armh] MI2a:                    requesting to install libtasn1 (unspec'd ver; inspect with Debug::pkgMark-shallow)
[armh] MI2a:                      marked for install (shallow): libtasn1
[armh] MI2a:                    satisfying Depends: libp11-kit = 0.24.1-alt1:p10+305061.100.3.1
[armh] MI2a:                     maybe install (a direct target): libp11-kit 0.24.1-alt1:p10+305061.100.3.1@1660573569
[armh] MI2a:                    target SELECTED: libp11-kit 0.24.1-alt1:p10+305061.100.3.1@1660573569
[armh] MI2a:                    requesting to install libp11-kit (unspec'd ver; inspect with Debug::pkgMark-shallow)
[armh] MI2a:                      marked for install (shallow): libp11-kit
[armh] MI2a:        satisfying Depends: libexpat.so.1 >= set:keKUFski4R0wXtka97olBOZ17REKhz7nL8ZKWHPFZ33uhaXbVkjsQcSJH5elImuwVDsGFzPXw0tsVy6wZI95ZiDLZowTr2df2WZv3q3kSPgdYNzXg
[armh] MI2a:         maybe install (a providing target): libexpat 2.5.0-alt1:p10+324220.100.1.1@1688465185
[armh] MI2a:        target SELECTED: libexpat 2.5.0-alt1:p10+324220.100.1.1@1688465185
[armh] MI2a:        requesting to install libexpat (unspec'd ver; inspect with Debug::pkgMark-shallow)
[armh] MI2a:          marked for install (shallow): libexpat
[armh] MI2a:        satisfying Depends: libgdbm.so.3 >= set:iejT6M96OmuT9HlYJ7ooGKIqQHH2
[armh] MI2a:         maybe install (a providing target): libgdbm 1.8.3-alt10:sisyphus+278100.1600.1.1@1626060299
[armh] MI2a:        target SELECTED: libgdbm 1.8.3-alt10:sisyphus+278100.1600.1.1@1626060299
[armh] MI2a:        requesting to install libgdbm (unspec'd ver; inspect with Debug::pkgMark-shallow)
[armh] MI2a:          marked for install (shallow): libgdbm
[armh] MI2a:        satisfying Depends: libssl.so.1.1 >= set:mfaB9uCfqgEZKlBwqPpgntxX2eJBMPNn4g1DtLmc9Y8ned8di2Akpva8awQUEZ6dZdsRvIlt2f6wZz9vQkhckwUWPRL2v7lRWwPb0I29PRV6VkgSw4c4yyLZBFr9cpkB0djb2kqvZiyUZlJTuYnJPH5MC1dJLCwASLNDaR1zA4dNZAg8MsyiFpQDCyvgKkMnoWXjSaBIByJ9D5FGpJ2kFynDnEsGfX0CCWF5
[armh] MI2a:         maybe install (a providing target): libssl1.1 1.1.1w-alt0.p10.1:p10+330586.100.4.1@1697561590
[armh] MI2a:        target SELECTED: libssl1.1 1.1.1w-alt0.p10.1:p10+330586.100.4.1@1697561590
[armh] MI2a:        requesting to install libssl1.1 (unspec'd ver; inspect with Debug::pkgMark-shallow)
[armh] MI2a:          marked for install (shallow): libssl1.1
[armh] MI2a:  satisfying Depends: javapackages-tools = 1:5.3.0-alt1_15jpp11:sisyphus+278038.500.1.3
[armh] MI2a:   maybe install (a direct target): javapackages-tools 1:5.3.0-alt1_15jpp11:sisyphus+278038.500.1.3@1625987751
[armh] MI2a:  target SELECTED: javapackages-tools 1:5.3.0-alt1_15jpp11:sisyphus+278038.500.1.3@1625987751
[armh] MI2a:  requesting to install javapackages-tools (unspec'd ver; inspect with Debug::pkgMark-shallow)
[armh] MI2a:    marked for install (shallow): javapackages-tools
[armh] MI2a:     satisfying Depends: javapackages-filesystem = 1:5.3.0-alt1_15jpp11:sisyphus+278038.500.1.3
[armh] MI2a:      maybe install (a direct target): javapackages-filesystem 1:5.3.0-alt1_15jpp11:sisyphus+278038.500.1.3@1625987751
[armh] MI2a:     target SELECTED: javapackages-filesystem 1:5.3.0-alt1_15jpp11:sisyphus+278038.500.1.3@1625987751
[armh] MI2a:     requesting to install javapackages-filesystem (unspec'd ver; inspect with Debug::pkgMark-shallow)
[armh] MI2a:       marked for install (shallow): javapackages-filesystem
[armh] MI2a:  satisfying Depends: python3-module-javapackages = 1:5.3.0-alt1_15jpp11:sisyphus+278038.500.1.3
[armh] MI2a:   maybe install (a direct target): python3-module-javapackages 1:5.3.0-alt1_15jpp11:sisyphus+278038.500.1.3@1625987751
[armh] MI2a:  target SELECTED: python3-module-javapackages 1:5.3.0-alt1_15jpp11:sisyphus+278038.500.1.3@1625987751
[armh] MI2a:  requesting to install python3-module-javapackages (unspec'd ver; inspect with Debug::pkgMark-shallow)
[armh] MI2a:    marked for install (shallow): python3-module-javapackages
[armh] MI2a:     satisfying Depends: python3-module-lxml  (NULL)
[armh] MI2a:      maybe install (a direct target): python3-module-lxml 4.9.3-alt1:p10+329617.100.2.1@1695317987
[armh] MI2a:     target SELECTED: python3-module-lxml 4.9.3-alt1:p10+329617.100.2.1@1695317987
[armh] MI2a:     requesting to install python3-module-lxml (unspec'd ver; inspect with Debug::pkgMark-shallow)
[armh] MI2a:       marked for install (shallow): python3-module-lxml
[armh] MI2a:        satisfying Depends: python3-module-cssselect  (NULL)
[armh] MI2a:         maybe install (a direct target): python3-module-cssselect 0.9.1-alt3:sisyphus+270533.2600.6.1@1619684675
[armh] MI2a:        target SELECTED: python3-module-cssselect 0.9.1-alt3:sisyphus+270533.2600.6.1@1619684675
[armh] MI2a:        requesting to install python3-module-cssselect (unspec'd ver; inspect with Debug::pkgMark-shallow)
[armh] MI2a:          marked for install (shallow): python3-module-cssselect
[armh] MI2a:        satisfying Depends: libexslt.so.0 >= set:ifFYpbWiXMSnz0
[armh] MI2a:         maybe install (a providing target): libxslt 1.1.34-alt3:sisyphus+275636.100.1.1@1624616875
[armh] MI2a:        target SELECTED: libxslt 1.1.34-alt3:sisyphus+275636.100.1.1@1624616875
[armh] MI2a:        requesting to install libxslt (unspec'd ver; inspect with Debug::pkgMark-shallow)
[armh] MI2a:          marked for install (shallow): libxslt
[armh] MI2a:        satisfying Depends: python3(html5lib) < 0
[armh] MI2a:         maybe install (a providing target): python3-module-html5lib 1:1.1-alt1:sisyphus+278096.120.5.1@1626086978
[armh] MI2a:        target SELECTED: python3-module-html5lib 1:1.1-alt1:sisyphus+278096.120.5.1@1626086978
[armh] MI2a:        requesting to install python3-module-html5lib (unspec'd ver; inspect with Debug::pkgMark-shallow)
[armh] MI2a:          marked for install (shallow): python3-module-html5lib
[armh] MI2a:           satisfying Depends: python3(genshi.core) < 0
[armh] MI2a:            maybe install (a providing target): python3-module-genshi 0.7.4-alt2:sisyphus+275930.100.2.1@1624873830
[armh] MI2a:           target SELECTED: python3-module-genshi 0.7.4-alt2:sisyphus+275930.100.2.1@1624873830
[armh] MI2a:           requesting to install python3-module-genshi (unspec'd ver; inspect with Debug::pkgMark-shallow)
[armh] MI2a:             marked for install (shallow): python3-module-genshi
[armh] MI2a:              satisfying Depends: python3(six) < 0
[armh] MI2a:               maybe install (a providing target): python3-module-six 1.16.0-alt1.p10:p10+340092.560.10.1@1707922977
[armh] MI2a:              target SELECTED: python3-module-six 1.16.0-alt1.p10:p10+340092.560.10.1@1707922977
[armh] MI2a:              requesting to install python3-module-six (unspec'd ver; inspect with Debug::pkgMark-shallow)
[armh] MI2a:                marked for install (shallow): python3-module-six
[armh] MI2a:           satisfying Depends: python3(webencodings) < 0
[armh] MI2a:            maybe install (a providing target): python3-module-webencodings 0.5.1-alt2:sisyphus+276020.100.1.1@1624812421
[armh] MI2a:           target SELECTED: python3-module-webencodings 0.5.1-alt2:sisyphus+276020.100.1.1@1624812421
[armh] MI2a:           requesting to install python3-module-webencodings (unspec'd ver; inspect with Debug::pkgMark-shallow)
[armh] MI2a:             marked for install (shallow): python3-module-webencodings
[armh] rpm-macros-alternatives is already the newest version.
[armh] rpm-macros-java is already the newest version.
[armh] Selecting filesystem for '/proc'
[armh] filesystem is already the newest version.
[armh] E: Couldn't find package jpackage-17-compat
[armh] hsh-install: Failed to calculate package file list.
[armh] hsh-install: Failed to generate package file list.
2024-Apr-01 15:48:26 :: [armh] tomcat10.git 10.1.20-alt1_jvm17.p10: remote: cannot build src.rpm, but we don't care
2024-Apr-01 15:48:26 :: [armh] #300 tomcat10.git 10.1.20-alt1_jvm17.p10: build SKIPPED
2024-Apr-01 15:48:51 :: [x86_64] #300 tomcat10.git 10.1.20-alt1_jvm17.p10: build OK
2024-Apr-01 15:48:57 :: [i586] #300 tomcat10.git 10.1.20-alt1_jvm17.p10: build OK
2024-Apr-01 15:49:39 :: [aarch64] #300 tomcat10.git 10.1.20-alt1_jvm17.p10: build OK
2024-Apr-01 15:50:05 :: [ppc64le] #300 tomcat10.git 10.1.20-alt1_jvm17.p10: build OK
2024-Apr-01 15:50:24 :: #40: jpackage-generic-compat-0.43-alt1.src.rpm: build check OK
2024-Apr-01 15:50:52 :: #300: tomcat10.git 10.1.20-alt1_jvm17.p10: build check OK
2024-Apr-01 15:50:55 :: build check OK
warning (#300): armh: non-verifiable noarch packages due to ExclusiveArch
2024-Apr-01 15:51:06 :: noarch check OK
2024-Apr-01 15:51:09 :: plan: src +2 -2 =18809, aarch64 +2 -0 =31200, armh +1 -0 =29135, i586 +2 -0 =31573, noarch +10 -10 =20198, ppc64le +2 -0 =30609, x86_64 +2 -0 =32503
#40 jpackage-generic-compat 0.38-alt0.p10.1 -> 0.43-alt1
 Fri Jan 12 2024 Igor Vlasenko <viy@altlinux> 0.43-alt1
 - added jpackage-17-compat
 Sun Jun 12 2022 Igor Vlasenko <viy@altlinux> 0.42-alt1
 - added jpackage-11 provides
 Thu Jun 09 2022 Igor Vlasenko <viy@altlinux> 0.41-alt1
 - added Conflicts for maven-openjdkXX
 Wed Jun 08 2022 Igor Vlasenko <viy@altlinux> 0.40-alt1
 - added Conflicts for maven-local-openjdkXX
 Wed Sep 01 2021 Igor Vlasenko <viy@altlinux> 0.39-alt1
 - restored jpackage-generic-compat dependency on latest jvm
#300 tomcat10 10.1.5-alt1_jvm11.p10 -> 1:10.1.20-alt1_jvm17.p10
 Mon Apr 01 2024 Ilfat Aminov <aminov@altlinux> 1:10.1.20-alt1_jvm17.p10
 - build for p10
 Fri Mar 29 2024 Ilfat Aminov <aminov@altlinux> 1:10.1.20-alt2_jvm17
 - fix tomcat-10.1-JDTCompiler.patch for java 17 build
 Thu Mar 28 2024 Ilfat Aminov <aminov@altlinux> 1:10.1.20-alt1_jvm17
 - 10.1.20
 Fri Sep 01 2023 Ilfat Aminov <aminov@altlinux> 1:10.1.5-alt2_jvm11
 - change Provides to differ from tomcat 9
2024-Apr-01 15:51:53 :: patched apt indices
2024-Apr-01 15:52:06 :: created next repo
2024-Apr-01 15:52:14 :: duplicate provides check OK
2024-Apr-01 15:52:52 :: dependencies check OK
2024-Apr-01 15:52:53 :: [x86_64 i586 aarch64 ppc64le armh] ELF symbols check OK
2024-Apr-01 15:53:05 :: [i586] #40 jpackage-1.8-compat: install check OK (cached)
2024-Apr-01 15:53:06 :: [x86_64] #40 jpackage-1.8-compat: install check OK (cached)
2024-Apr-01 15:53:10 :: [i586] #40 jpackage-11-compat: install check OK (cached)
2024-Apr-01 15:53:10 :: [x86_64] #40 jpackage-11-compat: install check OK (cached)
2024-Apr-01 15:53:12 :: [aarch64] #40 jpackage-1.8-compat: install check OK (cached)
2024-Apr-01 15:53:13 :: [ppc64le] #40 jpackage-1.8-compat: install check OK (cached)
2024-Apr-01 15:53:14 :: [i586] #40 jpackage-17-compat: install check OK (cached)
2024-Apr-01 15:53:14 :: [x86_64] #40 jpackage-17-compat: install check OK (cached)
2024-Apr-01 15:53:18 :: [i586] #40 jpackage-generic-compat: install check OK (cached)
2024-Apr-01 15:53:19 :: [x86_64] #40 jpackage-generic-compat: install check OK (cached)
2024-Apr-01 15:53:19 :: [aarch64] #40 jpackage-11-compat: install check OK (cached)
2024-Apr-01 15:53:20 :: [armh] #40 jpackage-1.8-compat: install check OK (cached)
2024-Apr-01 15:53:22 :: [ppc64le] #40 jpackage-11-compat: install check OK (cached)
2024-Apr-01 15:53:26 :: [i586] #300 tomcat10: install check OK
2024-Apr-01 15:53:26 :: [aarch64] #40 jpackage-17-compat: install check OK (cached)
2024-Apr-01 15:53:26 :: [x86_64] #300 tomcat10: install check OK
2024-Apr-01 15:53:30 :: [ppc64le] #40 jpackage-17-compat: install check OK (cached)
2024-Apr-01 15:53:32 :: [armh] #40 jpackage-11-compat: install check OK (cached)
2024-Apr-01 15:53:34 :: [i586] #300 tomcat10-admin-webapps: install check OK
2024-Apr-01 15:53:34 :: [aarch64] #40 jpackage-generic-compat: install check OK (cached)
2024-Apr-01 15:53:34 :: [x86_64] #300 tomcat10-admin-webapps: install check OK
2024-Apr-01 15:53:38 :: [ppc64le] #40 jpackage-generic-compat: install check OK (cached)
2024-Apr-01 15:53:41 :: [i586] #300 tomcat10-docs-webapp: install check OK
2024-Apr-01 15:53:42 :: [x86_64] #300 tomcat10-docs-webapp: install check OK
2024-Apr-01 15:53:44 :: [armh] #40 jpackage-generic-compat: install check OK (cached)
2024-Apr-01 15:53:45 :: [aarch64] #300 tomcat10: install check OK
	i586: tomcat10-el-5.0-api=1:10.1.20-alt1_jvm17.p10 post-install unowned files:
 /usr/share/java/tomcat
2024-Apr-01 15:53:47 :: [i586] #300 tomcat10-el-5.0-api: install check OK
	x86_64: tomcat10-el-5.0-api=1:10.1.20-alt1_jvm17.p10 post-install unowned files:
 /usr/share/java/tomcat
2024-Apr-01 15:53:48 :: [x86_64] #300 tomcat10-el-5.0-api: install check OK
2024-Apr-01 15:53:52 :: [ppc64le] #300 tomcat10: install check OK
2024-Apr-01 15:53:54 :: [i586] #300 tomcat10-jsp-3.1-api: install check OK
2024-Apr-01 15:53:55 :: [x86_64] #300 tomcat10-jsp-3.1-api: install check OK
2024-Apr-01 15:53:57 :: [aarch64] #300 tomcat10-admin-webapps: install check OK
	i586: tomcat10-lib=1:10.1.20-alt1_jvm17.p10 post-install unowned files:
 /usr/share/tomcat
 /usr/share/tomcat/bin
2024-Apr-01 15:54:00 :: [i586] #300 tomcat10-lib: install check OK
	x86_64: tomcat10-lib=1:10.1.20-alt1_jvm17.p10 post-install unowned files:
 /usr/share/tomcat
 /usr/share/tomcat/bin
2024-Apr-01 15:54:01 :: [x86_64] #300 tomcat10-lib: install check OK
2024-Apr-01 15:54:03 :: [armh] #300 tomcat10: install check OK
2024-Apr-01 15:54:06 :: [ppc64le] #300 tomcat10-admin-webapps: install check OK
2024-Apr-01 15:54:06 :: [i586] #300 tomcat10-servlet-6.0-api: install check OK
2024-Apr-01 15:54:08 :: [x86_64] #300 tomcat10-servlet-6.0-api: install check OK
2024-Apr-01 15:54:09 :: [aarch64] #300 tomcat10-docs-webapp: install check OK
2024-Apr-01 15:54:14 :: [i586] #300 tomcat10-webapps: install check OK
2024-Apr-01 15:54:15 :: [x86_64] #300 tomcat10-webapps: install check OK
	aarch64: tomcat10-el-5.0-api=1:10.1.20-alt1_jvm17.p10 post-install unowned files:
 /usr/share/java/tomcat
2024-Apr-01 15:54:19 :: [aarch64] #300 tomcat10-el-5.0-api: install check OK
2024-Apr-01 15:54:20 :: [ppc64le] #300 tomcat10-docs-webapp: install check OK
2024-Apr-01 15:54:22 :: [armh] #300 tomcat10-admin-webapps: install check OK
2024-Apr-01 15:54:29 :: [aarch64] #300 tomcat10-jsp-3.1-api: install check OK
	ppc64le: tomcat10-el-5.0-api=1:10.1.20-alt1_jvm17.p10 post-install unowned files:
 /usr/share/java/tomcat
2024-Apr-01 15:54:31 :: [ppc64le] #300 tomcat10-el-5.0-api: install check OK
	aarch64: tomcat10-lib=1:10.1.20-alt1_jvm17.p10 post-install unowned files:
 /usr/share/tomcat
 /usr/share/tomcat/bin
2024-Apr-01 15:54:39 :: [aarch64] #300 tomcat10-lib: install check OK
2024-Apr-01 15:54:41 :: [armh] #300 tomcat10-docs-webapp: install check OK
2024-Apr-01 15:54:42 :: [ppc64le] #300 tomcat10-jsp-3.1-api: install check OK
2024-Apr-01 15:54:49 :: [aarch64] #300 tomcat10-servlet-6.0-api: install check OK
	ppc64le: tomcat10-lib=1:10.1.20-alt1_jvm17.p10 post-install unowned files:
 /usr/share/tomcat
 /usr/share/tomcat/bin
2024-Apr-01 15:54:54 :: [ppc64le] #300 tomcat10-lib: install check OK
	armh: tomcat10-el-5.0-api=1:10.1.20-alt1_jvm17.p10 post-install unowned files:
 /usr/share/java/tomcat
2024-Apr-01 15:54:57 :: [armh] #300 tomcat10-el-5.0-api: install check OK
2024-Apr-01 15:55:00 :: [aarch64] #300 tomcat10-webapps: install check OK
2024-Apr-01 15:55:05 :: [ppc64le] #300 tomcat10-servlet-6.0-api: install check OK
2024-Apr-01 15:55:13 :: [armh] #300 tomcat10-jsp-3.1-api: install check OK
2024-Apr-01 15:55:19 :: [ppc64le] #300 tomcat10-webapps: install check OK
	armh: tomcat10-lib=1:10.1.20-alt1_jvm17.p10 post-install unowned files:
 /usr/share/tomcat
 /usr/share/tomcat/bin
2024-Apr-01 15:55:30 :: [armh] #300 tomcat10-lib: install check OK
2024-Apr-01 15:55:46 :: [armh] #300 tomcat10-servlet-6.0-api: install check OK
2024-Apr-01 15:56:04 :: [armh] #300 tomcat10-webapps: install check OK
2024-Apr-01 15:56:24 :: [x86_64-i586] generated apt indices
2024-Apr-01 15:56:24 :: [x86_64-i586] created next repo
2024-Apr-01 15:56:35 :: [x86_64-i586] dependencies check OK
2024-Apr-01 15:56:36 :: gears inheritance check OK
error: #40: jpackage-generic-compat-0.43-alt1.src.rpm: missing last changelog entry from jpackage-generic-compat-0.38-alt0.p10.1.src.rpm:
* Mon Nov 01 2021	viy@altlinux	0.38-alt0.p10.1
warning: #300: tomcat10-10.1.20-alt1_jvm17.p10.src.rpm: missing last changelog entry from tomcat10-10.1.5-alt1_jvm11.p10.src.rpm (relaxed by git inheritance):
* Fri Sep 01 2023	aminov@altlinux	1:10.1.5-alt1_jvm11.p10
2024-Apr-01 15:56:37 :: srpm inheritance check FAILED for: #40 
2024-Apr-01 15:56:37 :: task #343887 for p10 FAILED


^ permalink raw reply	[flat|nested] 4+ messages in thread

end of thread, other threads:[~2024-04-01 15:56 UTC | newest]

Thread overview: 4+ messages (download: mbox.gz / follow: Atom feed)
-- links below jump to the message on this page --
2024-03-29  7:43 [#343887] [test-only] p10 FAILED tomcat10.git=10.1.20-alt1_jvm17 Girar awaiter (aminov)
2024-03-29  8:08 ` [#343887] [test-only] p10 FAILED (try 2) srpm=jpackage-generic-compat-0.43-alt1.src.rpm Girar awaiter (aminov)
2024-04-01 14:54 ` [#343887] [test-only] p10 FAILED (try 3) srpm=jpackage-generic-compat-0.43-alt1.src.rpm Girar awaiter (aminov)
2024-04-01 15:56 ` [#343887] [test-only] p10 FAILED (try 4) srpm=jpackage-generic-compat-0.43-alt1.src.rpm Girar awaiter (aminov)

ALT Linux Girar Builder robot reports

This inbox may be cloned and mirrored by anyone:

	git clone --mirror http://lore.altlinux.org/sisyphus-incominger/0 sisyphus-incominger/git/0.git

	# If you have public-inbox 1.1+ installed, you may
	# initialize and index your mirror using the following commands:
	public-inbox-init -V2 sisyphus-incominger sisyphus-incominger/ http://lore.altlinux.org/sisyphus-incominger \
		sisyphus-incominger@lists.altlinux.org sisyphus-incominger@lists.altlinux.ru sisyphus-incominger@lists.altlinux.com
	public-inbox-index sisyphus-incominger

Example config snippet for mirrors.
Newsgroup available over NNTP:
	nntp://lore.altlinux.org/org.altlinux.lists.sisyphus-incominger


AGPL code for this site: git clone https://public-inbox.org/public-inbox.git