ALT Linux Girar Builder robot reports
 help / color / mirror / Atom feed
* [#340501] [test-only] FAILED zot.git=2.0.1-alt1
@ 2024-02-12 14:14 Girar awaiter (geochip)
  2024-02-12 14:30 ` [#340501] [test-only] FAILED (try 2) zot.git=2.0.1-alt1 Girar awaiter (geochip)
                   ` (11 more replies)
  0 siblings, 12 replies; 13+ messages in thread
From: Girar awaiter (geochip) @ 2024-02-12 14:14 UTC (permalink / raw)
  To: Alexander Stepchenko; +Cc: sisyphus-incominger, girar-builder-sisyphus

https://git.altlinux.org/tasks/340501/logs/events.1.1.log

subtask  name  aarch64    armh    i586  ppc64le  x86_64
   #100  zot    failed  failed  failed   failed  failed

2024-Feb-12 14:09:16 :: test-only task #340501 for sisyphus started by geochip:
#100 build 2.0.1-alt1 from /people/geochip/packages/zot.git fetched at 2024-Feb-12 14:04:39
2024-Feb-12 14:09:18 :: [armh] #100 zot.git 2.0.1-alt1: build start
2024-Feb-12 14:09:18 :: [x86_64] #100 zot.git 2.0.1-alt1: build start
2024-Feb-12 14:09:18 :: [ppc64le] #100 zot.git 2.0.1-alt1: build start
2024-Feb-12 14:09:18 :: [i586] #100 zot.git 2.0.1-alt1: build start
2024-Feb-12 14:09:18 :: [aarch64] #100 zot.git 2.0.1-alt1: build start
[x86_64] Processing files: zot-2.0.1-alt1
[x86_64] error: File not found by glob: /usr/src/tmp/zot-buildroot/usr/bin/*
[x86_64] Executing(%doc): /bin/sh -e /usr/src/tmp/rpm-tmp.34761
2024-Feb-12 14:10:36 :: [x86_64] zot.git 2.0.1-alt1: remote: build failed
2024-Feb-12 14:10:36 :: [x86_64] #100 zot.git 2.0.1-alt1: build FAILED
2024-Feb-12 14:10:36 :: [x86_64] requesting cancellation of task processing
[i586] Processing files: zot-2.0.1-alt1
[i586] error: File not found by glob: /usr/src/tmp/zot-buildroot/usr/bin/*
[i586] Executing(%doc): /bin/sh -e /usr/src/tmp/rpm-tmp.76916
2024-Feb-12 14:11:10 :: [i586] zot.git 2.0.1-alt1: remote: build failed
2024-Feb-12 14:11:10 :: [i586] #100 zot.git 2.0.1-alt1: build FAILED
[ppc64le] Processing files: zot-2.0.1-alt1
[ppc64le] error: File not found by glob: /usr/src/tmp/zot-buildroot/usr/bin/*
[ppc64le] Executing(%doc): /bin/sh -e /usr/src/tmp/rpm-tmp.99493
2024-Feb-12 14:11:57 :: [ppc64le] zot.git 2.0.1-alt1: remote: build failed
2024-Feb-12 14:11:57 :: [ppc64le] #100 zot.git 2.0.1-alt1: build FAILED
[aarch64] Processing files: zot-2.0.1-alt1
[aarch64] error: File not found by glob: /usr/src/tmp/zot-buildroot/usr/bin/*
[aarch64] Executing(%doc): /bin/sh -e /usr/src/tmp/rpm-tmp.2766
2024-Feb-12 14:12:07 :: [aarch64] zot.git 2.0.1-alt1: remote: build failed
2024-Feb-12 14:12:07 :: [aarch64] #100 zot.git 2.0.1-alt1: build FAILED
[armh] Processing files: zot-2.0.1-alt1
[armh] error: File not found by glob: /usr/src/tmp/zot-buildroot/usr/bin/*
[armh] Executing(%doc): /bin/sh -e /usr/src/tmp/rpm-tmp.29588
2024-Feb-12 14:14:27 :: [armh] zot.git 2.0.1-alt1: remote: build failed
2024-Feb-12 14:14:27 :: [armh] #100 zot.git 2.0.1-alt1: build FAILED
2024-Feb-12 14:10:37 :: [x86_64] build FAILED
2024-Feb-12 14:11:11 :: [i586] build FAILED
2024-Feb-12 14:11:58 :: [ppc64le] build FAILED
2024-Feb-12 14:12:08 :: [aarch64] build FAILED
2024-Feb-12 14:14:28 :: [armh] build FAILED
2024-Feb-12 14:14:28 :: task #340501 for sisyphus FAILED


^ permalink raw reply	[flat|nested] 13+ messages in thread

* [#340501] [test-only] FAILED (try 2) zot.git=2.0.1-alt1
  2024-02-12 14:14 [#340501] [test-only] FAILED zot.git=2.0.1-alt1 Girar awaiter (geochip)
@ 2024-02-12 14:30 ` Girar awaiter (geochip)
  2024-02-14 11:40 ` [#340501] TESTED (try 3) zot.git=2.0.1-alt1 Girar awaiter (geochip)
                   ` (10 subsequent siblings)
  11 siblings, 0 replies; 13+ messages in thread
From: Girar awaiter (geochip) @ 2024-02-12 14:30 UTC (permalink / raw)
  To: Alexander Stepchenko; +Cc: sisyphus-incominger, girar-builder-sisyphus

https://git.altlinux.org/tasks/340501/logs/events.2.1.log

subtask  name  aarch64    armh    i586  ppc64le  x86_64
   #200  zot    failed  failed  failed   failed  failed

2024-Feb-12 14:22:03 :: test-only task #340501 for sisyphus resumed by geochip:
#100 removed
#200 build 2.0.1-alt1 from /people/geochip/packages/zot.git fetched at 2024-Feb-12 14:21:25
2024-Feb-12 14:22:06 :: [aarch64] #200 zot.git 2.0.1-alt1: build start
2024-Feb-12 14:22:06 :: [armh] #200 zot.git 2.0.1-alt1: build start
2024-Feb-12 14:22:06 :: [ppc64le] #200 zot.git 2.0.1-alt1: build start
2024-Feb-12 14:22:06 :: [x86_64] #200 zot.git 2.0.1-alt1: build start
2024-Feb-12 14:22:06 :: [i586] #200 zot.git 2.0.1-alt1: build start
[x86_64] Processing files: zot-2.0.1-alt1
[x86_64] error: File not found by glob: /usr/src/tmp/zot-buildroot/usr/bin/*
[x86_64] Executing(%doc): /bin/sh -e /usr/src/tmp/rpm-tmp.8399
2024-Feb-12 14:24:14 :: [x86_64] zot.git 2.0.1-alt1: remote: build failed
2024-Feb-12 14:24:14 :: [x86_64] #200 zot.git 2.0.1-alt1: build FAILED
2024-Feb-12 14:24:14 :: [x86_64] requesting cancellation of task processing
[i586] Processing files: zot-2.0.1-alt1
[i586] error: File not found by glob: /usr/src/tmp/zot-buildroot/usr/bin/*
[i586] Executing(%doc): /bin/sh -e /usr/src/tmp/rpm-tmp.87110
2024-Feb-12 14:24:53 :: [i586] zot.git 2.0.1-alt1: remote: build failed
2024-Feb-12 14:24:53 :: [i586] #200 zot.git 2.0.1-alt1: build FAILED
[aarch64] Processing files: zot-2.0.1-alt1
[aarch64] error: File not found by glob: /usr/src/tmp/zot-buildroot/usr/bin/*
[aarch64] Executing(%doc): /bin/sh -e /usr/src/tmp/rpm-tmp.99356
2024-Feb-12 14:26:33 :: [aarch64] zot.git 2.0.1-alt1: remote: build failed
2024-Feb-12 14:26:33 :: [aarch64] #200 zot.git 2.0.1-alt1: build FAILED
[ppc64le] Processing files: zot-2.0.1-alt1
[ppc64le] error: File not found by glob: /usr/src/tmp/zot-buildroot/usr/bin/*
[ppc64le] Executing(%doc): /bin/sh -e /usr/src/tmp/rpm-tmp.26031
2024-Feb-12 14:27:57 :: [ppc64le] zot.git 2.0.1-alt1: remote: build failed
2024-Feb-12 14:27:57 :: [ppc64le] #200 zot.git 2.0.1-alt1: build FAILED
[armh] Processing files: zot-2.0.1-alt1
[armh] error: File not found by glob: /usr/src/tmp/zot-buildroot/usr/bin/*
[armh] Executing(%doc): /bin/sh -e /usr/src/tmp/rpm-tmp.51428
2024-Feb-12 14:30:00 :: [armh] zot.git 2.0.1-alt1: remote: build failed
2024-Feb-12 14:30:00 :: [armh] #200 zot.git 2.0.1-alt1: build FAILED
2024-Feb-12 14:24:15 :: [x86_64] build FAILED
2024-Feb-12 14:24:54 :: [i586] build FAILED
2024-Feb-12 14:26:34 :: [aarch64] build FAILED
2024-Feb-12 14:27:57 :: [ppc64le] build FAILED
2024-Feb-12 14:30:01 :: [armh] build FAILED
2024-Feb-12 14:30:01 :: task #340501 for sisyphus FAILED


^ permalink raw reply	[flat|nested] 13+ messages in thread

* [#340501] TESTED (try 3) zot.git=2.0.1-alt1
  2024-02-12 14:14 [#340501] [test-only] FAILED zot.git=2.0.1-alt1 Girar awaiter (geochip)
  2024-02-12 14:30 ` [#340501] [test-only] FAILED (try 2) zot.git=2.0.1-alt1 Girar awaiter (geochip)
@ 2024-02-14 11:40 ` Girar awaiter (geochip)
  2024-02-14 12:20 ` [#340501] [test-only] FAILED (try 4) zot.git=2.0.1-alt1 Girar awaiter (geochip)
                   ` (9 subsequent siblings)
  11 siblings, 0 replies; 13+ messages in thread
From: Girar awaiter (geochip) @ 2024-02-14 11:40 UTC (permalink / raw)
  To: Alexander Stepchenko; +Cc: sisyphus-incominger, girar-builder-sisyphus

https://git.altlinux.org/tasks/340501/logs/events.3.1.log

subtask  name  aarch64  armh  i586  ppc64le  x86_64
   #300  zot      4:49  8:26  3:06     6:04    2:29

2024-Feb-14 11:26:54 :: test-only task #340501 for sisyphus resumed by geochip:
#100 removed
#200 removed
#300 build 2.0.1-alt1 from /people/geochip/packages/zot.git fetched at 2024-Feb-14 11:24:17
2024-Feb-14 11:26:54 :: waiting for a shared lock on sisyphus
2024-Feb-14 11:27:32 :: acquired a shared lock on sisyphus
2024-Feb-14 11:27:35 :: [aarch64] #300 zot.git 2.0.1-alt1: build start
2024-Feb-14 11:27:35 :: [x86_64] #300 zot.git 2.0.1-alt1: build start
2024-Feb-14 11:27:35 :: [armh] #300 zot.git 2.0.1-alt1: build start
2024-Feb-14 11:27:36 :: [ppc64le] #300 zot.git 2.0.1-alt1: build start
2024-Feb-14 11:27:36 :: [i586] #300 zot.git 2.0.1-alt1: build start
2024-Feb-14 11:30:04 :: [x86_64] #300 zot.git 2.0.1-alt1: build OK
2024-Feb-14 11:30:42 :: [i586] #300 zot.git 2.0.1-alt1: build OK
2024-Feb-14 11:32:24 :: [aarch64] #300 zot.git 2.0.1-alt1: build OK
2024-Feb-14 11:33:40 :: [ppc64le] #300 zot.git 2.0.1-alt1: build OK
2024-Feb-14 11:36:01 :: [armh] #300 zot.git 2.0.1-alt1: build OK
2024-Feb-14 11:36:13 :: #300: zot.git 2.0.1-alt1: build check OK
2024-Feb-14 11:36:15 :: build check OK
2024-Feb-14 11:36:34 :: noarch check OK
2024-Feb-14 11:36:36 :: plan: src +1 -0 =19019, aarch64 +1 -0 =31956, armh +1 -0 =29779, i586 +1 -0 =31563, ppc64le +1 -0 =31049, x86_64 +1 -0 =32860
2024-Feb-14 11:37:30 :: patched apt indices
2024-Feb-14 11:37:45 :: created next repo
2024-Feb-14 11:38:02 :: duplicate provides check OK
2024-Feb-14 11:38:45 :: dependencies check OK
nm: /tmp/aW2B0XtILg/5Pa22X5r3J: no symbols
nm: /tmp/eWlx8v_NBg/zr7Mzx7j3e: no symbols
nm: /tmp/JHvePdKpbz/Pii6sCiGlU: no symbols
2024-Feb-14 11:39:10 :: [x86_64 i586 aarch64 ppc64le armh] ELF symbols check OK
2024-Feb-14 11:39:24 :: [i586] #300 zot: install check OK
2024-Feb-14 11:39:24 :: [x86_64] #300 zot: install check OK
2024-Feb-14 11:39:33 :: [aarch64] #300 zot: install check OK
2024-Feb-14 11:39:36 :: [ppc64le] #300 zot: install check OK
2024-Feb-14 11:39:44 :: [armh] #300 zot: install check OK
2024-Feb-14 11:40:02 :: [x86_64-i586] generated apt indices
2024-Feb-14 11:40:02 :: [x86_64-i586] created next repo
2024-Feb-14 11:40:12 :: [x86_64-i586] dependencies check OK
2024-Feb-14 11:40:13 :: gears inheritance check OK
2024-Feb-14 11:40:13 :: srpm inheritance check OK
girar-check-perms: access to zot ALLOWED for geochip: project `zot' is not listed in the acl file for repository `sisyphus', and the policy for such projects in `sisyphus' is to allow
check-subtask-perms: #300: zot: allowed for geochip
2024-Feb-14 11:40:14 :: acl check OK
2024-Feb-14 11:40:26 :: created contents_index files
2024-Feb-14 11:40:36 :: created hash files: aarch64 armh i586 ppc64le src x86_64
2024-Feb-14 11:40:39 :: task #340501 for sisyphus TESTED


^ permalink raw reply	[flat|nested] 13+ messages in thread

* [#340501] [test-only] FAILED (try 4) zot.git=2.0.1-alt1
  2024-02-12 14:14 [#340501] [test-only] FAILED zot.git=2.0.1-alt1 Girar awaiter (geochip)
  2024-02-12 14:30 ` [#340501] [test-only] FAILED (try 2) zot.git=2.0.1-alt1 Girar awaiter (geochip)
  2024-02-14 11:40 ` [#340501] TESTED (try 3) zot.git=2.0.1-alt1 Girar awaiter (geochip)
@ 2024-02-14 12:20 ` Girar awaiter (geochip)
  2024-02-14 13:26 ` [#340501] TESTED (try 5) zot.git=2.0.1-alt1 Girar awaiter (geochip)
                   ` (8 subsequent siblings)
  11 siblings, 0 replies; 13+ messages in thread
From: Girar awaiter (geochip) @ 2024-02-14 12:20 UTC (permalink / raw)
  To: Alexander Stepchenko; +Cc: sisyphus-incominger, girar-builder-sisyphus

https://git.altlinux.org/tasks/340501/logs/events.4.1.log

subtask  name  aarch64    armh    i586  ppc64le  x86_64
   #500  zot    failed  failed  failed   failed  failed

2024-Feb-14 12:12:35 :: test-only task #340501 for sisyphus resumed by geochip:
#100 removed
#200 removed
#300 removed
#400 removed
#500 build 2.0.1-alt1 from /people/geochip/packages/zot.git fetched at 2024-Feb-14 12:12:25
2024-Feb-14 12:12:37 :: [x86_64] #500 zot.git 2.0.1-alt1: build start
2024-Feb-14 12:12:37 :: [armh] #500 zot.git 2.0.1-alt1: build start
2024-Feb-14 12:12:38 :: [ppc64le] #500 zot.git 2.0.1-alt1: build start
2024-Feb-14 12:12:38 :: [aarch64] #500 zot.git 2.0.1-alt1: build start
2024-Feb-14 12:12:38 :: [i586] #500 zot.git 2.0.1-alt1: build start
2024-Feb-14 12:13:47 :: task abort requested by geochip.
[x86_64] Processing files: zot-2.0.1-alt1
[x86_64] error: No such file or directory: /usr/src/tmp/zot-buildroot/lib/systemd/system/zot.service
[x86_64] error: No such file or directory: /usr/src/tmp/zot-buildroot/etc/config.json
[x86_64] Executing(%doc): /bin/sh -e /usr/src/tmp/rpm-tmp.16171
[x86_64] --
[x86_64] RPM build errors:
[x86_64]     No such file or directory: /usr/src/tmp/zot-buildroot/lib/systemd/system/zot.service
[x86_64]     No such file or directory: /usr/src/tmp/zot-buildroot/etc/config.json
2024-Feb-14 12:14:46 :: [x86_64] zot.git 2.0.1-alt1: remote: build failed
2024-Feb-14 12:14:46 :: [x86_64] #500 zot.git 2.0.1-alt1: build FAILED
[i586] Processing files: zot-2.0.1-alt1
[i586] error: No such file or directory: /usr/src/tmp/zot-buildroot/lib/systemd/system/zot.service
[i586] error: No such file or directory: /usr/src/tmp/zot-buildroot/etc/config.json
[i586] Executing(%doc): /bin/sh -e /usr/src/tmp/rpm-tmp.76608
[i586] --
[i586] RPM build errors:
[i586]     No such file or directory: /usr/src/tmp/zot-buildroot/lib/systemd/system/zot.service
[i586]     No such file or directory: /usr/src/tmp/zot-buildroot/etc/config.json
2024-Feb-14 12:15:21 :: [i586] zot.git 2.0.1-alt1: remote: build failed
2024-Feb-14 12:15:21 :: [i586] #500 zot.git 2.0.1-alt1: build FAILED
[aarch64] Processing files: zot-2.0.1-alt1
[aarch64] error: No such file or directory: /usr/src/tmp/zot-buildroot/lib/systemd/system/zot.service
[aarch64] error: No such file or directory: /usr/src/tmp/zot-buildroot/etc/config.json
[aarch64] Executing(%doc): /bin/sh -e /usr/src/tmp/rpm-tmp.41273
[aarch64] --
[aarch64] RPM build errors:
[aarch64]     No such file or directory: /usr/src/tmp/zot-buildroot/lib/systemd/system/zot.service
[aarch64]     No such file or directory: /usr/src/tmp/zot-buildroot/etc/config.json
2024-Feb-14 12:17:01 :: [aarch64] zot.git 2.0.1-alt1: remote: build failed
2024-Feb-14 12:17:01 :: [aarch64] #500 zot.git 2.0.1-alt1: build FAILED
[ppc64le] Processing files: zot-2.0.1-alt1
[ppc64le] error: No such file or directory: /usr/src/tmp/zot-buildroot/lib/systemd/system/zot.service
[ppc64le] error: No such file or directory: /usr/src/tmp/zot-buildroot/etc/config.json
[ppc64le] Executing(%doc): /bin/sh -e /usr/src/tmp/rpm-tmp.83207
[ppc64le] --
[ppc64le] RPM build errors:
[ppc64le]     No such file or directory: /usr/src/tmp/zot-buildroot/lib/systemd/system/zot.service
[ppc64le]     No such file or directory: /usr/src/tmp/zot-buildroot/etc/config.json
2024-Feb-14 12:18:26 :: [ppc64le] zot.git 2.0.1-alt1: remote: build failed
2024-Feb-14 12:18:26 :: [ppc64le] #500 zot.git 2.0.1-alt1: build FAILED
[armh] Processing files: zot-2.0.1-alt1
[armh] error: No such file or directory: /usr/src/tmp/zot-buildroot/lib/systemd/system/zot.service
[armh] error: No such file or directory: /usr/src/tmp/zot-buildroot/etc/config.json
[armh] Executing(%doc): /bin/sh -e /usr/src/tmp/rpm-tmp.39803
[armh] --
[armh] RPM build errors:
[armh]     No such file or directory: /usr/src/tmp/zot-buildroot/lib/systemd/system/zot.service
[armh]     No such file or directory: /usr/src/tmp/zot-buildroot/etc/config.json
2024-Feb-14 12:20:22 :: [armh] zot.git 2.0.1-alt1: remote: build failed
2024-Feb-14 12:20:22 :: [armh] #500 zot.git 2.0.1-alt1: build FAILED
2024-Feb-14 12:14:47 :: [x86_64] build FAILED
2024-Feb-14 12:15:22 :: [i586] build FAILED
2024-Feb-14 12:17:01 :: [aarch64] build FAILED
2024-Feb-14 12:18:26 :: [ppc64le] build FAILED
2024-Feb-14 12:20:23 :: [armh] build FAILED
2024-Feb-14 12:20:23 :: task #340501 for sisyphus FAILED


^ permalink raw reply	[flat|nested] 13+ messages in thread

* [#340501] TESTED (try 5) zot.git=2.0.1-alt1
  2024-02-12 14:14 [#340501] [test-only] FAILED zot.git=2.0.1-alt1 Girar awaiter (geochip)
                   ` (2 preceding siblings ...)
  2024-02-14 12:20 ` [#340501] [test-only] FAILED (try 4) zot.git=2.0.1-alt1 Girar awaiter (geochip)
@ 2024-02-14 13:26 ` Girar awaiter (geochip)
  2024-02-14 14:00 ` [#340501] TESTED (try 6) zot.git=2.0.1-alt1 Girar awaiter (geochip)
                   ` (7 subsequent siblings)
  11 siblings, 0 replies; 13+ messages in thread
From: Girar awaiter (geochip) @ 2024-02-14 13:26 UTC (permalink / raw)
  To: Alexander Stepchenko; +Cc: sisyphus-incominger, girar-builder-sisyphus

https://git.altlinux.org/tasks/340501/logs/events.5.1.log

subtask  name  aarch64  armh  i586  ppc64le  x86_64
   #600  zot      4:54  8:52  3:03     6:11    2:26

2024-Feb-14 13:12:53 :: test-only task #340501 for sisyphus resumed by geochip:
#100 removed
#200 removed
#300 removed
#400 removed
#500 removed
#600 build 2.0.1-alt1 from /people/geochip/packages/zot.git fetched at 2024-Feb-14 13:11:45
2024-Feb-14 13:12:56 :: [i586] #600 zot.git 2.0.1-alt1: build start
2024-Feb-14 13:12:56 :: [x86_64] #600 zot.git 2.0.1-alt1: build start
2024-Feb-14 13:12:56 :: [aarch64] #600 zot.git 2.0.1-alt1: build start
2024-Feb-14 13:12:56 :: [armh] #600 zot.git 2.0.1-alt1: build start
2024-Feb-14 13:12:56 :: [ppc64le] #600 zot.git 2.0.1-alt1: build start
2024-Feb-14 13:15:22 :: [x86_64] #600 zot.git 2.0.1-alt1: build OK
2024-Feb-14 13:15:59 :: [i586] #600 zot.git 2.0.1-alt1: build OK
2024-Feb-14 13:17:50 :: [aarch64] #600 zot.git 2.0.1-alt1: build OK
2024-Feb-14 13:19:07 :: [ppc64le] #600 zot.git 2.0.1-alt1: build OK
2024-Feb-14 13:21:48 :: [armh] #600 zot.git 2.0.1-alt1: build OK
2024-Feb-14 13:22:00 :: #600: zot.git 2.0.1-alt1: build check OK
2024-Feb-14 13:22:02 :: build check OK
2024-Feb-14 13:22:18 :: noarch check OK
2024-Feb-14 13:22:20 :: plan: src +1 -0 =19019, aarch64 +1 -0 =31956, armh +1 -0 =29779, i586 +1 -0 =31563, ppc64le +1 -0 =31049, x86_64 +1 -0 =32860
2024-Feb-14 13:23:08 :: patched apt indices
2024-Feb-14 13:23:22 :: created next repo
2024-Feb-14 13:23:31 :: duplicate provides check OK
2024-Feb-14 13:24:08 :: dependencies check OK
nm: /tmp/oxurk7Cqua/xD6cvQDbta: no symbols
nm: /tmp/p9MyUnlJVO/BiDl6rlIIA: no symbols
nm: /tmp/2rJyRA3Pht/C7DI7uweWG: no symbols
2024-Feb-14 13:24:30 :: [x86_64 i586 aarch64 ppc64le armh] ELF symbols check OK
	x86_64: zot=2.0.1-alt1 post-install unowned files:
 /etc/zot
	i586: zot=2.0.1-alt1 post-install unowned files:
 /etc/zot
2024-Feb-14 13:24:44 :: [x86_64] #600 zot: install check OK
2024-Feb-14 13:24:44 :: [i586] #600 zot: install check OK
	aarch64: zot=2.0.1-alt1 post-install unowned files:
 /etc/zot
2024-Feb-14 13:24:54 :: [aarch64] #600 zot: install check OK
	ppc64le: zot=2.0.1-alt1 post-install unowned files:
 /etc/zot
2024-Feb-14 13:24:56 :: [ppc64le] #600 zot: install check OK
	armh: zot=2.0.1-alt1 post-install unowned files:
 /etc/zot
2024-Feb-14 13:25:06 :: [armh] #600 zot: install check OK
2024-Feb-14 13:25:25 :: [x86_64-i586] generated apt indices
2024-Feb-14 13:25:25 :: [x86_64-i586] created next repo
2024-Feb-14 13:25:37 :: [x86_64-i586] dependencies check OK
2024-Feb-14 13:25:38 :: gears inheritance check OK
2024-Feb-14 13:25:38 :: srpm inheritance check OK
girar-check-perms: access to zot ALLOWED for geochip: project `zot' is not listed in the acl file for repository `sisyphus', and the policy for such projects in `sisyphus' is to allow
check-subtask-perms: #600: zot: allowed for geochip
2024-Feb-14 13:25:39 :: acl check OK
2024-Feb-14 13:25:55 :: created contents_index files
2024-Feb-14 13:26:07 :: created hash files: aarch64 armh i586 ppc64le src x86_64
2024-Feb-14 13:26:10 :: task #340501 for sisyphus TESTED


^ permalink raw reply	[flat|nested] 13+ messages in thread

* [#340501] TESTED (try 6) zot.git=2.0.1-alt1
  2024-02-12 14:14 [#340501] [test-only] FAILED zot.git=2.0.1-alt1 Girar awaiter (geochip)
                   ` (3 preceding siblings ...)
  2024-02-14 13:26 ` [#340501] TESTED (try 5) zot.git=2.0.1-alt1 Girar awaiter (geochip)
@ 2024-02-14 14:00 ` Girar awaiter (geochip)
  2024-02-14 14:15 ` [#340501] TESTED (try 7) zot.git=2.0.1-alt1 Girar awaiter (geochip)
                   ` (6 subsequent siblings)
  11 siblings, 0 replies; 13+ messages in thread
From: Girar awaiter (geochip) @ 2024-02-14 14:00 UTC (permalink / raw)
  To: Alexander Stepchenko; +Cc: sisyphus-incominger, girar-builder-sisyphus

https://git.altlinux.org/tasks/340501/logs/events.6.1.log

subtask  name  aarch64  armh  i586  ppc64le  x86_64
  #1000  zot      4:51  8:32  3:04     6:10    2:26

2024-Feb-14 13:47:18 :: test-only task #340501 for sisyphus resumed by geochip:
#100 removed
#200 removed
#300 removed
#400 removed
#500 removed
#600 removed
#700 removed
#1000 build 2.0.1-alt1 from /people/geochip/packages/zot.git fetched at 2024-Feb-14 13:46:14
2024-Feb-14 13:47:20 :: [ppc64le] #1000 zot.git 2.0.1-alt1: build start
2024-Feb-14 13:47:20 :: [aarch64] #1000 zot.git 2.0.1-alt1: build start
2024-Feb-14 13:47:20 :: [x86_64] #1000 zot.git 2.0.1-alt1: build start
2024-Feb-14 13:47:20 :: [armh] #1000 zot.git 2.0.1-alt1: build start
2024-Feb-14 13:47:20 :: [i586] #1000 zot.git 2.0.1-alt1: build start
2024-Feb-14 13:49:46 :: [x86_64] #1000 zot.git 2.0.1-alt1: build OK
2024-Feb-14 13:50:24 :: [i586] #1000 zot.git 2.0.1-alt1: build OK
2024-Feb-14 13:52:11 :: [aarch64] #1000 zot.git 2.0.1-alt1: build OK
2024-Feb-14 13:53:30 :: [ppc64le] #1000 zot.git 2.0.1-alt1: build OK
2024-Feb-14 13:55:52 :: [armh] #1000 zot.git 2.0.1-alt1: build OK
2024-Feb-14 13:56:05 :: #1000: zot.git 2.0.1-alt1: build check OK
2024-Feb-14 13:56:07 :: build check OK
2024-Feb-14 13:56:25 :: noarch check OK
2024-Feb-14 13:56:28 :: plan: src +1 -0 =19020, aarch64 +1 -0 =31956, armh +1 -0 =29779, i586 +1 -0 =31563, ppc64le +1 -0 =31049, x86_64 +1 -0 =32860
2024-Feb-14 13:57:22 :: patched apt indices
2024-Feb-14 13:57:35 :: created next repo
2024-Feb-14 13:57:44 :: duplicate provides check OK
2024-Feb-14 13:58:22 :: dependencies check OK
nm: /tmp/oZPZ_Mm7io/P5ASEbYjA4: no symbols
nm: /tmp/IXSUTXfRCf/YR2O1XBt0U: no symbols
nm: /tmp/oZPZ_Mm7io/RLjCfQTxNs: no symbols
nm: /tmp/uDxuyaAPxr/tiGN74ISP_: no symbols
nm: /tmp/IXSUTXfRCf/ORAeE9NuC9: no symbols
nm: /tmp/uDxuyaAPxr/WGBaZiFQ2_: no symbols
nm: /tmp/IXSUTXfRCf/vo2WtcyeDu: no symbols
nm: /tmp/oZPZ_Mm7io/lNCs8kTYUw: no symbols
nm: /tmp/uDxuyaAPxr/uCVmhjEnIx: no symbols
2024-Feb-14 13:58:45 :: [x86_64 i586 aarch64 ppc64le armh] ELF symbols check OK
	x86_64: zot=2.0.1-alt1 post-install unowned files:
 /etc/zot
	i586: zot=2.0.1-alt1 post-install unowned files:
 /etc/zot
2024-Feb-14 13:58:59 :: [x86_64] #1000 zot: install check OK
2024-Feb-14 13:58:59 :: [i586] #1000 zot: install check OK
	aarch64: zot=2.0.1-alt1 post-install unowned files:
 /etc/zot
2024-Feb-14 13:59:09 :: [aarch64] #1000 zot: install check OK
	ppc64le: zot=2.0.1-alt1 post-install unowned files:
 /etc/zot
2024-Feb-14 13:59:11 :: [ppc64le] #1000 zot: install check OK
	armh: zot=2.0.1-alt1 post-install unowned files:
 /etc/zot
2024-Feb-14 13:59:20 :: [armh] #1000 zot: install check OK
2024-Feb-14 13:59:36 :: [x86_64-i586] generated apt indices
2024-Feb-14 13:59:36 :: [x86_64-i586] created next repo
2024-Feb-14 13:59:45 :: [x86_64-i586] dependencies check OK
2024-Feb-14 13:59:46 :: gears inheritance check OK
2024-Feb-14 13:59:46 :: srpm inheritance check OK
girar-check-perms: access to zot ALLOWED for geochip: project `zot' is not listed in the acl file for repository `sisyphus', and the policy for such projects in `sisyphus' is to allow
check-subtask-perms: #1000: zot: allowed for geochip
2024-Feb-14 13:59:47 :: acl check OK
2024-Feb-14 13:59:59 :: created contents_index files
2024-Feb-14 14:00:08 :: created hash files: aarch64 armh i586 ppc64le src x86_64
2024-Feb-14 14:00:11 :: task #340501 for sisyphus TESTED


^ permalink raw reply	[flat|nested] 13+ messages in thread

* [#340501] TESTED (try 7) zot.git=2.0.1-alt1
  2024-02-12 14:14 [#340501] [test-only] FAILED zot.git=2.0.1-alt1 Girar awaiter (geochip)
                   ` (4 preceding siblings ...)
  2024-02-14 14:00 ` [#340501] TESTED (try 6) zot.git=2.0.1-alt1 Girar awaiter (geochip)
@ 2024-02-14 14:15 ` Girar awaiter (geochip)
  2024-02-14 16:41 ` [#340501] TESTED (try 8) zot.git=2.0.1-alt1 Girar awaiter (geochip)
                   ` (5 subsequent siblings)
  11 siblings, 0 replies; 13+ messages in thread
From: Girar awaiter (geochip) @ 2024-02-14 14:15 UTC (permalink / raw)
  To: Alexander Stepchenko; +Cc: sisyphus-incominger, girar-builder-sisyphus

https://git.altlinux.org/tasks/340501/logs/events.7.1.log

subtask  name  aarch64  armh  i586  ppc64le  x86_64
  #1100  zot      6:15  9:02  3:05     6:07    2:28

2024-Feb-14 14:02:01 :: test-only task #340501 for sisyphus resumed by geochip:
#100 removed
#200 removed
#300 removed
#400 removed
#500 removed
#600 removed
#700 removed
#1000 removed
#1100 build 2.0.1-alt1 from /people/geochip/packages/zot.git fetched at 2024-Feb-14 14:01:50
2024-Feb-14 14:02:03 :: [armh] #1100 zot.git 2.0.1-alt1: build start
2024-Feb-14 14:02:03 :: [ppc64le] #1100 zot.git 2.0.1-alt1: build start
2024-Feb-14 14:02:03 :: [i586] #1100 zot.git 2.0.1-alt1: build start
2024-Feb-14 14:02:03 :: [aarch64] #1100 zot.git 2.0.1-alt1: build start
2024-Feb-14 14:02:03 :: [x86_64] #1100 zot.git 2.0.1-alt1: build start
2024-Feb-14 14:04:31 :: [x86_64] #1100 zot.git 2.0.1-alt1: build OK
2024-Feb-14 14:05:08 :: [i586] #1100 zot.git 2.0.1-alt1: build OK
2024-Feb-14 14:08:10 :: [ppc64le] #1100 zot.git 2.0.1-alt1: build OK
2024-Feb-14 14:08:18 :: [aarch64] #1100 zot.git 2.0.1-alt1: build OK
2024-Feb-14 14:11:05 :: [armh] #1100 zot.git 2.0.1-alt1: build OK
2024-Feb-14 14:11:17 :: #1100: zot.git 2.0.1-alt1: build check OK
2024-Feb-14 14:11:18 :: build check OK
2024-Feb-14 14:11:33 :: noarch check OK
2024-Feb-14 14:11:35 :: plan: src +1 -0 =19020, aarch64 +1 -0 =31956, armh +1 -0 =29779, i586 +1 -0 =31563, ppc64le +1 -0 =31049, x86_64 +1 -0 =32860
2024-Feb-14 14:12:20 :: patched apt indices
2024-Feb-14 14:12:32 :: created next repo
2024-Feb-14 14:12:41 :: duplicate provides check OK
2024-Feb-14 14:13:18 :: dependencies check OK
nm: /tmp/AlPoHIFu7L/7ZtPZFoXR2: no symbols
nm: /tmp/b7GXpMlh8j/XDTbhQe4Av: no symbols
nm: /tmp/AlPoHIFu7L/qFouIFFaxY: no symbols
nm: /tmp/vPZFwBoUnB/Xv0D6W0Vwo: no symbols
nm: /tmp/b7GXpMlh8j/ZIQqbOAR7i: no symbols
nm: /tmp/vPZFwBoUnB/g1umSIoznO: no symbols
nm: /tmp/b7GXpMlh8j/sFbe5XyDL2: no symbols
nm: /tmp/AlPoHIFu7L/ggOdQN7fta: no symbols
nm: /tmp/vPZFwBoUnB/5e0pn_TbOM: no symbols
2024-Feb-14 14:13:39 :: [x86_64 i586 aarch64 ppc64le armh] ELF symbols check OK
2024-Feb-14 14:13:53 :: [i586] #1100 zot: install check OK
2024-Feb-14 14:13:53 :: [x86_64] #1100 zot: install check OK
2024-Feb-14 14:14:05 :: [ppc64le] #1100 zot: install check OK
2024-Feb-14 14:14:08 :: [aarch64] #1100 zot: install check OK
2024-Feb-14 14:14:14 :: [armh] #1100 zot: install check OK
2024-Feb-14 14:14:31 :: [x86_64-i586] generated apt indices
2024-Feb-14 14:14:31 :: [x86_64-i586] created next repo
2024-Feb-14 14:14:42 :: [x86_64-i586] dependencies check OK
2024-Feb-14 14:14:43 :: gears inheritance check OK
2024-Feb-14 14:14:43 :: srpm inheritance check OK
girar-check-perms: access to zot ALLOWED for geochip: project `zot' is not listed in the acl file for repository `sisyphus', and the policy for such projects in `sisyphus' is to allow
check-subtask-perms: #1100: zot: allowed for geochip
2024-Feb-14 14:14:44 :: acl check OK
2024-Feb-14 14:15:02 :: created contents_index files
2024-Feb-14 14:15:14 :: created hash files: aarch64 armh i586 ppc64le src x86_64
2024-Feb-14 14:15:17 :: task #340501 for sisyphus TESTED


^ permalink raw reply	[flat|nested] 13+ messages in thread

* [#340501] TESTED (try 8) zot.git=2.0.1-alt1
  2024-02-12 14:14 [#340501] [test-only] FAILED zot.git=2.0.1-alt1 Girar awaiter (geochip)
                   ` (5 preceding siblings ...)
  2024-02-14 14:15 ` [#340501] TESTED (try 7) zot.git=2.0.1-alt1 Girar awaiter (geochip)
@ 2024-02-14 16:41 ` Girar awaiter (geochip)
  2024-02-14 19:08 ` [#340501] TESTED (try 9) zot.git=2.0.1-alt1 Girar awaiter (geochip)
                   ` (4 subsequent siblings)
  11 siblings, 0 replies; 13+ messages in thread
From: Girar awaiter (geochip) @ 2024-02-14 16:41 UTC (permalink / raw)
  To: Alexander Stepchenko; +Cc: sisyphus-incominger, girar-builder-sisyphus

https://git.altlinux.org/tasks/340501/logs/events.8.1.log

subtask  name  aarch64   armh  i586  ppc64le  x86_64
  #1200  zot      5:16  10:17  3:07     6:13    2:29

2024-Feb-14 16:26:57 :: test-only task #340501 for sisyphus resumed by geochip:
#100 removed
#200 removed
#300 removed
#400 removed
#500 removed
#600 removed
#700 removed
#1000 removed
#1100 removed
#1200 build 2.0.1-alt1 from /people/geochip/packages/zot.git fetched at 2024-Feb-14 16:26:17
2024-Feb-14 16:26:58 :: [x86_64] #1200 zot.git 2.0.1-alt1: build start
2024-Feb-14 16:26:58 :: [ppc64le] #1200 zot.git 2.0.1-alt1: build start
2024-Feb-14 16:26:58 :: [i586] #1200 zot.git 2.0.1-alt1: build start
2024-Feb-14 16:26:58 :: [aarch64] #1200 zot.git 2.0.1-alt1: build start
2024-Feb-14 16:26:58 :: [armh] #1200 zot.git 2.0.1-alt1: build start
2024-Feb-14 16:29:27 :: [x86_64] #1200 zot.git 2.0.1-alt1: build OK
2024-Feb-14 16:30:05 :: [i586] #1200 zot.git 2.0.1-alt1: build OK
2024-Feb-14 16:32:14 :: [aarch64] #1200 zot.git 2.0.1-alt1: build OK
2024-Feb-14 16:33:11 :: [ppc64le] #1200 zot.git 2.0.1-alt1: build OK
2024-Feb-14 16:37:15 :: [armh] #1200 zot.git 2.0.1-alt1: build OK
2024-Feb-14 16:37:27 :: #1200: zot.git 2.0.1-alt1: build check OK
2024-Feb-14 16:37:28 :: build check OK
2024-Feb-14 16:37:43 :: noarch check OK
2024-Feb-14 16:37:45 :: plan: src +1 -0 =19021, aarch64 +1 -0 =31957, armh +1 -0 =29780, i586 +1 -0 =31564, ppc64le +1 -0 =31050, x86_64 +1 -0 =32861
2024-Feb-14 16:38:28 :: patched apt indices
2024-Feb-14 16:38:40 :: created next repo
2024-Feb-14 16:38:50 :: duplicate provides check OK
2024-Feb-14 16:39:26 :: dependencies check OK
nm: /tmp/qo49ErEB8D/6GnkfebE_W: no symbols
nm: /tmp/qo49ErEB8D/KgtBVd5SiK: no symbols
nm: /tmp/YRMZmTSISz/I0mze0HbkQ: no symbols
nm: /tmp/pkNYLUwILG/Ntjqj1xgSa: no symbols
nm: /tmp/YRMZmTSISz/kXGdO1M4yD: no symbols
nm: /tmp/pkNYLUwILG/OD4Y9f4LTa: no symbols
nm: /tmp/YRMZmTSISz/DqsIuaVzum: no symbols
nm: /tmp/qo49ErEB8D/VuE12w2hfB: no symbols
nm: /tmp/pkNYLUwILG/IbDhefZ0Uj: no symbols
2024-Feb-14 16:39:47 :: [x86_64 i586 aarch64 ppc64le armh] ELF symbols check OK
	x86_64: zot=2.0.1-alt1 post-install unowned files:
 /usr/share/bash-completion
 /usr/share/bash-completion/completions
 /usr/share/fish
 /usr/share/fish/vendor_completions.d
 /usr/share/zsh
 /usr/share/zsh/site-functions
2024-Feb-14 16:40:01 :: [x86_64] #1200 zot: install check OK
	i586: zot=2.0.1-alt1 post-install unowned files:
 /usr/share/bash-completion
 /usr/share/bash-completion/completions
 /usr/share/fish
 /usr/share/fish/vendor_completions.d
 /usr/share/zsh
 /usr/share/zsh/site-functions
2024-Feb-14 16:40:01 :: [i586] #1200 zot: install check OK
	aarch64: zot=2.0.1-alt1 post-install unowned files:
 /usr/share/bash-completion
 /usr/share/bash-completion/completions
 /usr/share/fish
 /usr/share/fish/vendor_completions.d
 /usr/share/zsh
 /usr/share/zsh/site-functions
2024-Feb-14 16:40:12 :: [aarch64] #1200 zot: install check OK
	ppc64le: zot=2.0.1-alt1 post-install unowned files:
 /usr/share/bash-completion
 /usr/share/bash-completion/completions
 /usr/share/fish
 /usr/share/fish/vendor_completions.d
 /usr/share/zsh
 /usr/share/zsh/site-functions
2024-Feb-14 16:40:13 :: [ppc64le] #1200 zot: install check OK
	armh: zot=2.0.1-alt1 post-install unowned files:
 /usr/share/bash-completion
 /usr/share/bash-completion/completions
 /usr/share/fish
 /usr/share/fish/vendor_completions.d
 /usr/share/zsh
 /usr/share/zsh/site-functions
2024-Feb-14 16:40:27 :: [armh] #1200 zot: install check OK
2024-Feb-14 16:40:44 :: [x86_64-i586] generated apt indices
2024-Feb-14 16:40:44 :: [x86_64-i586] created next repo
2024-Feb-14 16:40:53 :: [x86_64-i586] dependencies check OK
2024-Feb-14 16:40:54 :: gears inheritance check OK
2024-Feb-14 16:40:54 :: srpm inheritance check OK
girar-check-perms: access to zot ALLOWED for geochip: project `zot' is not listed in the acl file for repository `sisyphus', and the policy for such projects in `sisyphus' is to allow
check-subtask-perms: #1200: zot: allowed for geochip
2024-Feb-14 16:40:55 :: acl check OK
2024-Feb-14 16:41:07 :: created contents_index files
2024-Feb-14 16:41:16 :: created hash files: aarch64 armh i586 ppc64le src x86_64
2024-Feb-14 16:41:19 :: task #340501 for sisyphus TESTED


^ permalink raw reply	[flat|nested] 13+ messages in thread

* [#340501] TESTED (try 9) zot.git=2.0.1-alt1
  2024-02-12 14:14 [#340501] [test-only] FAILED zot.git=2.0.1-alt1 Girar awaiter (geochip)
                   ` (6 preceding siblings ...)
  2024-02-14 16:41 ` [#340501] TESTED (try 8) zot.git=2.0.1-alt1 Girar awaiter (geochip)
@ 2024-02-14 19:08 ` Girar awaiter (geochip)
  2024-02-16 12:57 ` [#340501] TESTED (try 10) zot.git=2.0.1-alt1 Girar awaiter (geochip)
                   ` (3 subsequent siblings)
  11 siblings, 0 replies; 13+ messages in thread
From: Girar awaiter (geochip) @ 2024-02-14 19:08 UTC (permalink / raw)
  To: Alexander Stepchenko; +Cc: sisyphus-incominger, girar-builder-sisyphus

https://git.altlinux.org/tasks/340501/logs/events.9.1.log

subtask  name  aarch64  armh  i586  ppc64le  x86_64
  #1300  zot      4:55  8:33  3:11     6:12    2:30

2024-Feb-14 18:56:00 :: test-only task #340501 for sisyphus resumed by geochip:
#100 removed
#200 removed
#300 removed
#400 removed
#500 removed
#600 removed
#700 removed
#1000 removed
#1100 removed
#1200 removed
#1300 build 2.0.1-alt1 from /people/geochip/packages/zot.git fetched at 2024-Feb-14 18:51:45
2024-Feb-14 18:56:02 :: [x86_64] #1300 zot.git 2.0.1-alt1: build start
2024-Feb-14 18:56:02 :: [i586] #1300 zot.git 2.0.1-alt1: build start
2024-Feb-14 18:56:02 :: [armh] #1300 zot.git 2.0.1-alt1: build start
2024-Feb-14 18:56:02 :: [aarch64] #1300 zot.git 2.0.1-alt1: build start
2024-Feb-14 18:56:02 :: [ppc64le] #1300 zot.git 2.0.1-alt1: build start
2024-Feb-14 18:58:32 :: [x86_64] #1300 zot.git 2.0.1-alt1: build OK
2024-Feb-14 18:59:13 :: [i586] #1300 zot.git 2.0.1-alt1: build OK
2024-Feb-14 19:00:57 :: [aarch64] #1300 zot.git 2.0.1-alt1: build OK
2024-Feb-14 19:02:14 :: [ppc64le] #1300 zot.git 2.0.1-alt1: build OK
2024-Feb-14 19:04:35 :: [armh] #1300 zot.git 2.0.1-alt1: build OK
2024-Feb-14 19:04:47 :: #1300: zot.git 2.0.1-alt1: build check OK
2024-Feb-14 19:04:48 :: build check OK
2024-Feb-14 19:05:04 :: noarch check OK
2024-Feb-14 19:05:06 :: plan: src +1 -0 =19021, aarch64 +1 -0 =31957, armh +1 -0 =29780, i586 +1 -0 =31564, ppc64le +1 -0 =31050, x86_64 +1 -0 =32861
2024-Feb-14 19:05:51 :: patched apt indices
2024-Feb-14 19:06:04 :: created next repo
2024-Feb-14 19:06:13 :: duplicate provides check OK
2024-Feb-14 19:06:51 :: dependencies check OK
nm: /tmp/z79e2hS077/NNuhxCGxCa: no symbols
nm: /tmp/hKsfjz4H1w/QbdcOeKRWq: no symbols
nm: /tmp/z79e2hS077/Gg9til_ULq: no symbols
nm: /tmp/BCOW44B3Fq/0dYV5fBsSQ: no symbols
nm: /tmp/hKsfjz4H1w/wj500QQoC1: no symbols
nm: /tmp/BCOW44B3Fq/6IL7oHH4N4: no symbols
nm: /tmp/hKsfjz4H1w/ZkPB5ypLZJ: no symbols
nm: /tmp/z79e2hS077/YxTAdgThZA: no symbols
nm: /tmp/BCOW44B3Fq/5dUhNqd5r0: no symbols
2024-Feb-14 19:07:14 :: [x86_64 i586 aarch64 ppc64le armh] ELF symbols check OK
	x86_64: zot=2.0.1-alt1 post-install unowned files:
 /usr/share/bash-completion
 /usr/share/bash-completion/completions
 /usr/share/fish
 /usr/share/fish/vendor_completions.d
 /usr/share/zsh
 /usr/share/zsh/site-functions
	i586: zot=2.0.1-alt1 post-install unowned files:
 /usr/share/bash-completion
 /usr/share/bash-completion/completions
 /usr/share/fish
 /usr/share/fish/vendor_completions.d
 /usr/share/zsh
 /usr/share/zsh/site-functions
2024-Feb-14 19:07:28 :: [x86_64] #1300 zot: install check OK
2024-Feb-14 19:07:28 :: [i586] #1300 zot: install check OK
	aarch64: zot=2.0.1-alt1 post-install unowned files:
 /usr/share/bash-completion
 /usr/share/bash-completion/completions
 /usr/share/fish
 /usr/share/fish/vendor_completions.d
 /usr/share/zsh
 /usr/share/zsh/site-functions
2024-Feb-14 19:07:38 :: [aarch64] #1300 zot: install check OK
	ppc64le: zot=2.0.1-alt1 post-install unowned files:
 /usr/share/bash-completion
 /usr/share/bash-completion/completions
 /usr/share/fish
 /usr/share/fish/vendor_completions.d
 /usr/share/zsh
 /usr/share/zsh/site-functions
2024-Feb-14 19:07:40 :: [ppc64le] #1300 zot: install check OK
	armh: zot=2.0.1-alt1 post-install unowned files:
 /usr/share/bash-completion
 /usr/share/bash-completion/completions
 /usr/share/fish
 /usr/share/fish/vendor_completions.d
 /usr/share/zsh
 /usr/share/zsh/site-functions
2024-Feb-14 19:07:49 :: [armh] #1300 zot: install check OK
2024-Feb-14 19:08:06 :: [x86_64-i586] generated apt indices
2024-Feb-14 19:08:06 :: [x86_64-i586] created next repo
2024-Feb-14 19:08:17 :: [x86_64-i586] dependencies check OK
2024-Feb-14 19:08:18 :: gears inheritance check OK
2024-Feb-14 19:08:18 :: srpm inheritance check OK
girar-check-perms: access to zot ALLOWED for geochip: project `zot' is not listed in the acl file for repository `sisyphus', and the policy for such projects in `sisyphus' is to allow
check-subtask-perms: #1300: zot: allowed for geochip
2024-Feb-14 19:08:18 :: acl check OK
2024-Feb-14 19:08:31 :: created contents_index files
2024-Feb-14 19:08:41 :: created hash files: aarch64 armh i586 ppc64le src x86_64
2024-Feb-14 19:08:44 :: task #340501 for sisyphus TESTED


^ permalink raw reply	[flat|nested] 13+ messages in thread

* [#340501] TESTED (try 10) zot.git=2.0.1-alt1
  2024-02-12 14:14 [#340501] [test-only] FAILED zot.git=2.0.1-alt1 Girar awaiter (geochip)
                   ` (7 preceding siblings ...)
  2024-02-14 19:08 ` [#340501] TESTED (try 9) zot.git=2.0.1-alt1 Girar awaiter (geochip)
@ 2024-02-16 12:57 ` Girar awaiter (geochip)
  2024-02-19  9:18 ` [#340501] TESTED (try 11) zot.git=2.0.1-alt1 Girar awaiter (geochip)
                   ` (2 subsequent siblings)
  11 siblings, 0 replies; 13+ messages in thread
From: Girar awaiter (geochip) @ 2024-02-16 12:57 UTC (permalink / raw)
  To: Alexander Stepchenko; +Cc: sisyphus-incominger, girar-builder-sisyphus

https://git.altlinux.org/tasks/340501/logs/events.10.1.log

subtask  name  aarch64  armh  i586  ppc64le  x86_64
  #1400  zot      5:00  8:47  3:08     6:20    2:29

2024-Feb-16 12:44:38 :: test-only task #340501 for sisyphus resumed by geochip:
#100 removed
#200 removed
#300 removed
#400 removed
#500 removed
#600 removed
#700 removed
#1000 removed
#1100 removed
#1200 removed
#1300 removed
#1400 build 2.0.1-alt1 from /people/geochip/packages/zot.git fetched at 2024-Feb-16 12:43:33
2024-Feb-16 12:44:39 :: [ppc64le] #1400 zot.git 2.0.1-alt1: build start
2024-Feb-16 12:44:39 :: [x86_64] #1400 zot.git 2.0.1-alt1: build start
2024-Feb-16 12:44:39 :: [armh] #1400 zot.git 2.0.1-alt1: build start
2024-Feb-16 12:44:39 :: [aarch64] #1400 zot.git 2.0.1-alt1: build start
2024-Feb-16 12:44:39 :: [i586] #1400 zot.git 2.0.1-alt1: build start
2024-Feb-16 12:47:08 :: [x86_64] #1400 zot.git 2.0.1-alt1: build OK
2024-Feb-16 12:47:47 :: [i586] #1400 zot.git 2.0.1-alt1: build OK
2024-Feb-16 12:49:39 :: [aarch64] #1400 zot.git 2.0.1-alt1: build OK
2024-Feb-16 12:50:59 :: [ppc64le] #1400 zot.git 2.0.1-alt1: build OK
2024-Feb-16 12:53:26 :: [armh] #1400 zot.git 2.0.1-alt1: build OK
2024-Feb-16 12:53:38 :: #1400: zot.git 2.0.1-alt1: build check OK
2024-Feb-16 12:53:39 :: build check OK
2024-Feb-16 12:53:54 :: noarch check OK
2024-Feb-16 12:53:56 :: plan: src +1 -0 =19021, aarch64 +1 -0 =31957, armh +1 -0 =29780, i586 +1 -0 =31564, ppc64le +1 -0 =31050, x86_64 +1 -0 =32861
2024-Feb-16 12:54:41 :: patched apt indices
2024-Feb-16 12:54:55 :: created next repo
2024-Feb-16 12:55:05 :: duplicate provides check OK
2024-Feb-16 12:55:43 :: dependencies check OK
nm: /tmp/Hzz8ClPp7C/73YXbKq5MI: no symbols
nm: /tmp/Hzz8ClPp7C/DN2RGIseHT: no symbols
nm: /tmp/zWQsP7lkze/fE8_57jbZV: no symbols
nm: /tmp/e7naTDgtQO/1ZfILJezBm: no symbols
nm: /tmp/zWQsP7lkze/JmENrB3nGA: no symbols
nm: /tmp/e7naTDgtQO/mhwdFTirLo: no symbols
nm: /tmp/Hzz8ClPp7C/_R0J8Tq2v_: no symbols
nm: /tmp/zWQsP7lkze/qyYi7U4Fgg: no symbols
nm: /tmp/e7naTDgtQO/3L3AncJttc: no symbols
2024-Feb-16 12:56:05 :: [x86_64 i586 aarch64 ppc64le armh] ELF symbols check OK
	i586: zot=2.0.1-alt1 post-install unowned files:
 /usr/share/bash-completion
 /usr/share/bash-completion/completions
 /usr/share/fish
 /usr/share/fish/vendor_completions.d
 /usr/share/zsh
 /usr/share/zsh/site-functions
	x86_64: zot=2.0.1-alt1 post-install unowned files:
 /usr/share/bash-completion
 /usr/share/bash-completion/completions
 /usr/share/fish
 /usr/share/fish/vendor_completions.d
 /usr/share/zsh
 /usr/share/zsh/site-functions
2024-Feb-16 12:56:19 :: [i586] #1400 zot: install check OK
2024-Feb-16 12:56:19 :: [x86_64] #1400 zot: install check OK
	aarch64: zot=2.0.1-alt1 post-install unowned files:
 /usr/share/bash-completion
 /usr/share/bash-completion/completions
 /usr/share/fish
 /usr/share/fish/vendor_completions.d
 /usr/share/zsh
 /usr/share/zsh/site-functions
2024-Feb-16 12:56:29 :: [aarch64] #1400 zot: install check OK
	ppc64le: zot=2.0.1-alt1 post-install unowned files:
 /usr/share/bash-completion
 /usr/share/bash-completion/completions
 /usr/share/fish
 /usr/share/fish/vendor_completions.d
 /usr/share/zsh
 /usr/share/zsh/site-functions
2024-Feb-16 12:56:32 :: [ppc64le] #1400 zot: install check OK
	armh: zot=2.0.1-alt1 post-install unowned files:
 /usr/share/bash-completion
 /usr/share/bash-completion/completions
 /usr/share/fish
 /usr/share/fish/vendor_completions.d
 /usr/share/zsh
 /usr/share/zsh/site-functions
2024-Feb-16 12:56:40 :: [armh] #1400 zot: install check OK
2024-Feb-16 12:56:57 :: [x86_64-i586] generated apt indices
2024-Feb-16 12:56:57 :: [x86_64-i586] created next repo
2024-Feb-16 12:57:07 :: [x86_64-i586] dependencies check OK
2024-Feb-16 12:57:08 :: gears inheritance check OK
2024-Feb-16 12:57:08 :: srpm inheritance check OK
girar-check-perms: access to zot ALLOWED for geochip: project `zot' is not listed in the acl file for repository `sisyphus', and the policy for such projects in `sisyphus' is to allow
check-subtask-perms: #1400: zot: allowed for geochip
2024-Feb-16 12:57:09 :: acl check OK
2024-Feb-16 12:57:20 :: created contents_index files
2024-Feb-16 12:57:30 :: created hash files: aarch64 armh i586 ppc64le src x86_64
2024-Feb-16 12:57:33 :: task #340501 for sisyphus TESTED


^ permalink raw reply	[flat|nested] 13+ messages in thread

* [#340501] TESTED (try 11) zot.git=2.0.1-alt1
  2024-02-12 14:14 [#340501] [test-only] FAILED zot.git=2.0.1-alt1 Girar awaiter (geochip)
                   ` (8 preceding siblings ...)
  2024-02-16 12:57 ` [#340501] TESTED (try 10) zot.git=2.0.1-alt1 Girar awaiter (geochip)
@ 2024-02-19  9:18 ` Girar awaiter (geochip)
  2024-02-19 12:44 ` [#340501] TESTED (try 12) zot.git=2.0.1-alt1 Girar awaiter (geochip)
  2024-02-20 12:09 ` [#340501] FAILED (try 13) zot.git=2.0.1-alt1 Girar awaiter (geochip)
  11 siblings, 0 replies; 13+ messages in thread
From: Girar awaiter (geochip) @ 2024-02-19  9:18 UTC (permalink / raw)
  To: Alexander Stepchenko; +Cc: sisyphus-incominger, girar-builder-sisyphus

https://git.altlinux.org/tasks/340501/logs/events.11.1.log

subtask  name  aarch64   armh  i586  ppc64le  x86_64
  #1500  zot      5:21  14:19  3:08     6:27    2:32

2024-Feb-19 08:58:41 :: test-only task #340501 for sisyphus resumed by geochip:
#100 removed
#200 removed
#300 removed
#400 removed
#500 removed
#600 removed
#700 removed
#1000 removed
#1100 removed
#1200 removed
#1300 removed
#1400 removed
#1500 build 2.0.1-alt1 from /people/geochip/packages/zot.git fetched at 2024-Feb-19 08:58:10
2024-Feb-19 08:58:42 :: [armh] #1500 zot.git 2.0.1-alt1: build start
2024-Feb-19 08:58:42 :: [x86_64] #1500 zot.git 2.0.1-alt1: build start
2024-Feb-19 08:58:42 :: [aarch64] #1500 zot.git 2.0.1-alt1: build start
2024-Feb-19 08:58:42 :: [ppc64le] #1500 zot.git 2.0.1-alt1: build start
2024-Feb-19 08:58:42 :: [i586] #1500 zot.git 2.0.1-alt1: build start
2024-Feb-19 09:01:14 :: [x86_64] #1500 zot.git 2.0.1-alt1: build OK
2024-Feb-19 09:01:50 :: [i586] #1500 zot.git 2.0.1-alt1: build OK
2024-Feb-19 09:04:03 :: [aarch64] #1500 zot.git 2.0.1-alt1: build OK
2024-Feb-19 09:05:09 :: [ppc64le] #1500 zot.git 2.0.1-alt1: build OK
2024-Feb-19 09:13:01 :: [armh] #1500 zot.git 2.0.1-alt1: build OK
2024-Feb-19 09:13:15 :: #1500: zot.git 2.0.1-alt1: build check OK
2024-Feb-19 09:13:18 :: build check OK
2024-Feb-19 09:13:49 :: noarch check OK
2024-Feb-19 09:13:52 :: plan: src +1 -0 =19022, aarch64 +1 -0 =31966, armh +1 -0 =29789, i586 +1 -0 =31575, ppc64le +1 -0 =31059, x86_64 +1 -0 =32874
2024-Feb-19 09:15:02 :: patched apt indices
2024-Feb-19 09:15:18 :: created next repo
2024-Feb-19 09:15:29 :: duplicate provides check OK
2024-Feb-19 09:16:10 :: dependencies check OK
nm: /tmp/4VEnREg9rV/c3nTjsM8UH: no symbols
nm: /tmp/4VEnREg9rV/X2oZRvi5dw: no symbols
nm: /tmp/teP8S7dQek/R6yR7mhDuv: no symbols
nm: /tmp/pNzePWFRcQ/x557juQjpf: no symbols
nm: /tmp/teP8S7dQek/4dmp3JPU7v: no symbols
nm: /tmp/pNzePWFRcQ/5_sjmwtncw: no symbols
nm: /tmp/4VEnREg9rV/GZ5XkE8qk7: no symbols
nm: /tmp/teP8S7dQek/pvjZeQ9SCl: no symbols
nm: /tmp/pNzePWFRcQ/DdKZdMwrAU: no symbols
2024-Feb-19 09:16:33 :: [x86_64 i586 aarch64 ppc64le armh] ELF symbols check OK
	i586: zot=2.0.1-alt1 post-install unowned files:
 /usr/share/bash-completion
 /usr/share/bash-completion/completions
 /usr/share/fish
 /usr/share/fish/vendor_completions.d
 /usr/share/zsh
 /usr/share/zsh/site-functions
	x86_64: zot=2.0.1-alt1 post-install unowned files:
 /usr/share/bash-completion
 /usr/share/bash-completion/completions
 /usr/share/fish
 /usr/share/fish/vendor_completions.d
 /usr/share/zsh
 /usr/share/zsh/site-functions
2024-Feb-19 09:16:47 :: [i586] #1500 zot: install check OK
2024-Feb-19 09:16:47 :: [x86_64] #1500 zot: install check OK
	aarch64: zot=2.0.1-alt1 post-install unowned files:
 /usr/share/bash-completion
 /usr/share/bash-completion/completions
 /usr/share/fish
 /usr/share/fish/vendor_completions.d
 /usr/share/zsh
 /usr/share/zsh/site-functions
2024-Feb-19 09:16:56 :: [aarch64] #1500 zot: install check OK
	ppc64le: zot=2.0.1-alt1 post-install unowned files:
 /usr/share/bash-completion
 /usr/share/bash-completion/completions
 /usr/share/fish
 /usr/share/fish/vendor_completions.d
 /usr/share/zsh
 /usr/share/zsh/site-functions
2024-Feb-19 09:16:59 :: [ppc64le] #1500 zot: install check OK
	armh: zot=2.0.1-alt1 post-install unowned files:
 /usr/share/bash-completion
 /usr/share/bash-completion/completions
 /usr/share/fish
 /usr/share/fish/vendor_completions.d
 /usr/share/zsh
 /usr/share/zsh/site-functions
2024-Feb-19 09:17:27 :: [armh] #1500 zot: install check OK
2024-Feb-19 09:17:47 :: [x86_64-i586] generated apt indices
2024-Feb-19 09:17:47 :: [x86_64-i586] created next repo
2024-Feb-19 09:17:59 :: [x86_64-i586] dependencies check OK
2024-Feb-19 09:18:04 :: gears inheritance check OK
2024-Feb-19 09:18:04 :: srpm inheritance check OK
girar-check-perms: access to zot ALLOWED for geochip: project `zot' is not listed in the acl file for repository `sisyphus', and the policy for such projects in `sisyphus' is to allow
check-subtask-perms: #1500: zot: allowed for geochip
2024-Feb-19 09:18:05 :: acl check OK
2024-Feb-19 09:18:19 :: created contents_index files
2024-Feb-19 09:18:29 :: created hash files: aarch64 armh i586 ppc64le src x86_64
2024-Feb-19 09:18:32 :: task #340501 for sisyphus TESTED


^ permalink raw reply	[flat|nested] 13+ messages in thread

* [#340501] TESTED (try 12) zot.git=2.0.1-alt1
  2024-02-12 14:14 [#340501] [test-only] FAILED zot.git=2.0.1-alt1 Girar awaiter (geochip)
                   ` (9 preceding siblings ...)
  2024-02-19  9:18 ` [#340501] TESTED (try 11) zot.git=2.0.1-alt1 Girar awaiter (geochip)
@ 2024-02-19 12:44 ` Girar awaiter (geochip)
  2024-02-20 12:09 ` [#340501] FAILED (try 13) zot.git=2.0.1-alt1 Girar awaiter (geochip)
  11 siblings, 0 replies; 13+ messages in thread
From: Girar awaiter (geochip) @ 2024-02-19 12:44 UTC (permalink / raw)
  To: Alexander Stepchenko; +Cc: sisyphus-incominger, girar-builder-sisyphus

https://git.altlinux.org/tasks/340501/logs/events.12.1.log

subtask  name  aarch64   armh  i586  ppc64le  x86_64
  #1600  zot      6:10  10:10  3:48     7:33    3:17

2024-Feb-19 12:28:53 :: test-only task #340501 for sisyphus resumed by geochip:
#100 removed
#200 removed
#300 removed
#400 removed
#500 removed
#600 removed
#700 removed
#1000 removed
#1100 removed
#1200 removed
#1300 removed
#1400 removed
#1500 removed
#1600 build 2.0.1-alt1 from /people/geochip/packages/zot.git fetched at 2024-Feb-19 12:28:24
2024-Feb-19 12:28:56 :: [ppc64le] #1600 zot.git 2.0.1-alt1: build start
2024-Feb-19 12:28:56 :: [aarch64] #1600 zot.git 2.0.1-alt1: build start
2024-Feb-19 12:28:56 :: [armh] #1600 zot.git 2.0.1-alt1: build start
2024-Feb-19 12:28:56 :: [x86_64] #1600 zot.git 2.0.1-alt1: build start
2024-Feb-19 12:28:56 :: [i586] #1600 zot.git 2.0.1-alt1: build start
2024-Feb-19 12:32:13 :: [x86_64] #1600 zot.git 2.0.1-alt1: build OK
2024-Feb-19 12:32:44 :: [i586] #1600 zot.git 2.0.1-alt1: build OK
2024-Feb-19 12:35:06 :: [aarch64] #1600 zot.git 2.0.1-alt1: build OK
2024-Feb-19 12:36:29 :: [ppc64le] #1600 zot.git 2.0.1-alt1: build OK
2024-Feb-19 12:39:06 :: [armh] #1600 zot.git 2.0.1-alt1: build OK
2024-Feb-19 12:39:24 :: #1600: zot.git 2.0.1-alt1: build check OK
2024-Feb-19 12:39:25 :: build check OK
2024-Feb-19 12:40:06 :: noarch check OK
2024-Feb-19 12:40:09 :: plan: src +1 -0 =19022, aarch64 +2 -0 =31967, armh +2 -0 =29790, i586 +2 -0 =31576, ppc64le +2 -0 =31060, x86_64 +2 -0 =32875
2024-Feb-19 12:41:09 :: patched apt indices
2024-Feb-19 12:41:26 :: created next repo
2024-Feb-19 12:41:37 :: duplicate provides check OK
2024-Feb-19 12:42:18 :: dependencies check OK
nm: /tmp/PjjNlbxnMp/n5QVBhaiAl: no symbols
nm: /tmp/PdHUjyOkHo/5xyk84_2EB: no symbols
nm: /tmp/PjjNlbxnMp/tM4r_3fmbC: no symbols
nm: /tmp/XKju8PjEei/LTWX4mVlG_: no symbols
nm: /tmp/PdHUjyOkHo/aCa1IvXexe: no symbols
nm: /tmp/XKju8PjEei/cr4daz9Kxo: no symbols
nm: /tmp/PdHUjyOkHo/Yn3db3umlQ: no symbols
nm: /tmp/PjjNlbxnMp/4LoGowCJbt: no symbols
nm: /tmp/XKju8PjEei/e5bSbpAC9F: no symbols
2024-Feb-19 12:42:44 :: [x86_64 i586 aarch64 ppc64le armh] ELF symbols check OK
	i586: zot=2.0.1-alt1 post-install unowned files:
 /usr/share/bash-completion
 /usr/share/bash-completion/completions
 /usr/share/fish
 /usr/share/fish/vendor_completions.d
 /usr/share/zsh
 /usr/share/zsh/site-functions
	x86_64: zot=2.0.1-alt1 post-install unowned files:
 /usr/share/bash-completion
 /usr/share/bash-completion/completions
 /usr/share/fish
 /usr/share/fish/vendor_completions.d
 /usr/share/zsh
 /usr/share/zsh/site-functions
2024-Feb-19 12:42:59 :: [i586] #1600 zot: install check OK
2024-Feb-19 12:42:59 :: [x86_64] #1600 zot: install check OK
	aarch64: zot=2.0.1-alt1 post-install unowned files:
 /usr/share/bash-completion
 /usr/share/bash-completion/completions
 /usr/share/fish
 /usr/share/fish/vendor_completions.d
 /usr/share/zsh
 /usr/share/zsh/site-functions
2024-Feb-19 12:43:09 :: [x86_64] #1600 zot-debuginfo: install check OK
2024-Feb-19 12:43:09 :: [aarch64] #1600 zot: install check OK
2024-Feb-19 12:43:09 :: [i586] #1600 zot-debuginfo: install check OK
	ppc64le: zot=2.0.1-alt1 post-install unowned files:
 /usr/share/bash-completion
 /usr/share/bash-completion/completions
 /usr/share/fish
 /usr/share/fish/vendor_completions.d
 /usr/share/zsh
 /usr/share/zsh/site-functions
2024-Feb-19 12:43:11 :: [ppc64le] #1600 zot: install check OK
	armh: zot=2.0.1-alt1 post-install unowned files:
 /usr/share/bash-completion
 /usr/share/bash-completion/completions
 /usr/share/fish
 /usr/share/fish/vendor_completions.d
 /usr/share/zsh
 /usr/share/zsh/site-functions
2024-Feb-19 12:43:19 :: [armh] #1600 zot: install check OK
2024-Feb-19 12:43:26 :: [aarch64] #1600 zot-debuginfo: install check OK
2024-Feb-19 12:43:31 :: [ppc64le] #1600 zot-debuginfo: install check OK
2024-Feb-19 12:43:45 :: [armh] #1600 zot-debuginfo: install check OK
2024-Feb-19 12:44:06 :: [x86_64-i586] generated apt indices
2024-Feb-19 12:44:06 :: [x86_64-i586] created next repo
2024-Feb-19 12:44:16 :: [x86_64-i586] dependencies check OK
2024-Feb-19 12:44:17 :: gears inheritance check OK
2024-Feb-19 12:44:17 :: srpm inheritance check OK
girar-check-perms: access to zot ALLOWED for geochip: project `zot' is not listed in the acl file for repository `sisyphus', and the policy for such projects in `sisyphus' is to allow
check-subtask-perms: #1600: zot: allowed for geochip
2024-Feb-19 12:44:18 :: acl check OK
2024-Feb-19 12:44:31 :: created contents_index files
2024-Feb-19 12:44:42 :: created hash files: aarch64 armh i586 ppc64le src x86_64
2024-Feb-19 12:44:45 :: task #340501 for sisyphus TESTED


^ permalink raw reply	[flat|nested] 13+ messages in thread

* [#340501] FAILED (try 13) zot.git=2.0.1-alt1
  2024-02-12 14:14 [#340501] [test-only] FAILED zot.git=2.0.1-alt1 Girar awaiter (geochip)
                   ` (10 preceding siblings ...)
  2024-02-19 12:44 ` [#340501] TESTED (try 12) zot.git=2.0.1-alt1 Girar awaiter (geochip)
@ 2024-02-20 12:09 ` Girar awaiter (geochip)
  11 siblings, 0 replies; 13+ messages in thread
From: Girar awaiter (geochip) @ 2024-02-20 12:09 UTC (permalink / raw)
  To: Alexander Stepchenko; +Cc: sisyphus-incominger, girar-builder-sisyphus

https://git.altlinux.org/tasks/340501/logs/events.13.1.log

subtask  name  aarch64    armh    i586  ppc64le  x86_64
  #1600  zot      6:09  failed  failed     7:41    3:20

2024-Feb-20 12:01:35 :: task #340501 for sisyphus resumed by geochip:
#100 removed
#200 removed
#300 removed
#400 removed
#500 removed
#600 removed
#700 removed
#1000 removed
#1100 removed
#1200 removed
#1300 removed
#1400 removed
#1500 removed
#1600 build 2.0.1-alt1 from /people/geochip/packages/zot.git fetched at 2024-Feb-19 12:28:24
2024-Feb-20 12:01:38 :: [aarch64] #1600 zot.git 2.0.1-alt1: build start
2024-Feb-20 12:01:38 :: [ppc64le] #1600 zot.git 2.0.1-alt1: build start
2024-Feb-20 12:01:38 :: [x86_64] #1600 zot.git 2.0.1-alt1: build start
2024-Feb-20 12:01:38 :: [armh] #1600 zot.git 2.0.1-alt1: build start
2024-Feb-20 12:01:38 :: [i586] #1600 zot.git 2.0.1-alt1: build start
[i586] zot.go
[i586] make: git: No such file or directory
[i586] env CGO_ENABLED=0 GOOS=linux GOARCH=386 go build -o bin/zot-linux-386 -buildmode=pie -tags imagetrust,lint,metrics,mgmt,profile,scrub,search,sync,ui,userprefs,containers_image_openpgp -v -trimpath -ldflags "-X zotregistry.io/zot/pkg/api/config.ReleaseTag= -X zotregistry.io/zot/pkg/api/config.Commit=alt1 -X zotregistry.io/zot/pkg/api/config.BinaryType=-imagetrust-lint-metrics-mgmt-profile-scrub-search-sync-ui-userprefs -X zotregistry.io/zot/pkg/api/config.GoVersion=go1.22.0" ./cmd/zot
2024-Feb-20 12:03:56 :: [i586] zot.git 2.0.1-alt1: remote: build failed
2024-Feb-20 12:03:56 :: [i586] #1600 zot.git 2.0.1-alt1: build FAILED
2024-Feb-20 12:03:56 :: [i586] requesting cancellation of task processing
2024-Feb-20 12:04:58 :: [x86_64] #1600 zot.git 2.0.1-alt1: build OK
2024-Feb-20 12:07:47 :: [aarch64] #1600 zot.git 2.0.1-alt1: build OK
[armh] zot.go
[armh] make: git: No such file or directory
[armh] env CGO_ENABLED=0 GOOS=linux GOARCH=arm go build -o bin/zot-linux-arm -buildmode=pie -tags imagetrust,lint,metrics,mgmt,profile,scrub,search,sync,ui,userprefs,containers_image_openpgp -v -trimpath -ldflags "-X zotregistry.io/zot/pkg/api/config.ReleaseTag= -X zotregistry.io/zot/pkg/api/config.Commit=alt1 -X zotregistry.io/zot/pkg/api/config.BinaryType=-imagetrust-lint-metrics-mgmt-profile-scrub-search-sync-ui-userprefs -X zotregistry.io/zot/pkg/api/config.GoVersion=go1.22.0" ./cmd/zot
2024-Feb-20 12:07:54 :: [armh] zot.git 2.0.1-alt1: remote: build failed
2024-Feb-20 12:07:54 :: [armh] #1600 zot.git 2.0.1-alt1: build FAILED
2024-Feb-20 12:09:19 :: [ppc64le] #1600 zot.git 2.0.1-alt1: build OK
2024-Feb-20 12:03:57 :: [i586] build FAILED
2024-Feb-20 12:07:55 :: [armh] build FAILED
2024-Feb-20 12:09:19 :: task #340501 for sisyphus FAILED


^ permalink raw reply	[flat|nested] 13+ messages in thread

end of thread, other threads:[~2024-02-20 12:09 UTC | newest]

Thread overview: 13+ messages (download: mbox.gz / follow: Atom feed)
-- links below jump to the message on this page --
2024-02-12 14:14 [#340501] [test-only] FAILED zot.git=2.0.1-alt1 Girar awaiter (geochip)
2024-02-12 14:30 ` [#340501] [test-only] FAILED (try 2) zot.git=2.0.1-alt1 Girar awaiter (geochip)
2024-02-14 11:40 ` [#340501] TESTED (try 3) zot.git=2.0.1-alt1 Girar awaiter (geochip)
2024-02-14 12:20 ` [#340501] [test-only] FAILED (try 4) zot.git=2.0.1-alt1 Girar awaiter (geochip)
2024-02-14 13:26 ` [#340501] TESTED (try 5) zot.git=2.0.1-alt1 Girar awaiter (geochip)
2024-02-14 14:00 ` [#340501] TESTED (try 6) zot.git=2.0.1-alt1 Girar awaiter (geochip)
2024-02-14 14:15 ` [#340501] TESTED (try 7) zot.git=2.0.1-alt1 Girar awaiter (geochip)
2024-02-14 16:41 ` [#340501] TESTED (try 8) zot.git=2.0.1-alt1 Girar awaiter (geochip)
2024-02-14 19:08 ` [#340501] TESTED (try 9) zot.git=2.0.1-alt1 Girar awaiter (geochip)
2024-02-16 12:57 ` [#340501] TESTED (try 10) zot.git=2.0.1-alt1 Girar awaiter (geochip)
2024-02-19  9:18 ` [#340501] TESTED (try 11) zot.git=2.0.1-alt1 Girar awaiter (geochip)
2024-02-19 12:44 ` [#340501] TESTED (try 12) zot.git=2.0.1-alt1 Girar awaiter (geochip)
2024-02-20 12:09 ` [#340501] FAILED (try 13) zot.git=2.0.1-alt1 Girar awaiter (geochip)

ALT Linux Girar Builder robot reports

This inbox may be cloned and mirrored by anyone:

	git clone --mirror http://lore.altlinux.org/sisyphus-incominger/0 sisyphus-incominger/git/0.git

	# If you have public-inbox 1.1+ installed, you may
	# initialize and index your mirror using the following commands:
	public-inbox-init -V2 sisyphus-incominger sisyphus-incominger/ http://lore.altlinux.org/sisyphus-incominger \
		sisyphus-incominger@lists.altlinux.org sisyphus-incominger@lists.altlinux.ru sisyphus-incominger@lists.altlinux.com
	public-inbox-index sisyphus-incominger

Example config snippet for mirrors.
Newsgroup available over NNTP:
	nntp://lore.altlinux.org/org.altlinux.lists.sisyphus-incominger


AGPL code for this site: git clone https://public-inbox.org/public-inbox.git