ALT Linux Girar Builder robot reports
 help / color / mirror / Atom feed
* [#301566] FAILED srpm=byteman-4.0.16-alt1_4jpp11.src.rpm
@ 2022-06-08 12:46 Girar awaiter (viy)
  0 siblings, 0 replies; only message in thread
From: Girar awaiter (viy) @ 2022-06-08 12:46 UTC (permalink / raw)
  To: Igor Vlasenko; +Cc: sisyphus-incominger, girar-builder-sisyphus

https://git.altlinux.org/tasks/301566/logs/events.1.1.log

subtask  name     aarch64    armh    i586  ppc64le  x86_64
   #100  byteman   failed  failed  failed   failed  failed

2022-Jun-08 12:45:33 :: task #301566 for sisyphus started by viy:
#100 build byteman-4.0.16-alt1_4jpp11.src.rpm
2022-Jun-08 12:45:34 :: [x86_64] #100 byteman-4.0.16-alt1_4jpp11.src.rpm: build start
2022-Jun-08 12:45:34 :: [i586] #100 byteman-4.0.16-alt1_4jpp11.src.rpm: build start
2022-Jun-08 12:45:34 :: [ppc64le] #100 byteman-4.0.16-alt1_4jpp11.src.rpm: build start
2022-Jun-08 12:45:34 :: [aarch64] #100 byteman-4.0.16-alt1_4jpp11.src.rpm: build start
2022-Jun-08 12:45:34 :: [armh] #100 byteman-4.0.16-alt1_4jpp11.src.rpm: build start
[x86_64] [INFO] Total time:  0.436 s
[x86_64] [INFO] Finished at: 2022-06-08T12:45:58Z
[x86_64] [INFO] ------------------------------------------------------------------------
[x86_64] [ERROR] Unknown lifecycle phase "-Dmaven.test.skip.exec=true". You must specify a valid lifecycle phase or a goal in the format <plugin-prefix>:<goal> or <plugin-group-id>:<plugin-artifact-id>[:<plugin-version>]:<goal>. Available lifecycle phases are: validate, initialize, generate-sources, process-sources, generate-resources, process-resources, compile, process-classes, generate-test-sources, process-test-sources, generate-test-resources, process-test-resources, test-compile, process-test-classes, test, prepare-package, package, pre-integration-test, integration-test, post-integration-test, verify, install, deploy, pre-clean, clean, post-clean, pre-site, site, post-site, site-deploy. -> [Help 1]
[x86_64] [ERROR] 
[x86_64] [ERROR] To see the full stack trace of the errors, re-run Maven with the -e switch.
[x86_64] [ERROR] Re-run Maven using the -X switch to enable full debug logging.
[x86_64] [ERROR] 
[x86_64] [ERROR] For more information about the errors and possible solutions, please read the following articles:
[x86_64] [ERROR] [Help 1] http://cwiki.apache.org/confluence/display/MAVEN/LifecyclePhaseNotFoundException
2022-Jun-08 12:45:58 :: [x86_64] byteman-4.0.16-alt1_4jpp11.src.rpm: remote: build failed
2022-Jun-08 12:45:58 :: [x86_64] #100 byteman-4.0.16-alt1_4jpp11.src.rpm: build FAILED
2022-Jun-08 12:45:58 :: [x86_64] requesting cancellation of task processing
[i586] [INFO] Total time:  0.443 s
[i586] [INFO] Finished at: 2022-06-08T12:46:01Z
[i586] [INFO] ------------------------------------------------------------------------
[i586] [ERROR] Unknown lifecycle phase "-Dmaven.test.skip.exec=true". You must specify a valid lifecycle phase or a goal in the format <plugin-prefix>:<goal> or <plugin-group-id>:<plugin-artifact-id>[:<plugin-version>]:<goal>. Available lifecycle phases are: validate, initialize, generate-sources, process-sources, generate-resources, process-resources, compile, process-classes, generate-test-sources, process-test-sources, generate-test-resources, process-test-resources, test-compile, process-test-classes, test, prepare-package, package, pre-integration-test, integration-test, post-integration-test, verify, install, deploy, pre-clean, clean, post-clean, pre-site, site, post-site, site-deploy. -> [Help 1]
[i586] [ERROR] 
[i586] [ERROR] To see the full stack trace of the errors, re-run Maven with the -e switch.
[i586] [ERROR] Re-run Maven using the -X switch to enable full debug logging.
[i586] [ERROR] 
[i586] [ERROR] For more information about the errors and possible solutions, please read the following articles:
[i586] [ERROR] [Help 1] http://cwiki.apache.org/confluence/display/MAVEN/LifecyclePhaseNotFoundException
2022-Jun-08 12:46:01 :: [i586] byteman-4.0.16-alt1_4jpp11.src.rpm: remote: build failed
2022-Jun-08 12:46:01 :: [i586] #100 byteman-4.0.16-alt1_4jpp11.src.rpm: build FAILED
[aarch64] [INFO] Total time:  0.763 s
[aarch64] [INFO] Finished at: 2022-06-08T12:46:17Z
[aarch64] [INFO] ------------------------------------------------------------------------
[aarch64] [ERROR] Unknown lifecycle phase "-Dmaven.test.skip.exec=true". You must specify a valid lifecycle phase or a goal in the format <plugin-prefix>:<goal> or <plugin-group-id>:<plugin-artifact-id>[:<plugin-version>]:<goal>. Available lifecycle phases are: validate, initialize, generate-sources, process-sources, generate-resources, process-resources, compile, process-classes, generate-test-sources, process-test-sources, generate-test-resources, process-test-resources, test-compile, process-test-classes, test, prepare-package, package, pre-integration-test, integration-test, post-integration-test, verify, install, deploy, pre-clean, clean, post-clean, pre-site, site, post-site, site-deploy. -> [Help 1]
[aarch64] [ERROR] 
[aarch64] [ERROR] To see the full stack trace of the errors, re-run Maven with the -e switch.
[aarch64] [ERROR] Re-run Maven using the -X switch to enable full debug logging.
[aarch64] [ERROR] 
[aarch64] [ERROR] For more information about the errors and possible solutions, please read the following articles:
[aarch64] [ERROR] [Help 1] http://cwiki.apache.org/confluence/display/MAVEN/LifecyclePhaseNotFoundException
2022-Jun-08 12:46:17 :: [aarch64] byteman-4.0.16-alt1_4jpp11.src.rpm: remote: build failed
2022-Jun-08 12:46:17 :: [aarch64] #100 byteman-4.0.16-alt1_4jpp11.src.rpm: build FAILED
[ppc64le] [INFO] Total time:  0.966 s
[ppc64le] [INFO] Finished at: 2022-06-08T12:46:23Z
[ppc64le] [INFO] ------------------------------------------------------------------------
[ppc64le] [ERROR] Unknown lifecycle phase "-Dmaven.test.skip.exec=true". You must specify a valid lifecycle phase or a goal in the format <plugin-prefix>:<goal> or <plugin-group-id>:<plugin-artifact-id>[:<plugin-version>]:<goal>. Available lifecycle phases are: validate, initialize, generate-sources, process-sources, generate-resources, process-resources, compile, process-classes, generate-test-sources, process-test-sources, generate-test-resources, process-test-resources, test-compile, process-test-classes, test, prepare-package, package, pre-integration-test, integration-test, post-integration-test, verify, install, deploy, pre-clean, clean, post-clean, pre-site, site, post-site, site-deploy. -> [Help 1]
[ppc64le] [ERROR] 
[ppc64le] [ERROR] To see the full stack trace of the errors, re-run Maven with the -e switch.
[ppc64le] [ERROR] Re-run Maven using the -X switch to enable full debug logging.
[ppc64le] [ERROR] 
[ppc64le] [ERROR] For more information about the errors and possible solutions, please read the following articles:
[ppc64le] [ERROR] [Help 1] http://cwiki.apache.org/confluence/display/MAVEN/LifecyclePhaseNotFoundException
2022-Jun-08 12:46:23 :: [ppc64le] byteman-4.0.16-alt1_4jpp11.src.rpm: remote: build failed
2022-Jun-08 12:46:23 :: [ppc64le] #100 byteman-4.0.16-alt1_4jpp11.src.rpm: build FAILED
[armh] [INFO] Total time:  1.955 s
[armh] [INFO] Finished at: 2022-06-08T12:46:46Z
[armh] [INFO] ------------------------------------------------------------------------
[armh] [ERROR] Unknown lifecycle phase "-Dmaven.test.skip.exec=true". You must specify a valid lifecycle phase or a goal in the format <plugin-prefix>:<goal> or <plugin-group-id>:<plugin-artifact-id>[:<plugin-version>]:<goal>. Available lifecycle phases are: validate, initialize, generate-sources, process-sources, generate-resources, process-resources, compile, process-classes, generate-test-sources, process-test-sources, generate-test-resources, process-test-resources, test-compile, process-test-classes, test, prepare-package, package, pre-integration-test, integration-test, post-integration-test, verify, install, deploy, pre-clean, clean, post-clean, pre-site, site, post-site, site-deploy. -> [Help 1]
[armh] [ERROR] 
[armh] [ERROR] To see the full stack trace of the errors, re-run Maven with the -e switch.
[armh] [ERROR] Re-run Maven using the -X switch to enable full debug logging.
[armh] [ERROR] 
[armh] [ERROR] For more information about the errors and possible solutions, please read the following articles:
[armh] [ERROR] [Help 1] http://cwiki.apache.org/confluence/display/MAVEN/LifecyclePhaseNotFoundException
2022-Jun-08 12:46:47 :: [armh] byteman-4.0.16-alt1_4jpp11.src.rpm: remote: build failed
2022-Jun-08 12:46:47 :: [armh] #100 byteman-4.0.16-alt1_4jpp11.src.rpm: build FAILED
2022-Jun-08 12:45:58 :: [x86_64] build FAILED
2022-Jun-08 12:46:01 :: [i586] build FAILED
2022-Jun-08 12:46:17 :: [aarch64] build FAILED
2022-Jun-08 12:46:23 :: [ppc64le] build FAILED
2022-Jun-08 12:46:47 :: [armh] build FAILED
2022-Jun-08 12:46:47 :: task #301566 for sisyphus FAILED


^ permalink raw reply	[flat|nested] only message in thread

only message in thread, other threads:[~2022-06-08 12:46 UTC | newest]

Thread overview: (only message) (download: mbox.gz / follow: Atom feed)
-- links below jump to the message on this page --
2022-06-08 12:46 [#301566] FAILED srpm=byteman-4.0.16-alt1_4jpp11.src.rpm Girar awaiter (viy)

ALT Linux Girar Builder robot reports

This inbox may be cloned and mirrored by anyone:

	git clone --mirror http://lore.altlinux.org/sisyphus-incominger/0 sisyphus-incominger/git/0.git

	# If you have public-inbox 1.1+ installed, you may
	# initialize and index your mirror using the following commands:
	public-inbox-init -V2 sisyphus-incominger sisyphus-incominger/ http://lore.altlinux.org/sisyphus-incominger \
		sisyphus-incominger@lists.altlinux.org sisyphus-incominger@lists.altlinux.ru sisyphus-incominger@lists.altlinux.com
	public-inbox-index sisyphus-incominger

Example config snippet for mirrors.
Newsgroup available over NNTP:
	nntp://lore.altlinux.org/org.altlinux.lists.sisyphus-incominger


AGPL code for this site: git clone https://public-inbox.org/public-inbox.git