ALT Linux Girar Builder robot reports
 help / color / mirror / Atom feed
* [#296106] [test-only] FAILED jsonnet.git=0.18.0-alt1
@ 2022-03-02 17:11 Girar awaiter (obirvalger)
  2022-06-29 14:06 ` [#296106] [test-only] FAILED (try 2) jsonnet.git=0.18.0-alt1 Girar awaiter (obirvalger)
                   ` (3 more replies)
  0 siblings, 4 replies; 5+ messages in thread
From: Girar awaiter (obirvalger) @ 2022-03-02 17:11 UTC (permalink / raw)
  To: Mikhail Gordeev; +Cc: sisyphus-incominger, girar-builder-sisyphus

https://git.altlinux.org/tasks/296106/logs/events.1.1.log

subtask  name     aarch64  armh  i586  ppc64le  x86_64
   #100  jsonnet     2:25  3:38  1:25   failed    1:15

2022-Mar-02 17:07:35 :: test-only task #296106 for sisyphus started by obirvalger:
#100 build 0.18.0-alt1 from /people/obirvalger/packages/jsonnet.git fetched at 2022-Mar-02 17:07:33
2022-Mar-02 17:07:35 :: [ppc64le] #100 jsonnet.git 0.18.0-alt1: build start
2022-Mar-02 17:07:35 :: [armh] #100 jsonnet.git 0.18.0-alt1: build start
2022-Mar-02 17:07:35 :: [aarch64] #100 jsonnet.git 0.18.0-alt1: build start
2022-Mar-02 17:07:35 :: [i586] #100 jsonnet.git 0.18.0-alt1: build start
2022-Mar-02 17:07:35 :: [x86_64] #100 jsonnet.git 0.18.0-alt1: build start
[ppc64le] third_party/rapidyaml/rapidyaml/ext/c4core/src/c4/ext/debugbreak/debugbreak.h: In function 'void debug_break()':
[ppc64le] third_party/rapidyaml/rapidyaml/ext/c4core/src/c4/ext/debugbreak/debugbreak.h:111:17: error: 'trap_instruction' was not declared in this scope
[ppc64le]   111 |                 trap_instruction();
[ppc64le] --
[ppc64le] third_party/rapidyaml/rapidyaml/ext/c4core/src/c4/ext/debugbreak/debugbreak.h: In function 'void debug_break()':
[ppc64le] third_party/rapidyaml/rapidyaml/ext/c4core/src/c4/ext/debugbreak/debugbreak.h:111:17: error: 'trap_instruction' was not declared in this scope
[ppc64le]   111 |                 trap_instruction();
[ppc64le] --
[ppc64le] third_party/rapidyaml/rapidyaml/ext/c4core/src/c4/ext/debugbreak/debugbreak.h: In function 'void debug_break()':
[ppc64le] third_party/rapidyaml/rapidyaml/ext/c4core/src/c4/ext/debugbreak/debugbreak.h:111:17: error: 'trap_instruction' was not declared in this scope
[ppc64le]   111 |                 trap_instruction();
[ppc64le] --
[ppc64le] third_party/rapidyaml/rapidyaml/ext/c4core/src/c4/ext/debugbreak/debugbreak.h: In function 'void debug_break()':
[ppc64le] third_party/rapidyaml/rapidyaml/ext/c4core/src/c4/ext/debugbreak/debugbreak.h:111:17: error: 'trap_instruction' was not declared in this scope
[ppc64le]   111 |                 trap_instruction();
[ppc64le] --
[ppc64le] third_party/rapidyaml/rapidyaml/ext/c4core/src/c4/ext/debugbreak/debugbreak.h: In function 'void debug_break()':
[ppc64le] third_party/rapidyaml/rapidyaml/ext/c4core/src/c4/ext/debugbreak/debugbreak.h:111:17: error: 'trap_instruction' was not declared in this scope
[ppc64le]   111 |                 trap_instruction();
[ppc64le] --
[ppc64le] third_party/rapidyaml/rapidyaml/ext/c4core/src/c4/ext/debugbreak/debugbreak.h: In function 'void debug_break()':
[ppc64le] third_party/rapidyaml/rapidyaml/ext/c4core/src/c4/ext/debugbreak/debugbreak.h:111:17: error: 'trap_instruction' was not declared in this scope
[ppc64le]   111 |                 trap_instruction();
[ppc64le] --
[ppc64le] third_party/rapidyaml/rapidyaml/ext/c4core/src/c4/ext/debugbreak/debugbreak.h: In function 'void debug_break()':
[ppc64le] third_party/rapidyaml/rapidyaml/ext/c4core/src/c4/ext/debugbreak/debugbreak.h:111:17: error: 'trap_instruction' was not declared in this scope
[ppc64le]   111 |                 trap_instruction();
[ppc64le] --
[ppc64le] third_party/rapidyaml/rapidyaml/ext/c4core/src/c4/ext/debugbreak/debugbreak.h: In function 'void debug_break()':
[ppc64le] third_party/rapidyaml/rapidyaml/ext/c4core/src/c4/ext/debugbreak/debugbreak.h:111:17: error: 'trap_instruction' was not declared in this scope
[ppc64le]   111 |                 trap_instruction();
2022-Mar-02 17:08:47 :: [ppc64le] jsonnet.git 0.18.0-alt1: remote: build failed
2022-Mar-02 17:08:47 :: [ppc64le] #100 jsonnet.git 0.18.0-alt1: build FAILED
2022-Mar-02 17:08:47 :: [ppc64le] requesting cancellation of task processing
2022-Mar-02 17:08:50 :: [x86_64] #100 jsonnet.git 0.18.0-alt1: build OK
2022-Mar-02 17:09:00 :: [i586] #100 jsonnet.git 0.18.0-alt1: build OK
2022-Mar-02 17:10:00 :: [aarch64] #100 jsonnet.git 0.18.0-alt1: build OK
2022-Mar-02 17:11:13 :: [armh] #100 jsonnet.git 0.18.0-alt1: build OK
2022-Mar-02 17:08:47 :: [ppc64le] build FAILED
2022-Mar-02 17:11:13 :: task #296106 for sisyphus FAILED


^ permalink raw reply	[flat|nested] 5+ messages in thread

end of thread, other threads:[~2022-07-01  0:49 UTC | newest]

Thread overview: 5+ messages (download: mbox.gz / follow: Atom feed)
-- links below jump to the message on this page --
2022-03-02 17:11 [#296106] [test-only] FAILED jsonnet.git=0.18.0-alt1 Girar awaiter (obirvalger)
2022-06-29 14:06 ` [#296106] [test-only] FAILED (try 2) jsonnet.git=0.18.0-alt1 Girar awaiter (obirvalger)
2022-06-30 11:48 ` [#296106] [test-only] FAILED (try 3) jsonnet.git=0.18.0-alt1 Girar awaiter (obirvalger)
2022-06-30 12:12 ` [#296106] TESTED (try 4) jsonnet.git=0.18.0-alt1 Girar awaiter (obirvalger)
2022-07-01  0:49 ` [#296106] DONE (try 5) jsonnet.git=0.18.0-alt1 Girar pender (obirvalger)

ALT Linux Girar Builder robot reports

This inbox may be cloned and mirrored by anyone:

	git clone --mirror http://lore.altlinux.org/sisyphus-incominger/0 sisyphus-incominger/git/0.git

	# If you have public-inbox 1.1+ installed, you may
	# initialize and index your mirror using the following commands:
	public-inbox-init -V2 sisyphus-incominger sisyphus-incominger/ http://lore.altlinux.org/sisyphus-incominger \
		sisyphus-incominger@lists.altlinux.org sisyphus-incominger@lists.altlinux.ru sisyphus-incominger@lists.altlinux.com
	public-inbox-index sisyphus-incominger

Example config snippet for mirrors.
Newsgroup available over NNTP:
	nntp://lore.altlinux.org/org.altlinux.lists.sisyphus-incominger


AGPL code for this site: git clone https://public-inbox.org/public-inbox.git