ALT Linux Girar Builder robot reports
 help / color / mirror / Atom feed
* [#271881] [test-only] FAILED sssd.git=2.5.0-alt1
@ 2021-05-14 19:07 Girar awaiter (sin)
  2021-05-14 19:58 ` [#271881] [test-only] FAILED (try 2) sssd.git=2.5.0-alt1 Girar awaiter (sin)
  0 siblings, 1 reply; 2+ messages in thread
From: Girar awaiter (sin) @ 2021-05-14 19:07 UTC (permalink / raw)
  To: Evgeny Sinelnikov; +Cc: sisyphus-incominger, girar-builder-sisyphus

http://git.altlinux.org/tasks/271881/logs/events.1.1.log

subtask  name  aarch64    armh    i586  ppc64le  x86_64
   #100  sssd   failed  failed  failed   failed  failed

2021-May-14 19:02:12 :: test-only task #271881 for sisyphus started by sin:
#100 build 2.5.0-alt1 from /people/sin/packages/sssd.git fetched at 2021-May-14 19:02:10
2021-May-14 19:02:13 :: [i586] #100 sssd.git 2.5.0-alt1: build start
2021-May-14 19:02:13 :: [aarch64] #100 sssd.git 2.5.0-alt1: build start
2021-May-14 19:02:13 :: [armh] #100 sssd.git 2.5.0-alt1: build start
2021-May-14 19:02:13 :: [ppc64le] #100 sssd.git 2.5.0-alt1: build start
2021-May-14 19:02:13 :: [x86_64] #100 sssd.git 2.5.0-alt1: build start
[x86_64] src/responder/nss/nss_cmd.c: In function 'nss_cmd_setnetgrent':
[x86_64] src/responder/nss/nss_cmd.c:1052:27: error: redeclaration of 'state_ctx' with no linkage
[x86_64]  1052 |     struct nss_state_ctx *state_ctx;
2021-May-14 19:04:56 :: [x86_64] sssd.git 2.5.0-alt1: remote: build failed
2021-May-14 19:04:56 :: [x86_64] #100 sssd.git 2.5.0-alt1: build FAILED
2021-May-14 19:04:56 :: [x86_64] requesting cancellation of task processing
[aarch64] make[2]: Leaving directory '/usr/src/RPM/BUILD/sssd-2.5.0'
[aarch64] make[2]: Entering directory '/usr/src/RPM/BUILD/sssd-2.5.0'
[aarch64] aarch64-alt-linux-gcc -DHAVE_CONFIG_H -I.  -Wall -I.. -I./src/sss_client -I./src -I.      -I/usr/include/dbus-1.0 -I/usr/lib64/dbus-1.0/include -I/usr/include/pcre   -I/usr/include/libnl3  -I/usr/include/glib-2.0 -I/usr/lib64/glib-2.0/include -I/usr/include/pcre  -DLIBDIR=\"/usr/lib64\" -DVARDIR=\"/var\" -DSSS_STATEDIR=\"/var/lib/sss\" -DSYSCONFDIR=\"/etc\" -DSHLIBEXT=\"\" -DSSSDDATADIR=\"/usr/share/sssd\" -DSSSD_LIBEXEC_PATH=\"/usr/libexec/sssd\" -DSSSD_CONF_DIR=\"/etc/sssd\" -DSSS_NSS_MCACHE_DIR=\"/var/lib/sss/mc\" -DSSS_NSS_SOCKET_NAME=\"/var/lib/sss/pipes/nss\" -DSSS_PAM_SOCKET_NAME=\"/var/lib/sss/pipes/pam\" -DSSS_PAC_SOCKET_NAME=\"/var/lib/sss/pipes/pac\" -DSSS_PAM_PRIV_SOCKET_NAME=\"/var/lib/sss/pipes/private/pam\" -DSSS_SEC_SOCKET_NAME=\"/var/run/secrets.socket\" -DSSS_SUDO_SOCKET_NAME=\"/var/lib/sss/pipes/sudo\" -DSSS_AUTOFS_SOCKET_NAME=\"/var/lib/sss/pipes/autofs\" -DSSS_SSH_SOCKET_NAME=\"/var/lib/sss/pipes/ssh\" -DLOCALEDIR=\"/usr/share/locale\" -DBASE_FILE_STEM=\"responder_common\"    -Wall -Wshadow -Wstrict-prototypes -Wpointer-arith -Wcast-qual -Wcast-align -Wwrite-strings -Wundef -Werror-implicit-function-declaration -Winit-self -Wmissing-include-dirs -fno-strict-aliasing -std=gnu99 -pipe -frecord-gcc-switches -Wall -g -O2 -D_FILE_OFFSET_BITS=64 -D_LARGEFILE_SOURCE -D_LARGEFILE64_SOURCE -c -o src/responder/common/responder_common.o src/responder/common/responder_common.c
[aarch64] make[2]: Leaving directory '/usr/src/RPM/BUILD/sssd-2.5.0'
[aarch64] make[2]: Entering directory '/usr/src/RPM/BUILD/sssd-2.5.0'
[aarch64] /bin/sh ./libtool  --tag=CC   --mode=compile aarch64-alt-linux-gcc -DHAVE_CONFIG_H -I.  -Wall -I.. -I./src/sss_client -I./src -I.      -I/usr/include/dbus-1.0 -I/usr/lib64/dbus-1.0/include -I/usr/include/pcre   -I/usr/include/libnl3  -I/usr/include/glib-2.0 -I/usr/lib64/glib-2.0/include -I/usr/include/pcre  -DLIBDIR=\"/usr/lib64\" -DVARDIR=\"/var\" -DSSS_STATEDIR=\"/var/lib/sss\" -DSYSCONFDIR=\"/etc\" -DSHLIBEXT=\"\" -DSSSDDATADIR=\"/usr/share/sssd\" -DSSSD_LIBEXEC_PATH=\"/usr/libexec/sssd\" -DSSSD_CONF_DIR=\"/etc/sssd\" -DSSS_NSS_MCACHE_DIR=\"/var/lib/sss/mc\" -DSSS_NSS_SOCKET_NAME=\"/var/lib/sss/pipes/nss\" -DSSS_PAM_SOCKET_NAME=\"/var/lib/sss/pipes/pam\" -DSSS_PAC_SOCKET_NAME=\"/var/lib/sss/pipes/pac\" -DSSS_PAM_PRIV_SOCKET_NAME=\"/var/lib/sss/pipes/private/pam\" -DSSS_SEC_SOCKET_NAME=\"/var/run/secrets.socket\" -DSSS_SUDO_SOCKET_NAME=\"/var/lib/sss/pipes/sudo\" -DSSS_AUTOFS_SOCKET_NAME=\"/var/lib/sss/pipes/autofs\" -DSSS_SSH_SOCKET_NAME=\"/var/lib/sss/pipes/ssh\" -DLOCALEDIR=\"/usr/share/locale\" -DBASE_FILE_STEM=\"libsss_util_la-sysdb_ops\"    -Wall -Wshadow -Wstrict-prototypes -Wpointer-arith -Wcast-qual -Wcast-align -Wwrite-strings -Wundef -Werror-implicit-function-declaration -Winit-self -Wmissing-include-dirs -fno-strict-aliasing -std=gnu99   -pipe -frecord-gcc-switches -Wall -g -O2 -D_FILE_OFFSET_BITS=64 -D_LARGEFILE_SOURCE -D_LARGEFILE64_SOURCE -c -o src/db/libsss_util_la-sysdb_ops.lo `test -f 'src/db/sysdb_ops.c' || echo './'`src/db/sysdb_ops.c
[aarch64] libtool: compile:  aarch64-alt-linux-gcc -DHAVE_CONFIG_H -I. -Wall -I.. -I./src/sss_client -I./src -I. -I/usr/include/dbus-1.0 -I/usr/lib64/dbus-1.0/include -I/usr/include/pcre -I/usr/include/libnl3 -I/usr/include/glib-2.0 -I/usr/lib64/glib-2.0/include -I/usr/include/pcre -DLIBDIR=\"/usr/lib64\" -DVARDIR=\"/var\" -DSSS_STATEDIR=\"/var/lib/sss\" -DSYSCONFDIR=\"/etc\" -DSHLIBEXT=\"\" -DSSSDDATADIR=\"/usr/share/sssd\" -DSSSD_LIBEXEC_PATH=\"/usr/libexec/sssd\" -DSSSD_CONF_DIR=\"/etc/sssd\" -DSSS_NSS_MCACHE_DIR=\"/var/lib/sss/mc\" -DSSS_NSS_SOCKET_NAME=\"/var/lib/sss/pipes/nss\" -DSSS_PAM_SOCKET_NAME=\"/var/lib/sss/pipes/pam\" -DSSS_PAC_SOCKET_NAME=\"/var/lib/sss/pipes/pac\" -DSSS_PAM_PRIV_SOCKET_NAME=\"/var/lib/sss/pipes/private/pam\" -DSSS_SEC_SOCKET_NAME=\"/var/run/secrets.socket\" -DSSS_SUDO_SOCKET_NAME=\"/var/lib/sss/pipes/sudo\" -DSSS_AUTOFS_SOCKET_NAME=\"/var/lib/sss/pipes/autofs\" -DSSS_SSH_SOCKET_NAME=\"/var/lib/sss/pipes/ssh\" -DLOCALEDIR=\"/usr/share/locale\" -DBASE_FILE_STEM=\"libsss_util_la-sysdb_ops\" -Wall -Wshadow -Wstrict-prototypes -Wpointer-arith -Wcast-qual -Wcast-align -Wwrite-strings -Wundef -Werror-implicit-function-declaration -Winit-self -Wmissing-include-dirs -fno-strict-aliasing -std=gnu99 -pipe -frecord-gcc-switches -Wall -g -O2 -D_FILE_OFFSET_BITS=64 -D_LARGEFILE_SOURCE -D_LARGEFILE64_SOURCE -c src/db/sysdb_ops.c  -fPIC -DPIC -o src/db/.libs/libsss_util_la-sysdb_ops.o
[aarch64] make[2]: Leaving directory '/usr/src/RPM/BUILD/sssd-2.5.0'
[aarch64] make[1]: *** [Makefile:41212: all-recursive] Error 1
[aarch64] make: *** [Makefile:12641: all] Error 2
2021-May-14 19:05:22 :: [aarch64] sssd.git 2.5.0-alt1: remote: build failed
2021-May-14 19:05:22 :: [aarch64] #100 sssd.git 2.5.0-alt1: build FAILED
[i586] src/responder/nss/nss_cmd.c: In function 'nss_cmd_setnetgrent':
[i586] src/responder/nss/nss_cmd.c:1052:27: error: redeclaration of 'state_ctx' with no linkage
[i586]  1052 |     struct nss_state_ctx *state_ctx;
2021-May-14 19:05:28 :: [i586] sssd.git 2.5.0-alt1: remote: build failed
2021-May-14 19:05:28 :: [i586] #100 sssd.git 2.5.0-alt1: build FAILED
[ppc64le] src/responder/nss/nss_cmd.c: In function 'nss_cmd_setnetgrent':
[ppc64le] src/responder/nss/nss_cmd.c:1052:27: error: redeclaration of 'state_ctx' with no linkage
[ppc64le]  1052 |     struct nss_state_ctx *state_ctx;
2021-May-14 19:06:50 :: [ppc64le] sssd.git 2.5.0-alt1: remote: build failed
2021-May-14 19:06:50 :: [ppc64le] #100 sssd.git 2.5.0-alt1: build FAILED
[armh] make[2]: Leaving directory '/usr/src/RPM/BUILD/sssd-2.5.0'
[armh] make[2]: Entering directory '/usr/src/RPM/BUILD/sssd-2.5.0'
[armh] armh-alt-linux-gnueabi-gcc -DHAVE_CONFIG_H -I.  -Wall -I.. -I./src/sss_client -I./src -I.      -I/usr/include/dbus-1.0 -I/usr/lib/dbus-1.0/include -I/usr/include/pcre   -I/usr/include/libnl3  -I/usr/include/glib-2.0 -I/usr/lib/glib-2.0/include -I/usr/include/pcre  -DLIBDIR=\"/usr/lib\" -DVARDIR=\"/var\" -DSSS_STATEDIR=\"/var/lib/sss\" -DSYSCONFDIR=\"/etc\" -DSHLIBEXT=\"\" -DSSSDDATADIR=\"/usr/share/sssd\" -DSSSD_LIBEXEC_PATH=\"/usr/libexec/sssd\" -DSSSD_CONF_DIR=\"/etc/sssd\" -DSSS_NSS_MCACHE_DIR=\"/var/lib/sss/mc\" -DSSS_NSS_SOCKET_NAME=\"/var/lib/sss/pipes/nss\" -DSSS_PAM_SOCKET_NAME=\"/var/lib/sss/pipes/pam\" -DSSS_PAC_SOCKET_NAME=\"/var/lib/sss/pipes/pac\" -DSSS_PAM_PRIV_SOCKET_NAME=\"/var/lib/sss/pipes/private/pam\" -DSSS_SEC_SOCKET_NAME=\"/var/run/secrets.socket\" -DSSS_SUDO_SOCKET_NAME=\"/var/lib/sss/pipes/sudo\" -DSSS_AUTOFS_SOCKET_NAME=\"/var/lib/sss/pipes/autofs\" -DSSS_SSH_SOCKET_NAME=\"/var/lib/sss/pipes/ssh\" -DLOCALEDIR=\"/usr/share/locale\" -DBASE_FILE_STEM=\"responder_common\"    -Wall -Wshadow -Wstrict-prototypes -Wpointer-arith -Wcast-qual -Wcast-align -Wwrite-strings -Wundef -Werror-implicit-function-declaration -Winit-self -Wmissing-include-dirs -fno-strict-aliasing -std=gnu99 -pipe -frecord-gcc-switches -Wall -g -O2 -fomit-frame-pointer -march=armv7-a -mthumb -D_FILE_OFFSET_BITS=64 -D_LARGEFILE_SOURCE -D_LARGEFILE64_SOURCE -c -o src/responder/common/responder_common.o src/responder/common/responder_common.c
[armh] make[2]: Leaving directory '/usr/src/RPM/BUILD/sssd-2.5.0'
[armh] make[2]: Entering directory '/usr/src/RPM/BUILD/sssd-2.5.0'
[armh] /bin/sh ./libtool  --tag=CC   --mode=compile armh-alt-linux-gnueabi-gcc -DHAVE_CONFIG_H -I.  -Wall -I.. -I./src/sss_client -I./src -I.      -I/usr/include/dbus-1.0 -I/usr/lib/dbus-1.0/include -I/usr/include/pcre   -I/usr/include/libnl3  -I/usr/include/glib-2.0 -I/usr/lib/glib-2.0/include -I/usr/include/pcre  -DLIBDIR=\"/usr/lib\" -DVARDIR=\"/var\" -DSSS_STATEDIR=\"/var/lib/sss\" -DSYSCONFDIR=\"/etc\" -DSHLIBEXT=\"\" -DSSSDDATADIR=\"/usr/share/sssd\" -DSSSD_LIBEXEC_PATH=\"/usr/libexec/sssd\" -DSSSD_CONF_DIR=\"/etc/sssd\" -DSSS_NSS_MCACHE_DIR=\"/var/lib/sss/mc\" -DSSS_NSS_SOCKET_NAME=\"/var/lib/sss/pipes/nss\" -DSSS_PAM_SOCKET_NAME=\"/var/lib/sss/pipes/pam\" -DSSS_PAC_SOCKET_NAME=\"/var/lib/sss/pipes/pac\" -DSSS_PAM_PRIV_SOCKET_NAME=\"/var/lib/sss/pipes/private/pam\" -DSSS_SEC_SOCKET_NAME=\"/var/run/secrets.socket\" -DSSS_SUDO_SOCKET_NAME=\"/var/lib/sss/pipes/sudo\" -DSSS_AUTOFS_SOCKET_NAME=\"/var/lib/sss/pipes/autofs\" -DSSS_SSH_SOCKET_NAME=\"/var/lib/sss/pipes/ssh\" -DLOCALEDIR=\"/usr/share/locale\" -DBASE_FILE_STEM=\"libsss_util_la-sysdb_ops\"    -Wall -Wshadow -Wstrict-prototypes -Wpointer-arith -Wcast-qual -Wcast-align -Wwrite-strings -Wundef -Werror-implicit-function-declaration -Winit-self -Wmissing-include-dirs -fno-strict-aliasing -std=gnu99   -pipe -frecord-gcc-switches -Wall -g -O2 -fomit-frame-pointer -march=armv7-a -mthumb -D_FILE_OFFSET_BITS=64 -D_LARGEFILE_SOURCE -D_LARGEFILE64_SOURCE -c -o src/db/libsss_util_la-sysdb_ops.lo `test -f 'src/db/sysdb_ops.c' || echo './'`src/db/sysdb_ops.c
[armh] libtool: compile:  armh-alt-linux-gnueabi-gcc -DHAVE_CONFIG_H -I. -Wall -I.. -I./src/sss_client -I./src -I. -I/usr/include/dbus-1.0 -I/usr/lib/dbus-1.0/include -I/usr/include/pcre -I/usr/include/libnl3 -I/usr/include/glib-2.0 -I/usr/lib/glib-2.0/include -I/usr/include/pcre -DLIBDIR=\"/usr/lib\" -DVARDIR=\"/var\" -DSSS_STATEDIR=\"/var/lib/sss\" -DSYSCONFDIR=\"/etc\" -DSHLIBEXT=\"\" -DSSSDDATADIR=\"/usr/share/sssd\" -DSSSD_LIBEXEC_PATH=\"/usr/libexec/sssd\" -DSSSD_CONF_DIR=\"/etc/sssd\" -DSSS_NSS_MCACHE_DIR=\"/var/lib/sss/mc\" -DSSS_NSS_SOCKET_NAME=\"/var/lib/sss/pipes/nss\" -DSSS_PAM_SOCKET_NAME=\"/var/lib/sss/pipes/pam\" -DSSS_PAC_SOCKET_NAME=\"/var/lib/sss/pipes/pac\" -DSSS_PAM_PRIV_SOCKET_NAME=\"/var/lib/sss/pipes/private/pam\" -DSSS_SEC_SOCKET_NAME=\"/var/run/secrets.socket\" -DSSS_SUDO_SOCKET_NAME=\"/var/lib/sss/pipes/sudo\" -DSSS_AUTOFS_SOCKET_NAME=\"/var/lib/sss/pipes/autofs\" -DSSS_SSH_SOCKET_NAME=\"/var/lib/sss/pipes/ssh\" -DLOCALEDIR=\"/usr/share/locale\" -DBASE_FILE_STEM=\"libsss_util_la-sysdb_ops\" -Wall -Wshadow -Wstrict-prototypes -Wpointer-arith -Wcast-qual -Wcast-align -Wwrite-strings -Wundef -Werror-implicit-function-declaration -Winit-self -Wmissing-include-dirs -fno-strict-aliasing -std=gnu99 -pipe -frecord-gcc-switches -Wall -g -O2 -fomit-frame-pointer -march=armv7-a -mthumb -D_FILE_OFFSET_BITS=64 -D_LARGEFILE_SOURCE -D_LARGEFILE64_SOURCE -c src/db/sysdb_ops.c  -fPIC -DPIC -o src/db/.libs/libsss_util_la-sysdb_ops.o
[armh] make[2]: Leaving directory '/usr/src/RPM/BUILD/sssd-2.5.0'
[armh] make[1]: *** [Makefile:41212: all-recursive] Error 1
[armh] make: *** [Makefile:12641: all] Error 2
2021-May-14 19:07:12 :: [armh] sssd.git 2.5.0-alt1: remote: build failed
2021-May-14 19:07:12 :: [armh] #100 sssd.git 2.5.0-alt1: build FAILED
2021-May-14 19:04:56 :: [x86_64] build FAILED
2021-May-14 19:05:22 :: [aarch64] build FAILED
2021-May-14 19:05:29 :: [i586] build FAILED
2021-May-14 19:06:50 :: [ppc64le] build FAILED
2021-May-14 19:07:12 :: [armh] build FAILED
2021-May-14 19:07:12 :: task #271881 for sisyphus FAILED


^ permalink raw reply	[flat|nested] 2+ messages in thread

* [#271881] [test-only] FAILED (try 2) sssd.git=2.5.0-alt1
  2021-05-14 19:07 [#271881] [test-only] FAILED sssd.git=2.5.0-alt1 Girar awaiter (sin)
@ 2021-05-14 19:58 ` Girar awaiter (sin)
  0 siblings, 0 replies; 2+ messages in thread
From: Girar awaiter (sin) @ 2021-05-14 19:58 UTC (permalink / raw)
  To: Evgeny Sinelnikov; +Cc: sisyphus-incominger, girar-builder-sisyphus

http://git.altlinux.org/tasks/271881/logs/events.2.1.log

subtask  name  aarch64    armh    i586  ppc64le  x86_64
   #200  sssd   failed  failed  failed   failed  failed

2021-May-14 19:40:30 :: test-only task #271881 for sisyphus resumed by sin:
#100 removed
#200 build 2.5.0-alt1 from /people/sin/packages/sssd.git fetched at 2021-May-14 19:39:18
2021-May-14 19:40:31 :: [i586] #200 sssd.git 2.5.0-alt1: build start
2021-May-14 19:40:31 :: [ppc64le] #200 sssd.git 2.5.0-alt1: build start
2021-May-14 19:40:31 :: [aarch64] #200 sssd.git 2.5.0-alt1: build start
2021-May-14 19:40:31 :: [x86_64] #200 sssd.git 2.5.0-alt1: build start
2021-May-14 19:40:31 :: [armh] #200 sssd.git 2.5.0-alt1: build start
[aarch64]     /usr/share/man/uk/man8/sssd_krb5_locator_plugin.8.xz
[aarch64] error: File list check failed, terminating build
[aarch64] RPM build errors:
[aarch64]     Installed (but unpackaged) file(s) found:
[aarch64]     File list check failed, terminating build
2021-May-14 19:51:58 :: [aarch64] sssd.git 2.5.0-alt1: remote: build failed
2021-May-14 19:51:58 :: [aarch64] #200 sssd.git 2.5.0-alt1: build FAILED
2021-May-14 19:51:58 :: [aarch64] requesting cancellation of task processing
[i586]     /usr/share/man/uk/man8/sssd_krb5_locator_plugin.8.xz
[i586] error: File list check failed, terminating build
[i586] RPM build errors:
[i586]     Installed (but unpackaged) file(s) found:
[i586]     File list check failed, terminating build
2021-May-14 19:52:00 :: [i586] sssd.git 2.5.0-alt1: remote: build failed
2021-May-14 19:52:00 :: [i586] #200 sssd.git 2.5.0-alt1: build FAILED
[x86_64]     /usr/share/man/uk/man8/sssd_krb5_locator_plugin.8.xz
[x86_64] error: File list check failed, terminating build
[x86_64] RPM build errors:
[x86_64]     Installed (but unpackaged) file(s) found:
[x86_64]     File list check failed, terminating build
2021-May-14 19:53:19 :: [x86_64] sssd.git 2.5.0-alt1: remote: build failed
2021-May-14 19:53:19 :: [x86_64] #200 sssd.git 2.5.0-alt1: build FAILED
[ppc64le]     /usr/share/man/uk/man8/sssd_krb5_locator_plugin.8.xz
[ppc64le] error: File list check failed, terminating build
[ppc64le] RPM build errors:
[ppc64le]     Installed (but unpackaged) file(s) found:
[ppc64le]     File list check failed, terminating build
2021-May-14 19:54:31 :: [ppc64le] sssd.git 2.5.0-alt1: remote: build failed
2021-May-14 19:54:31 :: [ppc64le] #200 sssd.git 2.5.0-alt1: build FAILED
[armh]     /usr/share/man/uk/man8/sssd_krb5_locator_plugin.8.xz
[armh] error: File list check failed, terminating build
[armh] RPM build errors:
[armh]     Installed (but unpackaged) file(s) found:
[armh]     File list check failed, terminating build
2021-May-14 19:58:23 :: [armh] sssd.git 2.5.0-alt1: remote: build failed
2021-May-14 19:58:23 :: [armh] #200 sssd.git 2.5.0-alt1: build FAILED
2021-May-14 19:51:58 :: [aarch64] build FAILED
2021-May-14 19:52:00 :: [i586] build FAILED
2021-May-14 19:53:20 :: [x86_64] build FAILED
2021-May-14 19:54:32 :: [ppc64le] build FAILED
2021-May-14 19:58:23 :: [armh] build FAILED
2021-May-14 19:58:23 :: task #271881 for sisyphus FAILED


^ permalink raw reply	[flat|nested] 2+ messages in thread

end of thread, other threads:[~2021-05-14 19:58 UTC | newest]

Thread overview: 2+ messages (download: mbox.gz / follow: Atom feed)
-- links below jump to the message on this page --
2021-05-14 19:07 [#271881] [test-only] FAILED sssd.git=2.5.0-alt1 Girar awaiter (sin)
2021-05-14 19:58 ` [#271881] [test-only] FAILED (try 2) sssd.git=2.5.0-alt1 Girar awaiter (sin)

ALT Linux Girar Builder robot reports

This inbox may be cloned and mirrored by anyone:

	git clone --mirror http://lore.altlinux.org/sisyphus-incominger/0 sisyphus-incominger/git/0.git

	# If you have public-inbox 1.1+ installed, you may
	# initialize and index your mirror using the following commands:
	public-inbox-init -V2 sisyphus-incominger sisyphus-incominger/ http://lore.altlinux.org/sisyphus-incominger \
		sisyphus-incominger@lists.altlinux.org sisyphus-incominger@lists.altlinux.ru sisyphus-incominger@lists.altlinux.com
	public-inbox-index sisyphus-incominger

Example config snippet for mirrors.
Newsgroup available over NNTP:
	nntp://lore.altlinux.org/org.altlinux.lists.sisyphus-incominger


AGPL code for this site: git clone https://public-inbox.org/public-inbox.git