ALT Linux Girar Builder robot reports
 help / color / mirror / Atom feed
* [#271715] [test-only] p9 FAILED chromium.git=90.0.4430.72-alt0.p9.1
@ 2021-05-13  7:32 Girar awaiter (cas)
  2021-06-03 19:01 ` [#271715] p9 FAILED (try 2) chromium.git=91.0.4472.77-alt0.p9.1 Girar awaiter (cas)
  2021-06-11  7:55 ` [#271715] p9 EPERM (try 3) chromium.git=91.0.4472.101-alt0.p9.1 Girar awaiter (cas)
  0 siblings, 2 replies; 3+ messages in thread
From: Girar awaiter (cas) @ 2021-05-13  7:32 UTC (permalink / raw)
  To: Andrey Cherepanov; +Cc: sisyphus-incominger, girar-builder-p9

http://git.altlinux.org/tasks/271715/logs/events.1.1.log

subtask  name      aarch64  armh     i586  ppc64le   x86_64
   #100  chromium   failed     -  3:46:17        -  3:28:03

2021-May-13 03:46:11 :: test-only task #271715 for p9 started by cas:
#100 build 90.0.4430.72-alt0.p9.1 from /people/cas/packages/chromium.git fetched at 2021-May-13 03:14:56
2021-May-13 03:46:12 :: [ppc64le] #100 chromium.git 90.0.4430.72-alt0.p9.1: build start
2021-May-13 03:46:12 :: [i586] #100 chromium.git 90.0.4430.72-alt0.p9.1: build start
2021-May-13 03:46:12 :: [armh] #100 chromium.git 90.0.4430.72-alt0.p9.1: build start
2021-May-13 03:46:12 :: [x86_64] #100 chromium.git 90.0.4430.72-alt0.p9.1: build start
2021-May-13 03:46:12 :: [aarch64] #100 chromium.git 90.0.4430.72-alt0.p9.1: build start
2021-May-13 03:46:30 :: [ppc64le] #100 chromium.git 90.0.4430.72-alt0.p9.1: build SKIPPED
2021-May-13 03:46:41 :: [armh] #100 chromium.git 90.0.4430.72-alt0.p9.1: build SKIPPED
2021-May-13 07:14:15 :: [x86_64] #100 chromium.git 90.0.4430.72-alt0.p9.1: build OK
[aarch64] [49224/49224] python "../../build/toolchain/gcc_link_wrapper.py" --output="./chrome" -- clang++ -Wl,--version-script=../../build/linux/chrome.map -fuse-ld=lld -Wl,--build-id=sha1 -fPIC -Wl,-z,noexecstack -Wl,-z,relro -Wl,-z,now -Wl,-z,defs -Wl,--as-needed -Wl,-z,max-page-size=4096 -Wl,--color-diagnostics -Wl,-mllvm,-instcombine-lower-dbg-declare=0 -flto=thin -Wl,--thinlto-jobs=all -Wl,--thinlto-cache-dir=thinlto-cache -Wl,--thinlto-cache-policy,cache_size=10\%:cache_size_bytes=40g:cache_size_files=100000 -Wl,-mllvm,-import-instr-limit=5 -fwhole-program-vtables -Wl,--no-call-graph-profile-sort --target=aarch64-linux-gnu -Wl,-O2 -Wl,--gc-sections -rdynamic -pie -Wl,--disable-new-dtags -Wl,--lto-O2 -o "./chrome" -Wl,--start-group @"./chrome.rsp"  -Wl,--end-group  -latomic -ldl -lpthread -lrt -lgmodule-2.0 -lgobject-2.0 -lgthread-2.0 -lglib-2.0 -lsmime3 -lnss3 -lnssutil3 -lplds4 -lplc4 -lnspr4 -latk-1.0 -latk-bridge-2.0 -lcups -ldrm -lfontconfig -ldbus-1 -lresolv -lgio-2.0 -lexpat -lxcb -lxkbcommon -lm -lopus -lavcodec -lavformat -lavutil -lX11 -lXcomposite -lXdamage -lXext -lXfixes -lXrender -lXrandr -lXtst -lgbm -lgtk-3 -lgdk-3 -lpangocairo-1.0 -lpango-1.0 -lharfbuzz -lcairo-gobject -lcairo -lgdk_pixbuf-2.0 -lwayland-client -lXi -lpci -lasound -lpulse -latspi -lxshmfence
[aarch64] FAILED: chrome 
[aarch64] python "../../build/toolchain/gcc_link_wrapper.py" --output="./chrome" -- clang++ -Wl,--version-script=../../build/linux/chrome.map -fuse-ld=lld -Wl,--build-id=sha1 -fPIC -Wl,-z,noexecstack -Wl,-z,relro -Wl,-z,now -Wl,-z,defs -Wl,--as-needed -Wl,-z,max-page-size=4096 -Wl,--color-diagnostics -Wl,-mllvm,-instcombine-lower-dbg-declare=0 -flto=thin -Wl,--thinlto-jobs=all -Wl,--thinlto-cache-dir=thinlto-cache -Wl,--thinlto-cache-policy,cache_size=10\%:cache_size_bytes=40g:cache_size_files=100000 -Wl,-mllvm,-import-instr-limit=5 -fwhole-program-vtables -Wl,--no-call-graph-profile-sort --target=aarch64-linux-gnu -Wl,-O2 -Wl,--gc-sections -rdynamic -pie -Wl,--disable-new-dtags -Wl,--lto-O2 -o "./chrome" -Wl,--start-group @"./chrome.rsp"  -Wl,--end-group  -latomic -ldl -lpthread -lrt -lgmodule-2.0 -lgobject-2.0 -lgthread-2.0 -lglib-2.0 -lsmime3 -lnss3 -lnssutil3 -lplds4 -lplc4 -lnspr4 -latk-1.0 -latk-bridge-2.0 -lcups -ldrm -lfontconfig -ldbus-1 -lresolv -lgio-2.0 -lexpat -lxcb -lxkbcommon -lm -lopus -lavcodec -lavformat -lavutil -lX11 -lXcomposite -lXdamage -lXext -lXfixes -lXrender -lXrandr -lXtst -lgbm -lgtk-3 -lgdk-3 -lpangocairo-1.0 -lpango-1.0 -lharfbuzz -lcairo-gobject -lcairo -lgdk_pixbuf-2.0 -lwayland-client -lXi -lpci -lasound -lpulse -latspi -lxshmfence
[aarch64] PLEASE submit a bug report to https://bugs.llvm.org/ and include the crash backtrace.
[aarch64] LLVM ERROR: Failed to rename temporary file thinlto-cache/Thin-03c510.tmp.o to thinlto-cache/llvmcache-F0C2EFCA1D4E3BFC1183300C58DFEE501BD36DDE: No such file or directory
[aarch64] clang-11: error: unable to execute command: Aborted
[aarch64] clang-11: error: linker command failed due to signal (use -v to see invocation)
[aarch64] ninja: build stopped: subcommand failed.
2021-May-13 07:27:05 :: [aarch64] chromium.git 90.0.4430.72-alt0.p9.1: remote: build failed
2021-May-13 07:27:06 :: [aarch64] #100 chromium.git 90.0.4430.72-alt0.p9.1: build FAILED
2021-May-13 07:27:06 :: [aarch64] requesting cancellation of task processing
2021-May-13 07:32:29 :: [i586] #100 chromium.git 90.0.4430.72-alt0.p9.1: build OK
2021-May-13 07:27:07 :: [aarch64] build FAILED
2021-May-13 07:32:29 :: task #271715 for p9 FAILED


^ permalink raw reply	[flat|nested] 3+ messages in thread

* [#271715] p9 FAILED (try 2) chromium.git=91.0.4472.77-alt0.p9.1
  2021-05-13  7:32 [#271715] [test-only] p9 FAILED chromium.git=90.0.4430.72-alt0.p9.1 Girar awaiter (cas)
@ 2021-06-03 19:01 ` Girar awaiter (cas)
  2021-06-11  7:55 ` [#271715] p9 EPERM (try 3) chromium.git=91.0.4472.101-alt0.p9.1 Girar awaiter (cas)
  1 sibling, 0 replies; 3+ messages in thread
From: Girar awaiter (cas) @ 2021-06-03 19:01 UTC (permalink / raw)
  To: Andrey Cherepanov; +Cc: sisyphus-incominger, girar-builder-p9

http://git.altlinux.org/tasks/271715/logs/events.2.1.log

subtask  name      aarch64  armh     i586  ppc64le   x86_64
   #200  chromium   failed     -  4:27:04        -  3:08:24

2021-Jun-03 14:34:41 :: task #271715 for p9 resumed by cas:
2021-Jun-03 14:34:41 :: message: New_version_with_security_fixes
#100 removed
#200 build 91.0.4472.77-alt0.p9.1 from /people/cas/packages/chromium.git fetched at 2021-Jun-03 11:40:21
2021-Jun-03 14:34:42 :: [aarch64] #200 chromium.git 91.0.4472.77-alt0.p9.1: build start
2021-Jun-03 14:34:42 :: [armh] #200 chromium.git 91.0.4472.77-alt0.p9.1: build start
2021-Jun-03 14:34:42 :: [x86_64] #200 chromium.git 91.0.4472.77-alt0.p9.1: build start
2021-Jun-03 14:34:42 :: [i586] #200 chromium.git 91.0.4472.77-alt0.p9.1: build start
2021-Jun-03 14:34:42 :: [ppc64le] #200 chromium.git 91.0.4472.77-alt0.p9.1: build start
2021-Jun-03 14:35:06 :: [ppc64le] #200 chromium.git 91.0.4472.77-alt0.p9.1: build SKIPPED
2021-Jun-03 14:35:14 :: [armh] #200 chromium.git 91.0.4472.77-alt0.p9.1: build SKIPPED
2021-Jun-03 17:43:06 :: [x86_64] #200 chromium.git 91.0.4472.77-alt0.p9.1: build OK
[aarch64] [49149/49149] python "../../build/toolchain/gcc_link_wrapper.py" --output="./chrome" -- clang++ -Wl,--version-script=../../build/linux/chrome.map -fuse-ld=lld -Wl,--build-id=sha1 -fPIC -Wl,-z,noexecstack -Wl,-z,relro -Wl,-z,now -Wl,-z,defs -Wl,--as-needed -Wl,-z,max-page-size=4096 -Wl,--color-diagnostics -Wl,-mllvm,-instcombine-lower-dbg-declare=0 -flto=thin -Wl,--thinlto-jobs=all -Wl,--thinlto-cache-dir=thinlto-cache -Wl,--thinlto-cache-policy,cache_size=10\%:cache_size_bytes=40g:cache_size_files=100000 -Wl,-mllvm,-import-instr-limit=5 -fwhole-program-vtables -Wl,--no-call-graph-profile-sort --target=aarch64-linux-gnu -Wl,-O2 -Wl,--gc-sections -rdynamic -pie -Wl,--disable-new-dtags -Wl,--lto-O2 -o "./chrome" -Wl,--start-group @"./chrome.rsp"  -Wl,--end-group  -latomic -ldl -lpthread -lrt -lgmodule-2.0 -lgobject-2.0 -lgthread-2.0 -lglib-2.0 -lsmime3 -lnss3 -lnssutil3 -lplds4 -lplc4 -lnspr4 -latk-1.0 -latk-bridge-2.0 -lcups -ldrm -lfontconfig -ldbus-1 -lresolv -lgio-2.0 -lexpat -lxcb -lxkbcommon -lm -lopus -lavcodec -lavformat -lavutil -lX11 -lXcomposite -lXdamage -lXext -lXfixes -lXrender -lXrandr -lXtst -lgbm -lwayland-client -lpangocairo-1.0 -lpango-1.0 -lharfbuzz -lcairo -lgtk-3 -lgdk-3 -lcairo-gobject -lgdk_pixbuf-2.0 -lXi -lpci -lasound -lpulse -latspi -lxshmfence
[aarch64] FAILED: chrome 
[aarch64] python "../../build/toolchain/gcc_link_wrapper.py" --output="./chrome" -- clang++ -Wl,--version-script=../../build/linux/chrome.map -fuse-ld=lld -Wl,--build-id=sha1 -fPIC -Wl,-z,noexecstack -Wl,-z,relro -Wl,-z,now -Wl,-z,defs -Wl,--as-needed -Wl,-z,max-page-size=4096 -Wl,--color-diagnostics -Wl,-mllvm,-instcombine-lower-dbg-declare=0 -flto=thin -Wl,--thinlto-jobs=all -Wl,--thinlto-cache-dir=thinlto-cache -Wl,--thinlto-cache-policy,cache_size=10\%:cache_size_bytes=40g:cache_size_files=100000 -Wl,-mllvm,-import-instr-limit=5 -fwhole-program-vtables -Wl,--no-call-graph-profile-sort --target=aarch64-linux-gnu -Wl,-O2 -Wl,--gc-sections -rdynamic -pie -Wl,--disable-new-dtags -Wl,--lto-O2 -o "./chrome" -Wl,--start-group @"./chrome.rsp"  -Wl,--end-group  -latomic -ldl -lpthread -lrt -lgmodule-2.0 -lgobject-2.0 -lgthread-2.0 -lglib-2.0 -lsmime3 -lnss3 -lnssutil3 -lplds4 -lplc4 -lnspr4 -latk-1.0 -latk-bridge-2.0 -lcups -ldrm -lfontconfig -ldbus-1 -lresolv -lgio-2.0 -lexpat -lxcb -lxkbcommon -lm -lopus -lavcodec -lavformat -lavutil -lX11 -lXcomposite -lXdamage -lXext -lXfixes -lXrender -lXrandr -lXtst -lgbm -lwayland-client -lpangocairo-1.0 -lpango-1.0 -lharfbuzz -lcairo -lgtk-3 -lgdk-3 -lcairo-gobject -lgdk_pixbuf-2.0 -lXi -lpci -lasound -lpulse -latspi -lxshmfence
[aarch64] PLEASE submit a bug report to https://bugs.llvm.org/ and include the crash backtrace.
[aarch64] LLVM ERROR: Failed to rename temporary file thinlto-cache/Thin-58b30f.tmp.o to thinlto-cache/llvmcache-C187BA57C55BEE644CE33EDDADA73C5C0C287E63: No such file or directory
[aarch64] clang-11: error: unable to execute command: Aborted
[aarch64] clang-11: error: linker command failed due to signal (use -v to see invocation)
[aarch64] ninja: build stopped: subcommand failed.
2021-Jun-03 18:24:06 :: [aarch64] chromium.git 91.0.4472.77-alt0.p9.1: remote: build failed
2021-Jun-03 18:24:06 :: [aarch64] #200 chromium.git 91.0.4472.77-alt0.p9.1: build FAILED
2021-Jun-03 18:24:06 :: [aarch64] requesting cancellation of task processing
2021-Jun-03 19:01:46 :: [i586] #200 chromium.git 91.0.4472.77-alt0.p9.1: build OK
2021-Jun-03 18:24:07 :: [aarch64] build FAILED
2021-Jun-03 19:01:46 :: task #271715 for p9 FAILED


^ permalink raw reply	[flat|nested] 3+ messages in thread

* [#271715] p9 EPERM (try 3) chromium.git=91.0.4472.101-alt0.p9.1
  2021-05-13  7:32 [#271715] [test-only] p9 FAILED chromium.git=90.0.4430.72-alt0.p9.1 Girar awaiter (cas)
  2021-06-03 19:01 ` [#271715] p9 FAILED (try 2) chromium.git=91.0.4472.77-alt0.p9.1 Girar awaiter (cas)
@ 2021-06-11  7:55 ` Girar awaiter (cas)
  1 sibling, 0 replies; 3+ messages in thread
From: Girar awaiter (cas) @ 2021-06-11  7:55 UTC (permalink / raw)
  To: Andrey Cherepanov; +Cc: sisyphus-incominger, girar-builder-p9

http://git.altlinux.org/tasks/271715/logs/events.3.1.log

subtask  name      aarch64  armh     i586  ppc64le   x86_64
   #300  chromium  3:46:37     -  4:02:01        -  3:13:39

2021-Jun-11 03:48:42 :: task #271715 for p9 resumed by cas:
2021-Jun-11 03:48:42 :: message: New_version_with_security_fixes
#100 removed
#200 removed
#300 build 91.0.4472.101-alt0.p9.1 from /people/cas/packages/chromium.git fetched at 2021-Jun-11 03:40:58
2021-Jun-11 03:48:44 :: [ppc64le] #300 chromium.git 91.0.4472.101-alt0.p9.1: build start
2021-Jun-11 03:48:44 :: [x86_64] #300 chromium.git 91.0.4472.101-alt0.p9.1: build start
2021-Jun-11 03:48:44 :: [i586] #300 chromium.git 91.0.4472.101-alt0.p9.1: build start
2021-Jun-11 03:48:44 :: [aarch64] #300 chromium.git 91.0.4472.101-alt0.p9.1: build start
2021-Jun-11 03:48:44 :: [armh] #300 chromium.git 91.0.4472.101-alt0.p9.1: build start
2021-Jun-11 03:49:02 :: [ppc64le] #300 chromium.git 91.0.4472.101-alt0.p9.1: build SKIPPED
2021-Jun-11 03:49:12 :: [armh] #300 chromium.git 91.0.4472.101-alt0.p9.1: build SKIPPED
2021-Jun-11 07:02:23 :: [x86_64] #300 chromium.git 91.0.4472.101-alt0.p9.1: build OK
2021-Jun-11 07:35:21 :: [aarch64] #300 chromium.git 91.0.4472.101-alt0.p9.1: build OK
2021-Jun-11 07:50:45 :: [i586] #300 chromium.git 91.0.4472.101-alt0.p9.1: build OK
2021-Jun-11 07:51:16 :: #300: chromium.git 91.0.4472.101-alt0.p9.1: build check OK
2021-Jun-11 07:51:16 :: build check OK
2021-Jun-11 07:51:40 :: noarch check OK
2021-Jun-11 07:51:42 :: plan: src +1 -1 =18199, aarch64 +2 -2 =30403, i586 +2 -2 =32395, x86_64 +2 -2 =32808
#300 chromium 89.0.4389.114-alt0.p9.1 -> 91.0.4472.101-alt0.p9.1
 Fri Jun 11 2021 Andrey Cherepanov <cas@altlinux> 91.0.4472.101-alt0.p9.1
 - Backport new version to p9 branch.
 - Disable thin_lto on aarch64.
 Thu Jun 10 2021 Alexey Gladkov <legion@altlinux.ru> 91.0.4472.101-alt1
 - New version (91.0.4472.101).
 - Security fixes:
   - CVE-2021-30544: Use after free in BFCache.
   - CVE-2021-30545: Use after free in Extensions.
   - CVE-2021-30546: Use after free in Autofill.
   - CVE-2021-30547: Out of bounds write in ANGLE.
 [...]
2021-Jun-11 07:51:43 :: chromium: mentions vulnerabilities: CVE-2021-30544 CVE-2021-30545 CVE-2021-30546 CVE-2021-30547 CVE-2021-30548 CVE-2021-30549 CVE-2021-30550 CVE-2021-30551 CVE-2021-30552 CVE-2021-30553 CVE-2021-21212 CVE-2021-30521 CVE-2021-30522 CVE-2021-30523 CVE-2021-30524 CVE-2021-30525 CVE-2021-30526 CVE-2021-30527 CVE-2021-30528 CVE-2021-30529 CVE-2021-30530 CVE-2021-30531 CVE-2021-30532 CVE-2021-30533 CVE-2021-30534 CVE-2021-30535 CVE-2021-30536 CVE-2021-30537 CVE-2021-30538 CVE-2021-30539 CVE-2021-30540 CVE-2021-21201 CVE-2021-21202 CVE-2021-21203 CVE-2021-21204 CVE-2021-21205 CVE-2021-21207 CVE-2021-21208 CVE-2021-21209 CVE-2021-21210 CVE-2021-21211 CVE-2021-21212 CVE-2021-21213 CVE-2021-21214 CVE-2021-21215 CVE-2021-21216 CVE-2021-21217 CVE-2021-21218 CVE-2021-21219 CVE-2021-21221
2021-Jun-11 07:52:19 :: patched apt indices
2021-Jun-11 07:52:29 :: created next repo
2021-Jun-11 07:52:38 :: duplicate provides check OK
2021-Jun-11 07:53:04 :: dependencies check OK
2021-Jun-11 07:53:30 :: [x86_64 i586 aarch64] ELF symbols check OK
	x86_64: chromium=91.0.4472.101-alt0.p9.1 post-install unowned files:
 /usr/share/icons/hicolor/128x128
 /usr/share/icons/hicolor/128x128/apps
 /usr/share/icons/hicolor/24x24
 /usr/share/icons/hicolor/24x24/apps
 /usr/share/icons/hicolor/256x256
 /usr/share/icons/hicolor/256x256/apps
 /usr/share/icons/hicolor/64x64
 /usr/share/icons/hicolor/64x64/apps
2021-Jun-11 07:54:00 :: [x86_64] #300 chromium: install check OK
	i586: chromium=91.0.4472.101-alt0.p9.1 post-install unowned files:
 /usr/share/icons/hicolor/128x128
 /usr/share/icons/hicolor/128x128/apps
 /usr/share/icons/hicolor/24x24
 /usr/share/icons/hicolor/24x24/apps
 /usr/share/icons/hicolor/256x256
 /usr/share/icons/hicolor/256x256/apps
 /usr/share/icons/hicolor/64x64
 /usr/share/icons/hicolor/64x64/apps
2021-Jun-11 07:54:01 :: [i586] #300 chromium: install check OK
2021-Jun-11 07:54:35 :: [x86_64] #300 chromium-debuginfo: install check OK
2021-Jun-11 07:54:39 :: [i586] #300 chromium-debuginfo: install check OK
2021-Jun-11 07:54:39 :: [x86_64-i586] plan: #1 +1 -1 =10751
2021-Jun-11 07:55:08 :: [x86_64-i586] arepo build OK
2021-Jun-11 07:55:21 :: [x86_64-i586] generated apt indices
2021-Jun-11 07:55:22 :: [x86_64-i586] created next repo
2021-Jun-11 07:55:30 :: [x86_64-i586] dependencies check OK
2021-Jun-11 07:55:30 :: gears inheritance check OK
2021-Jun-11 07:55:30 :: srpm inheritance check OK
girar-check-perms: access to @maint ALLOWED for cas: member of approved group
check-subtask-perms: #300: chromium: allowed for cas, needs an approval from a member of @tester group
2021-Jun-11 07:55:31 :: acl check FAILED
2021-Jun-11 07:55:39 :: created contents_index files
2021-Jun-11 07:55:49 :: created hash files: aarch64 i586 src x86_64-i586 x86_64
2021-Jun-11 07:55:52 :: task #271715 for p9 EPERM


^ permalink raw reply	[flat|nested] 3+ messages in thread

end of thread, other threads:[~2021-06-11  7:55 UTC | newest]

Thread overview: 3+ messages (download: mbox.gz / follow: Atom feed)
-- links below jump to the message on this page --
2021-05-13  7:32 [#271715] [test-only] p9 FAILED chromium.git=90.0.4430.72-alt0.p9.1 Girar awaiter (cas)
2021-06-03 19:01 ` [#271715] p9 FAILED (try 2) chromium.git=91.0.4472.77-alt0.p9.1 Girar awaiter (cas)
2021-06-11  7:55 ` [#271715] p9 EPERM (try 3) chromium.git=91.0.4472.101-alt0.p9.1 Girar awaiter (cas)

ALT Linux Girar Builder robot reports

This inbox may be cloned and mirrored by anyone:

	git clone --mirror http://lore.altlinux.org/sisyphus-incominger/0 sisyphus-incominger/git/0.git

	# If you have public-inbox 1.1+ installed, you may
	# initialize and index your mirror using the following commands:
	public-inbox-init -V2 sisyphus-incominger sisyphus-incominger/ http://lore.altlinux.org/sisyphus-incominger \
		sisyphus-incominger@lists.altlinux.org sisyphus-incominger@lists.altlinux.ru sisyphus-incominger@lists.altlinux.com
	public-inbox-index sisyphus-incominger

Example config snippet for mirrors.
Newsgroup available over NNTP:
	nntp://lore.altlinux.org/org.altlinux.lists.sisyphus-incominger


AGPL code for this site: git clone https://public-inbox.org/public-inbox.git