ALT Linux Girar Builder robot reports
 help / color / mirror / Atom feed
* [#271593] [test-only] FAILED kernel-image.git=kernel-image-un-def-5.12.0-alt1 ...
@ 2021-05-12 10:01 Girar awaiter (kernelbot)
  2021-05-14 12:09 ` [#271593] [test-only] FAILED (try 2) kernel-image.git=kernel-image-un-def-5.12.0-alt1 Girar awaiter (kernelbot)
                   ` (21 more replies)
  0 siblings, 22 replies; 23+ messages in thread
From: Girar awaiter (kernelbot) @ 2021-05-12 10:01 UTC (permalink / raw)
  To: Kernel Bot; +Cc: sisyphus-incominger, girar-builder-sisyphus

http://git.altlinux.org/tasks/271593/logs/events.1.1.log

subtask  name                             aarch64     armh     i586  ppc64le  x86_64
   #100  kernel-image                       38:29  1:14:18  1:00:52    55:59   48:35
   #200  kernel-modules-LiME-un-def            39        ?        ?        ?       ?
   #300  kernel-modules-accel-ppp-un-def       41        ?        ?        ?       ?
   #600  kernel-modules-drbd9-un-def       failed        ?        ?        ?       ?

2021-May-12 08:46:42 :: test-only task #271593 for sisyphus started by kernelbot:
#100 build kernel-image-un-def-5.12.0-alt1 from /people/kernelbot/packages/kernel-image.git fetched at 2021-May-12 07:24:42
#200 build sisyphus/kernel-modules-LiME-un-def-1.9.1-alt1 from /gears/k/kernel-modules-LiME-un-def.git fetched at 2021-May-12 08:19:00
#300 build sisyphus/kernel-modules-accel-ppp-un-def-1.12.0-alt2 from /gears/k/kernel-modules-accel-ppp-un-def.git fetched at 2021-May-12 08:19:02
#400 build sisyphus/kernel-modules-bcmwl-un-def-6.30.223.248-alt22 from /gears/k/kernel-modules-bcmwl-un-def.git fetched at 2021-May-12 08:19:08
#500 build sisyphus/kernel-modules-ch34x-un-def-20180821-alt1 from /gears/k/kernel-modules-ch34x-un-def.git fetched at 2021-May-12 08:19:09
#600 build sisyphus/kernel-modules-drbd9-un-def-9.1.1-alt2 from /gears/k/kernel-modules-drbd9-un-def.git fetched at 2021-May-12 08:19:10
#700 build sisyphus/kernel-modules-e1000e-un-def-3.8.7-alt1 from /gears/k/kernel-modules-e1000e-un-def.git fetched at 2021-May-12 08:19:11
#1000 build sisyphus/kernel-modules-hifc-un-def-3.5.0.11-alt1 from /gears/k/kernel-modules-hifc-un-def.git fetched at 2021-May-12 08:19:11
#1100 build sisyphus/kernel-modules-hinic-un-def-2.3.2.17-alt2 from /gears/k/kernel-modules-hinic-un-def.git fetched at 2021-May-12 08:19:12
#1200 build sisyphus/kernel-modules-ipset-un-def-7.11-alt1 from /gears/k/kernel-modules-ipset-un-def.git fetched at 2021-May-12 08:19:15
#1300 build sisyphus/kernel-modules-ipt-ratelimit-un-def-0.3.2-alt1 from /gears/k/kernel-modules-ipt-ratelimit-un-def.git fetched at 2021-May-12 08:19:19
#1400 build sisyphus/kernel-modules-ipt_netflow-un-def-2.5-alt1.k from /gears/k/kernel-modules-ipt_netflow-un-def.git fetched at 2021-May-12 08:19:22
#1500 build sisyphus/kernel-modules-ixgbe-un-def-5.11.3-alt1 from /gears/k/kernel-modules-ixgbe-un-def.git fetched at 2021-May-12 08:19:23
#1600 build sisyphus/kernel-modules-kvdo-un-def-6.2.4.26-alt1 from /gears/k/kernel-modules-kvdo-un-def.git fetched at 2021-May-12 08:19:24
#1700 build sisyphus/kernel-modules-linux-gpib-un-def-4.3.4-alt1 from /gears/k/kernel-modules-linux-gpib-un-def.git fetched at 2021-May-12 08:19:25
#2000 build sisyphus/kernel-modules-lkrg-un-def-0.9.1-alt2 from /gears/k/kernel-modules-lkrg-un-def.git fetched at 2021-May-12 08:19:27
#2100 build sisyphus/kernel-modules-nvidia-un-def-460.73.01-alt1 from /gears/k/kernel-modules-nvidia-un-def.git fetched at 2021-May-12 08:19:35
#2200 build sisyphus/kernel-modules-nxp-pn71xx-getmobit-un-def-1.4-alt1 from /gears/k/kernel-modules-nxp-pn71xx-getmobit-un-def.git fetched at 2021-May-12 08:19:37
#2300 build sisyphus/kernel-modules-r8125-un-def-9.003.05-alt1 from /gears/k/kernel-modules-r8125-un-def.git fetched at 2021-May-12 08:19:37
#2400 build sisyphus/kernel-modules-r8168-un-def-8.048.03-alt1.k from /gears/k/kernel-modules-r8168-un-def.git fetched at 2021-May-12 08:19:42
#2500 build sisyphus/kernel-modules-rtl8188fu-un-def-1.0-alt1 from /gears/k/kernel-modules-rtl8188fu-un-def.git fetched at 2021-May-12 08:19:43
#2600 build sisyphus/kernel-modules-rtl8192eu-un-def-5.2.19.1-alt1 from /gears/k/kernel-modules-rtl8192eu-un-def.git fetched at 2021-May-12 08:19:44
#2700 build sisyphus/kernel-modules-rtl8192fu-un-def-5.8.6.2-alt1 from /gears/k/kernel-modules-rtl8192fu-un-def.git fetched at 2021-May-12 08:19:44
#3000 build sisyphus/kernel-modules-rtl8723bu-un-def-4.3.6.11-alt1 from /gears/k/kernel-modules-rtl8723bu-un-def.git fetched at 2021-May-12 08:19:45
#3100 build sisyphus/kernel-modules-rtl8812au-un-def-7502.20210405-alt1 from /gears/k/kernel-modules-rtl8812au-un-def.git fetched at 2021-May-12 08:19:46
#3200 build sisyphus/kernel-modules-rtl8821ce-un-def-5.5.2-alt1 from /gears/k/kernel-modules-rtl8821ce-un-def.git fetched at 2021-May-12 08:19:47
#3300 build sisyphus/kernel-modules-rtl8821cu-un-def-5.4.1-alt3 from /gears/k/kernel-modules-rtl8821cu-un-def.git fetched at 2021-May-12 08:19:48
#3400 build sisyphus/kernel-modules-usb-vhci-un-def-1.15-alt3 from /gears/k/kernel-modules-usb-vhci-un-def.git fetched at 2021-May-12 08:19:49
#3500 build sisyphus/kernel-modules-v4l2loopback-un-def-0.12.5-alt1 from /gears/k/kernel-modules-v4l2loopback-un-def.git fetched at 2021-May-12 08:19:49
#3600 build sisyphus/kernel-modules-vhba-un-def-20200106-alt1.k from /gears/k/kernel-modules-vhba-un-def.git fetched at 2021-May-12 08:19:54
#3700 build sisyphus/kernel-modules-virtualbox-addition-un-def-6.1.20-alt1 from /gears/k/kernel-modules-virtualbox-addition-un-def.git fetched at 2021-May-12 08:20:00
#4000 build sisyphus/kernel-modules-virtualbox-un-def-6.1.20-alt1 from /gears/k/kernel-modules-virtualbox-un-def.git fetched at 2021-May-12 08:20:06
#4100 build sisyphus/kernel-modules-xtables-addons-un-def-3.18-alt1 from /gears/k/kernel-modules-xtables-addons-un-def.git fetched at 2021-May-12 08:20:09
#4200 build sisyphus/kernel-modules-zfs-un-def-2.0.4-alt1 from /gears/k/kernel-modules-zfs-un-def.git fetched at 2021-May-12 08:20:12
2021-May-12 08:46:43 :: created build repo
2021-May-12 08:46:43 :: [i586] #100 kernel-image.git kernel-image-un-def-5.12.0-alt1: build start
2021-May-12 08:46:43 :: [x86_64] #100 kernel-image.git kernel-image-un-def-5.12.0-alt1: build start
2021-May-12 08:46:43 :: [armh] #100 kernel-image.git kernel-image-un-def-5.12.0-alt1: build start
2021-May-12 08:46:43 :: [aarch64] #100 kernel-image.git kernel-image-un-def-5.12.0-alt1: build start
2021-May-12 08:46:43 :: [ppc64le] #100 kernel-image.git kernel-image-un-def-5.12.0-alt1: build start
2021-May-12 09:25:12 :: [aarch64] #100 kernel-image.git kernel-image-un-def-5.12.0-alt1: build OK
2021-May-12 09:25:12 :: [aarch64] #200 kernel-modules-LiME-un-def.git sisyphus/kernel-modules-LiME-un-def-1.9.1-alt1: build start
2021-May-12 09:25:51 :: [aarch64] #200 kernel-modules-LiME-un-def.git sisyphus/kernel-modules-LiME-un-def-1.9.1-alt1: build OK
2021-May-12 09:25:52 :: [aarch64] #300 kernel-modules-accel-ppp-un-def.git sisyphus/kernel-modules-accel-ppp-un-def-1.12.0-alt2: build start
2021-May-12 09:26:33 :: [aarch64] #300 kernel-modules-accel-ppp-un-def.git sisyphus/kernel-modules-accel-ppp-un-def-1.12.0-alt2: build OK
2021-May-12 09:26:33 :: [aarch64] #400 kernel-modules-bcmwl-un-def.git sisyphus/kernel-modules-bcmwl-un-def-6.30.223.248-alt22: build start
2021-May-12 09:26:52 :: [aarch64] #400 kernel-modules-bcmwl-un-def.git sisyphus/kernel-modules-bcmwl-un-def-6.30.223.248-alt22: build SKIPPED
2021-May-12 09:26:52 :: [aarch64] #500 kernel-modules-ch34x-un-def.git sisyphus/kernel-modules-ch34x-un-def-20180821-alt1: build start
2021-May-12 09:27:12 :: [aarch64] #500 kernel-modules-ch34x-un-def.git sisyphus/kernel-modules-ch34x-un-def-20180821-alt1: build SKIPPED
2021-May-12 09:27:12 :: [aarch64] #600 kernel-modules-drbd9-un-def.git sisyphus/kernel-modules-drbd9-un-def-9.1.1-alt2: build start
[aarch64]     KDIR=/lib/modules/*/build
[aarch64] touch: cannot touch 'drbd-kernel-compat/cocci_cache/*/compat.patch': No such file or directory
[aarch64] make: [Makefile:212: fix-tar-timestamps] Error 1 (ignored)
[aarch64] --
[aarch64]  1780 | #if DRBD_MAX_BIO_SIZE > (BIO_MAX_PAGES << PAGE_SHIFT)
[aarch64] /usr/src/RPM/BUILD/drbd9-9.1.1/drbd/drbd_int.h:1781:2: error: #error Architecture not supported: DRBD_MAX_BIO_SIZE > (BIO_MAX_PAGES << PAGE_SHIFT)
[aarch64]  1781 | #error Architecture not supported: DRBD_MAX_BIO_SIZE > (BIO_MAX_PAGES << PAGE_SHIFT)
2021-May-12 09:28:29 :: [aarch64] kernel-modules-drbd9-un-def.git sisyphus/kernel-modules-drbd9-un-def-9.1.1-alt2: remote: build failed
2021-May-12 09:28:29 :: [aarch64] #600 kernel-modules-drbd9-un-def.git sisyphus/kernel-modules-drbd9-un-def-9.1.1-alt2: build FAILED
2021-May-12 09:28:29 :: [aarch64] requesting cancellation of task processing
2021-May-12 09:35:09 :: [x86_64] #100: pesigning not attempted
2021-May-12 09:35:18 :: [x86_64] #100 kernel-image.git kernel-image-un-def-5.12.0-alt1: build OK
2021-May-12 09:35:18 :: [x86_64] task processing CANCELLED
2021-May-12 09:42:42 :: [ppc64le] #100 kernel-image.git kernel-image-un-def-5.12.0-alt1: build OK
2021-May-12 09:42:42 :: [ppc64le] task processing CANCELLED
2021-May-12 09:47:35 :: [i586] #100 kernel-image.git kernel-image-un-def-5.12.0-alt1: build OK
2021-May-12 09:47:35 :: [i586] task processing CANCELLED
2021-May-12 10:01:01 :: [armh] #100 kernel-image.git kernel-image-un-def-5.12.0-alt1: build OK
2021-May-12 10:01:01 :: [armh] task processing CANCELLED
2021-May-12 09:28:29 :: [aarch64] build FAILED
2021-May-12 09:35:18 :: [x86_64] build FAILED
2021-May-12 09:42:42 :: [ppc64le] build FAILED
2021-May-12 09:47:35 :: [i586] build FAILED
2021-May-12 10:01:01 :: [armh] build FAILED
2021-May-12 10:01:01 :: task #271593 for sisyphus FAILED


^ permalink raw reply	[flat|nested] 23+ messages in thread