ALT Linux Girar Builder robot reports
 help / color / mirror / Atom feed
From: "Girar awaiter (kernelbot)" <girar-builder@altlinux.org>
To: Kernel Bot <kernelbot@altlinux.org>
Cc: girar-builder-p10@altlinux.org,
	sisyphus-incominger@lists.altlinux.org,
	girar-builder-p10@lists.altlinux.org
Subject: [#435322] p10 FAILED kernel-image.git=kernel-image-un-def-6.1.189-alt1 ...
Date: Sat, 3 Oct 2026 13:40:24 +0000
Message-ID: <girar.task.435322.1.1@gyle.mskdc.altlinux.org> (raw)

https://git.altlinux.org/tasks/435322/logs/events.1.1.log
https://packages.altlinux.org/tasks/435322

subtask  name                                  aarch64   armh    i586  x86_64
   #100  kernel-image                            29:48  57:33   33:32   32:18
   #200  kernel-modules-LiME-un-def                 45   1:04      29      30
   #300  kernel-modules-accel-ppp-un-def            47      -      30      31
   #400  kernel-modules-anbox-un-def                46   1:05      29      29
   #500  kernel-modules-bcmwl-un-def                 -      -       -      33
   #600  kernel-modules-dm-secdel-un-def          1:14   2:07      54      55
   #700  kernel-modules-drbd9-un-def              3:48      -       -    2:06
  #1000  kernel-modules-evdi-un-def                 43   1:04      28      29
  #1100  kernel-modules-i40e-un-def                 53      -       -      35
  #1200  kernel-modules-iavf-un-def                 45      -       -      30
  #1300  kernel-modules-ipt-ratelimit-un-def        42   1:02      28      28
  #1400  kernel-modules-ipt_netflow-un-def          53      -      33      34
  #1500  kernel-modules-ixgbe-un-def                54      -       -      36
  #1600  kernel-modules-lkrg-un-def                  -      -      53      54
  #1700  kernel-modules-nvidia-un-def             2:06      -    1:11    2:07
  #2000  kernel-modules-r8125-un-def                 -      -      33      35
  #2100  kernel-modules-r8168-un-def              1:21   1:48      40      41
  #2200  kernel-modules-rtl8188eu-un-def             -      -  failed  failed
  #2700  kernel-modules-rtl88x2bu-un-def        failed      -       ?       ?
  #3000  kernel-modules-rtw89-un-def                 ?   1:16       ?       ?
  #3200  kernel-modules-v4l2loopback-un-def          ?   1:00       ?       ?
  #3300  kernel-modules-vhba-un-def                  ?   1:00       ?       ?
  #3600  kernel-modules-xtables-addons-un-def        ?   1:49       ?       ?
  #3700  kernel-modules-zfs-un-def                   ?   8:04       ?       ?

2026-Oct-03 12:09:39 :: task #435322 for p10 started by kernelbot:
2026-Oct-03 12:09:39 :: message: v6.1.189
#100 build kernel-image-un-def-6.1.189-alt1 from /people/kernelbot/packages/kernel-image.git fetched at 2026-Oct-03 12:07:12
#200 build sisyphus/kernel-modules-LiME-un-def-1.9.1-alt1 from /gears/k/kernel-modules-LiME-un-def.git fetched at 2026-Oct-03 12:07:17 from p10
#300 build sisyphus/kernel-modules-accel-ppp-un-def-1.12.0-alt3 from /gears/k/kernel-modules-accel-ppp-un-def.git fetched at 2026-Oct-03 12:07:22 from p10
#400 build sisyphus/kernel-modules-anbox-un-def-14-alt2.gae26ba2 from /gears/k/kernel-modules-anbox-un-def.git fetched at 2026-Oct-03 12:07:23 from p10
#500 build sisyphus/kernel-modules-bcmwl-un-def-6.30.223.271-alt15 from /gears/k/kernel-modules-bcmwl-un-def.git fetched at 2026-Oct-03 12:07:32 from p10
#600 build sisyphus/kernel-modules-dm-secdel-un-def-1.0.9-alt1 from /gears/k/kernel-modules-dm-secdel-un-def.git fetched at 2026-Oct-03 12:07:33 from p10
#700 build sisyphus/kernel-modules-drbd9-un-def-9.2.12-alt1 from /gears/k/kernel-modules-drbd9-un-def.git fetched at 2026-Oct-03 12:07:37 from p10
#1000 build sisyphus/kernel-modules-evdi-un-def-1.14.1-alt1 from /gears/k/kernel-modules-evdi-un-def.git fetched at 2026-Oct-03 12:07:39 from p10
#1100 build sisyphus/kernel-modules-i40e-un-def-2.22.20-alt1 from /gears/k/kernel-modules-i40e-un-def.git fetched at 2026-Oct-03 12:07:40 from p10
#1200 build sisyphus/kernel-modules-iavf-un-def-4.8.3-alt1 from /gears/k/kernel-modules-iavf-un-def.git fetched at 2026-Oct-03 12:07:41 from p10
#1300 build sisyphus/kernel-modules-ipt-ratelimit-un-def-0.3.3-alt1 from /gears/k/kernel-modules-ipt-ratelimit-un-def.git fetched at 2026-Oct-03 12:07:48 from p10
#1400 build sisyphus/kernel-modules-ipt_netflow-un-def-2.6-alt1 from /gears/k/kernel-modules-ipt_netflow-un-def.git fetched at 2026-Oct-03 12:07:54 from p10
#1500 build sisyphus/kernel-modules-ixgbe-un-def-5.20.10-alt1 from /gears/k/kernel-modules-ixgbe-un-def.git fetched at 2026-Oct-03 12:07:57 from p10
#1600 build sisyphus/kernel-modules-lkrg-un-def-0.9.8-alt3 from /gears/k/kernel-modules-lkrg-un-def.git fetched at 2026-Oct-03 12:08:01 from p10
#1700 build sisyphus/kernel-modules-nvidia-un-def-550.144.03-alt1 from /gears/k/kernel-modules-nvidia-un-def.git fetched at 2026-Oct-03 12:08:15 from p10
#2000 build sisyphus/kernel-modules-r8125-un-def-9.011.01-alt1 from /gears/k/kernel-modules-r8125-un-def.git fetched at 2026-Oct-03 12:08:18 from p10
#2100 build sisyphus/kernel-modules-r8168-un-def-8.053.01-alt1.k from /gears/k/kernel-modules-r8168-un-def.git fetched at 2026-Oct-03 12:08:26 from p10
#2200 build sisyphus/kernel-modules-rtl8188eu-un-def-5.13.3-alt2 from /gears/k/kernel-modules-rtl8188eu-un-def.git fetched at 2026-Oct-03 12:08:28 from p10
#2300 build sisyphus/kernel-modules-rtl8192eu-un-def-5.11.2.1-alt1 from /gears/k/kernel-modules-rtl8192eu-un-def.git fetched at 2026-Oct-03 12:08:30 from p10
#2400 build sisyphus/kernel-modules-rtl8723du-un-def-5.13.4-alt1 from /gears/k/kernel-modules-rtl8723du-un-def.git fetched at 2026-Oct-03 12:08:31 from p10
#2500 build sisyphus/kernel-modules-rtl8812au-un-def-5.6.4.2-alt1 from /gears/k/kernel-modules-rtl8812au-un-def.git fetched at 2026-Oct-03 12:08:33 from p10
#2600 build sisyphus/kernel-modules-rtl8821cu-un-def-5.12.0.4-alt1 from /gears/k/kernel-modules-rtl8821cu-un-def.git fetched at 2026-Oct-03 12:08:36 from p10
#2700 build sisyphus/kernel-modules-rtl88x2bu-un-def-5.8.7.1-alt5 from /gears/k/kernel-modules-rtl88x2bu-un-def.git fetched at 2026-Oct-03 12:08:37 from p10
#3000 build sisyphus/kernel-modules-rtw89-un-def-0.0-alt4.git.4f3464d from /gears/k/kernel-modules-rtw89-un-def.git fetched at 2026-Oct-03 12:08:40 from p10
#3100 build sisyphus/kernel-modules-sysdig-un-def-7.3.0-alt1 from /gears/k/kernel-modules-sysdig-un-def.git fetched at 2026-Oct-03 12:08:41 from p10
#3200 build sisyphus/kernel-modules-v4l2loopback-un-def-0.12.7-alt1.g5e9dd41 from /gears/k/kernel-modules-v4l2loopback-un-def.git fetched at 2026-Oct-03 12:08:44 from p10
#3300 build sisyphus/kernel-modules-vhba-un-def-20211218-alt1.k from /gears/k/kernel-modules-vhba-un-def.git fetched at 2026-Oct-03 12:08:51 from p10
#3400 build sisyphus/kernel-modules-virtualbox-addition-p10-un-def-7.1.16-alt1 from /gears/k/kernel-modules-virtualbox-addition-un-def.git fetched at 2026-Oct-03 12:09:02 from p10
#3500 build sisyphus/kernel-modules-virtualbox-p10-un-def-7.1.16-alt1 from /gears/k/kernel-modules-virtualbox-un-def.git fetched at 2026-Oct-03 12:09:13 from p10
#3600 build sisyphus/kernel-modules-xtables-addons-un-def-3.23-alt1 from /gears/k/kernel-modules-xtables-addons-un-def.git fetched at 2026-Oct-03 12:09:21 from p10
#3700 build p10/kernel-modules-zfs-un-def-2.1.16-alt1 from /gears/k/kernel-modules-zfs-un-def.git fetched at 2026-Oct-03 12:09:27 from p10
2026-Oct-03 12:09:40 :: created build repo
2026-Oct-03 12:09:41 :: [armh] #100 kernel-image.git kernel-image-un-def-6.1.189-alt1: build start
2026-Oct-03 12:09:41 :: [aarch64] #100 kernel-image.git kernel-image-un-def-6.1.189-alt1: build start
2026-Oct-03 12:09:41 :: [x86_64] #100 kernel-image.git kernel-image-un-def-6.1.189-alt1: build start
2026-Oct-03 12:09:41 :: [i586] #100 kernel-image.git kernel-image-un-def-6.1.189-alt1: build start
2026-Oct-03 12:39:29 :: [aarch64] #100 kernel-image.git kernel-image-un-def-6.1.189-alt1: build OK
2026-Oct-03 12:39:29 :: [aarch64] #200 kernel-modules-LiME-un-def.git sisyphus/kernel-modules-LiME-un-def-1.9.1-alt1: build start
2026-Oct-03 12:40:07 :: [x86_64] #100: pesigning approved by kernelbot
2026-Oct-03 12:40:14 :: [aarch64] #200 kernel-modules-LiME-un-def.git sisyphus/kernel-modules-LiME-un-def-1.9.1-alt1: build OK
2026-Oct-03 12:40:14 :: [aarch64] #300 kernel-modules-accel-ppp-un-def.git sisyphus/kernel-modules-accel-ppp-un-def-1.12.0-alt3: build start
2026-Oct-03 12:41:01 :: [aarch64] #300 kernel-modules-accel-ppp-un-def.git sisyphus/kernel-modules-accel-ppp-un-def-1.12.0-alt3: build OK
2026-Oct-03 12:41:01 :: [aarch64] #400 kernel-modules-anbox-un-def.git sisyphus/kernel-modules-anbox-un-def-14-alt2.gae26ba2: build start
2026-Oct-03 12:41:44 :: [x86_64] #100: kernel-image-un-def: pesign OK
2026-Oct-03 12:41:47 :: [aarch64] #400 kernel-modules-anbox-un-def.git sisyphus/kernel-modules-anbox-un-def-14-alt2.gae26ba2: build OK
2026-Oct-03 12:41:47 :: [aarch64] #500 kernel-modules-bcmwl-un-def.git sisyphus/kernel-modules-bcmwl-un-def-6.30.223.271-alt15: build start
2026-Oct-03 12:41:59 :: [x86_64] #100 kernel-image.git kernel-image-un-def-6.1.189-alt1: build OK
2026-Oct-03 12:41:59 :: [x86_64] #200 kernel-modules-LiME-un-def.git sisyphus/kernel-modules-LiME-un-def-1.9.1-alt1: build start
2026-Oct-03 12:42:10 :: [aarch64] #500 kernel-modules-bcmwl-un-def.git sisyphus/kernel-modules-bcmwl-un-def-6.30.223.271-alt15: build SKIPPED
2026-Oct-03 12:42:11 :: [aarch64] #600 kernel-modules-dm-secdel-un-def.git sisyphus/kernel-modules-dm-secdel-un-def-1.0.9-alt1: build start
2026-Oct-03 12:42:29 :: [x86_64] #200 kernel-modules-LiME-un-def.git sisyphus/kernel-modules-LiME-un-def-1.9.1-alt1: build OK
2026-Oct-03 12:42:30 :: [x86_64] #300 kernel-modules-accel-ppp-un-def.git sisyphus/kernel-modules-accel-ppp-un-def-1.12.0-alt3: build start
2026-Oct-03 12:43:01 :: [x86_64] #300 kernel-modules-accel-ppp-un-def.git sisyphus/kernel-modules-accel-ppp-un-def-1.12.0-alt3: build OK
2026-Oct-03 12:43:01 :: [x86_64] #400 kernel-modules-anbox-un-def.git sisyphus/kernel-modules-anbox-un-def-14-alt2.gae26ba2: build start
2026-Oct-03 12:43:13 :: [i586] #100 kernel-image.git kernel-image-un-def-6.1.189-alt1: build OK
2026-Oct-03 12:43:14 :: [i586] #200 kernel-modules-LiME-un-def.git sisyphus/kernel-modules-LiME-un-def-1.9.1-alt1: build start
2026-Oct-03 12:43:25 :: [aarch64] #600 kernel-modules-dm-secdel-un-def.git sisyphus/kernel-modules-dm-secdel-un-def-1.0.9-alt1: build OK
2026-Oct-03 12:43:25 :: [aarch64] #700 kernel-modules-drbd9-un-def.git sisyphus/kernel-modules-drbd9-un-def-9.2.12-alt1: build start
2026-Oct-03 12:43:30 :: [x86_64] #400 kernel-modules-anbox-un-def.git sisyphus/kernel-modules-anbox-un-def-14-alt2.gae26ba2: build OK
2026-Oct-03 12:43:30 :: [x86_64] #500 kernel-modules-bcmwl-un-def.git sisyphus/kernel-modules-bcmwl-un-def-6.30.223.271-alt15: build start
2026-Oct-03 12:43:43 :: [i586] #200 kernel-modules-LiME-un-def.git sisyphus/kernel-modules-LiME-un-def-1.9.1-alt1: build OK
2026-Oct-03 12:43:44 :: [i586] #300 kernel-modules-accel-ppp-un-def.git sisyphus/kernel-modules-accel-ppp-un-def-1.12.0-alt3: build start
2026-Oct-03 12:44:03 :: [x86_64] #500 kernel-modules-bcmwl-un-def.git sisyphus/kernel-modules-bcmwl-un-def-6.30.223.271-alt15: build OK
2026-Oct-03 12:44:03 :: [x86_64] #600 kernel-modules-dm-secdel-un-def.git sisyphus/kernel-modules-dm-secdel-un-def-1.0.9-alt1: build start
2026-Oct-03 12:44:14 :: [i586] #300 kernel-modules-accel-ppp-un-def.git sisyphus/kernel-modules-accel-ppp-un-def-1.12.0-alt3: build OK
2026-Oct-03 12:44:14 :: [i586] #400 kernel-modules-anbox-un-def.git sisyphus/kernel-modules-anbox-un-def-14-alt2.gae26ba2: build start
2026-Oct-03 12:44:43 :: [i586] #400 kernel-modules-anbox-un-def.git sisyphus/kernel-modules-anbox-un-def-14-alt2.gae26ba2: build OK
2026-Oct-03 12:44:43 :: [i586] #500 kernel-modules-bcmwl-un-def.git sisyphus/kernel-modules-bcmwl-un-def-6.30.223.271-alt15: build start
2026-Oct-03 12:44:57 :: [i586] #500 kernel-modules-bcmwl-un-def.git sisyphus/kernel-modules-bcmwl-un-def-6.30.223.271-alt15: build SKIPPED
2026-Oct-03 12:44:57 :: [i586] #600 kernel-modules-dm-secdel-un-def.git sisyphus/kernel-modules-dm-secdel-un-def-1.0.9-alt1: build start
2026-Oct-03 12:44:58 :: [x86_64] #600 kernel-modules-dm-secdel-un-def.git sisyphus/kernel-modules-dm-secdel-un-def-1.0.9-alt1: build OK
2026-Oct-03 12:44:59 :: [x86_64] #700 kernel-modules-drbd9-un-def.git sisyphus/kernel-modules-drbd9-un-def-9.2.12-alt1: build start
2026-Oct-03 12:45:51 :: [i586] #600 kernel-modules-dm-secdel-un-def.git sisyphus/kernel-modules-dm-secdel-un-def-1.0.9-alt1: build OK
2026-Oct-03 12:45:51 :: [i586] #700 kernel-modules-drbd9-un-def.git sisyphus/kernel-modules-drbd9-un-def-9.2.12-alt1: build start
2026-Oct-03 12:46:05 :: [i586] #700 kernel-modules-drbd9-un-def.git sisyphus/kernel-modules-drbd9-un-def-9.2.12-alt1: build SKIPPED
2026-Oct-03 12:46:06 :: [i586] #1000 kernel-modules-evdi-un-def.git sisyphus/kernel-modules-evdi-un-def-1.14.1-alt1: build start
2026-Oct-03 12:46:34 :: [i586] #1000 kernel-modules-evdi-un-def.git sisyphus/kernel-modules-evdi-un-def-1.14.1-alt1: build OK
2026-Oct-03 12:46:35 :: [i586] #1100 kernel-modules-i40e-un-def.git sisyphus/kernel-modules-i40e-un-def-2.22.20-alt1: build start
2026-Oct-03 12:46:49 :: [i586] #1100 kernel-modules-i40e-un-def.git sisyphus/kernel-modules-i40e-un-def-2.22.20-alt1: build SKIPPED
2026-Oct-03 12:46:49 :: [i586] #1200 kernel-modules-iavf-un-def.git sisyphus/kernel-modules-iavf-un-def-4.8.3-alt1: build start
2026-Oct-03 12:47:03 :: [i586] #1200 kernel-modules-iavf-un-def.git sisyphus/kernel-modules-iavf-un-def-4.8.3-alt1: build SKIPPED
2026-Oct-03 12:47:04 :: [i586] #1300 kernel-modules-ipt-ratelimit-un-def.git sisyphus/kernel-modules-ipt-ratelimit-un-def-0.3.3-alt1: build start
2026-Oct-03 12:47:05 :: [x86_64] #700 kernel-modules-drbd9-un-def.git sisyphus/kernel-modules-drbd9-un-def-9.2.12-alt1: build OK
2026-Oct-03 12:47:05 :: [x86_64] #1000 kernel-modules-evdi-un-def.git sisyphus/kernel-modules-evdi-un-def-1.14.1-alt1: build start
2026-Oct-03 12:47:13 :: [aarch64] #700 kernel-modules-drbd9-un-def.git sisyphus/kernel-modules-drbd9-un-def-9.2.12-alt1: build OK
2026-Oct-03 12:47:13 :: [aarch64] #1000 kernel-modules-evdi-un-def.git sisyphus/kernel-modules-evdi-un-def-1.14.1-alt1: build start
2026-Oct-03 12:47:32 :: [i586] #1300 kernel-modules-ipt-ratelimit-un-def.git sisyphus/kernel-modules-ipt-ratelimit-un-def-0.3.3-alt1: build OK
2026-Oct-03 12:47:33 :: [i586] #1400 kernel-modules-ipt_netflow-un-def.git sisyphus/kernel-modules-ipt_netflow-un-def-2.6-alt1: build start
2026-Oct-03 12:47:34 :: [x86_64] #1000 kernel-modules-evdi-un-def.git sisyphus/kernel-modules-evdi-un-def-1.14.1-alt1: build OK
2026-Oct-03 12:47:34 :: [x86_64] #1100 kernel-modules-i40e-un-def.git sisyphus/kernel-modules-i40e-un-def-2.22.20-alt1: build start
2026-Oct-03 12:47:56 :: [aarch64] #1000 kernel-modules-evdi-un-def.git sisyphus/kernel-modules-evdi-un-def-1.14.1-alt1: build OK
2026-Oct-03 12:47:56 :: [aarch64] #1100 kernel-modules-i40e-un-def.git sisyphus/kernel-modules-i40e-un-def-2.22.20-alt1: build start
2026-Oct-03 12:48:06 :: [i586] #1400 kernel-modules-ipt_netflow-un-def.git sisyphus/kernel-modules-ipt_netflow-un-def-2.6-alt1: build OK
2026-Oct-03 12:48:06 :: [i586] #1500 kernel-modules-ixgbe-un-def.git sisyphus/kernel-modules-ixgbe-un-def-5.20.10-alt1: build start
2026-Oct-03 12:48:09 :: [x86_64] #1100 kernel-modules-i40e-un-def.git sisyphus/kernel-modules-i40e-un-def-2.22.20-alt1: build OK
2026-Oct-03 12:48:09 :: [x86_64] #1200 kernel-modules-iavf-un-def.git sisyphus/kernel-modules-iavf-un-def-4.8.3-alt1: build start
2026-Oct-03 12:48:20 :: [i586] #1500 kernel-modules-ixgbe-un-def.git sisyphus/kernel-modules-ixgbe-un-def-5.20.10-alt1: build SKIPPED
2026-Oct-03 12:48:20 :: [i586] #1600 kernel-modules-lkrg-un-def.git sisyphus/kernel-modules-lkrg-un-def-0.9.8-alt3: build start
2026-Oct-03 12:48:39 :: [x86_64] #1200 kernel-modules-iavf-un-def.git sisyphus/kernel-modules-iavf-un-def-4.8.3-alt1: build OK
2026-Oct-03 12:48:40 :: [x86_64] #1300 kernel-modules-ipt-ratelimit-un-def.git sisyphus/kernel-modules-ipt-ratelimit-un-def-0.3.3-alt1: build start
2026-Oct-03 12:48:49 :: [aarch64] #1100 kernel-modules-i40e-un-def.git sisyphus/kernel-modules-i40e-un-def-2.22.20-alt1: build OK
2026-Oct-03 12:48:50 :: [aarch64] #1200 kernel-modules-iavf-un-def.git sisyphus/kernel-modules-iavf-un-def-4.8.3-alt1: build start
2026-Oct-03 12:49:08 :: [x86_64] #1300 kernel-modules-ipt-ratelimit-un-def.git sisyphus/kernel-modules-ipt-ratelimit-un-def-0.3.3-alt1: build OK
2026-Oct-03 12:49:08 :: [x86_64] #1400 kernel-modules-ipt_netflow-un-def.git sisyphus/kernel-modules-ipt_netflow-un-def-2.6-alt1: build start
2026-Oct-03 12:49:13 :: [i586] #1600 kernel-modules-lkrg-un-def.git sisyphus/kernel-modules-lkrg-un-def-0.9.8-alt3: build OK
2026-Oct-03 12:49:13 :: [i586] #1700 kernel-modules-nvidia-un-def.git sisyphus/kernel-modules-nvidia-un-def-550.144.03-alt1: build start
2026-Oct-03 12:49:35 :: [aarch64] #1200 kernel-modules-iavf-un-def.git sisyphus/kernel-modules-iavf-un-def-4.8.3-alt1: build OK
2026-Oct-03 12:49:36 :: [aarch64] #1300 kernel-modules-ipt-ratelimit-un-def.git sisyphus/kernel-modules-ipt-ratelimit-un-def-0.3.3-alt1: build start
2026-Oct-03 12:49:42 :: [x86_64] #1400 kernel-modules-ipt_netflow-un-def.git sisyphus/kernel-modules-ipt_netflow-un-def-2.6-alt1: build OK
2026-Oct-03 12:49:42 :: [x86_64] #1500 kernel-modules-ixgbe-un-def.git sisyphus/kernel-modules-ixgbe-un-def-5.20.10-alt1: build start
2026-Oct-03 12:50:18 :: [x86_64] #1500 kernel-modules-ixgbe-un-def.git sisyphus/kernel-modules-ixgbe-un-def-5.20.10-alt1: build OK
2026-Oct-03 12:50:18 :: [aarch64] #1300 kernel-modules-ipt-ratelimit-un-def.git sisyphus/kernel-modules-ipt-ratelimit-un-def-0.3.3-alt1: build OK
2026-Oct-03 12:50:18 :: [x86_64] #1600 kernel-modules-lkrg-un-def.git sisyphus/kernel-modules-lkrg-un-def-0.9.8-alt3: build start
2026-Oct-03 12:50:18 :: [aarch64] #1400 kernel-modules-ipt_netflow-un-def.git sisyphus/kernel-modules-ipt_netflow-un-def-2.6-alt1: build start
2026-Oct-03 12:50:24 :: [i586] #1700 kernel-modules-nvidia-un-def.git sisyphus/kernel-modules-nvidia-un-def-550.144.03-alt1: build OK
2026-Oct-03 12:50:25 :: [i586] #2000 kernel-modules-r8125-un-def.git sisyphus/kernel-modules-r8125-un-def-9.011.01-alt1: build start
2026-Oct-03 12:50:58 :: [i586] #2000 kernel-modules-r8125-un-def.git sisyphus/kernel-modules-r8125-un-def-9.011.01-alt1: build OK
2026-Oct-03 12:50:59 :: [i586] #2100 kernel-modules-r8168-un-def.git sisyphus/kernel-modules-r8168-un-def-8.053.01-alt1.k: build start
2026-Oct-03 12:51:11 :: [aarch64] #1400 kernel-modules-ipt_netflow-un-def.git sisyphus/kernel-modules-ipt_netflow-un-def-2.6-alt1: build OK
2026-Oct-03 12:51:12 :: [aarch64] #1500 kernel-modules-ixgbe-un-def.git sisyphus/kernel-modules-ixgbe-un-def-5.20.10-alt1: build start
2026-Oct-03 12:51:12 :: [x86_64] #1600 kernel-modules-lkrg-un-def.git sisyphus/kernel-modules-lkrg-un-def-0.9.8-alt3: build OK
2026-Oct-03 12:51:13 :: [x86_64] #1700 kernel-modules-nvidia-un-def.git sisyphus/kernel-modules-nvidia-un-def-550.144.03-alt1: build start
2026-Oct-03 12:51:39 :: [i586] #2100 kernel-modules-r8168-un-def.git sisyphus/kernel-modules-r8168-un-def-8.053.01-alt1.k: build OK
2026-Oct-03 12:51:39 :: [i586] #2200 kernel-modules-rtl8188eu-un-def.git sisyphus/kernel-modules-rtl8188eu-un-def-5.13.3-alt2: build start
[i586]   CC [M]  /usr/src/RPM/BUILD/kernel-source-rtl8188eu-5.13.3/os_dep/linux/usb_intf.o
[i586] /usr/src/RPM/BUILD/kernel-source-rtl8188eu-5.13.3/os_dep/linux/usb_intf.c:351:10: error: 'struct usb_driver' has no member named 'drvwrap'
[i586]   351 |  .usbdrv.drvwrap.driver.shutdown = rtw_dev_shutdown,
2026-Oct-03 12:52:04 :: [i586] kernel-modules-rtl8188eu-un-def.git sisyphus/kernel-modules-rtl8188eu-un-def-5.13.3-alt2: remote: build failed
2026-Oct-03 12:52:04 :: [i586] #2200 kernel-modules-rtl8188eu-un-def.git sisyphus/kernel-modules-rtl8188eu-un-def-5.13.3-alt2: build FAILED
2026-Oct-03 12:52:06 :: [aarch64] #1500 kernel-modules-ixgbe-un-def.git sisyphus/kernel-modules-ixgbe-un-def-5.20.10-alt1: build OK
2026-Oct-03 12:52:06 :: [aarch64] #1600 kernel-modules-lkrg-un-def.git sisyphus/kernel-modules-lkrg-un-def-0.9.8-alt3: build start
2026-Oct-03 12:52:30 :: [aarch64] #1600 kernel-modules-lkrg-un-def.git sisyphus/kernel-modules-lkrg-un-def-0.9.8-alt3: build SKIPPED
2026-Oct-03 12:52:30 :: [aarch64] #1700 kernel-modules-nvidia-un-def.git sisyphus/kernel-modules-nvidia-un-def-550.144.03-alt1: build start
2026-Oct-03 12:53:20 :: [x86_64] #1700 kernel-modules-nvidia-un-def.git sisyphus/kernel-modules-nvidia-un-def-550.144.03-alt1: build OK
2026-Oct-03 12:53:21 :: [x86_64] #2000 kernel-modules-r8125-un-def.git sisyphus/kernel-modules-r8125-un-def-9.011.01-alt1: build start
2026-Oct-03 12:53:56 :: [x86_64] #2000 kernel-modules-r8125-un-def.git sisyphus/kernel-modules-r8125-un-def-9.011.01-alt1: build OK
2026-Oct-03 12:53:57 :: [x86_64] #2100 kernel-modules-r8168-un-def.git sisyphus/kernel-modules-r8168-un-def-8.053.01-alt1.k: build start
2026-Oct-03 12:54:36 :: [aarch64] #1700 kernel-modules-nvidia-un-def.git sisyphus/kernel-modules-nvidia-un-def-550.144.03-alt1: build OK
2026-Oct-03 12:54:36 :: [aarch64] #2000 kernel-modules-r8125-un-def.git sisyphus/kernel-modules-r8125-un-def-9.011.01-alt1: build start
2026-Oct-03 12:54:38 :: [x86_64] #2100 kernel-modules-r8168-un-def.git sisyphus/kernel-modules-r8168-un-def-8.053.01-alt1.k: build OK
2026-Oct-03 12:54:38 :: [x86_64] #2200 kernel-modules-rtl8188eu-un-def.git sisyphus/kernel-modules-rtl8188eu-un-def-5.13.3-alt2: build start
2026-Oct-03 12:55:00 :: [aarch64] #2000 kernel-modules-r8125-un-def.git sisyphus/kernel-modules-r8125-un-def-9.011.01-alt1: build SKIPPED
2026-Oct-03 12:55:00 :: [aarch64] #2100 kernel-modules-r8168-un-def.git sisyphus/kernel-modules-r8168-un-def-8.053.01-alt1.k: build start
[x86_64]   CC [M]  /usr/src/RPM/BUILD/kernel-source-rtl8188eu-5.13.3/os_dep/linux/usb_intf.o
[x86_64] /usr/src/RPM/BUILD/kernel-source-rtl8188eu-5.13.3/os_dep/linux/usb_intf.c:351:10: error: 'struct usb_driver' has no member named 'drvwrap'
[x86_64]   351 |  .usbdrv.drvwrap.driver.shutdown = rtw_dev_shutdown,
2026-Oct-03 12:55:03 :: [x86_64] kernel-modules-rtl8188eu-un-def.git sisyphus/kernel-modules-rtl8188eu-un-def-5.13.3-alt2: remote: build failed
2026-Oct-03 12:55:03 :: [x86_64] #2200 kernel-modules-rtl8188eu-un-def.git sisyphus/kernel-modules-rtl8188eu-un-def-5.13.3-alt2: build FAILED
2026-Oct-03 12:56:21 :: [aarch64] #2100 kernel-modules-r8168-un-def.git sisyphus/kernel-modules-r8168-un-def-8.053.01-alt1.k: build OK
2026-Oct-03 12:56:21 :: [aarch64] #2200 kernel-modules-rtl8188eu-un-def.git sisyphus/kernel-modules-rtl8188eu-un-def-5.13.3-alt2: build start
2026-Oct-03 12:56:47 :: [aarch64] #2200 kernel-modules-rtl8188eu-un-def.git sisyphus/kernel-modules-rtl8188eu-un-def-5.13.3-alt2: build SKIPPED
2026-Oct-03 12:56:47 :: [aarch64] #2300 kernel-modules-rtl8192eu-un-def.git sisyphus/kernel-modules-rtl8192eu-un-def-5.11.2.1-alt1: build start
2026-Oct-03 12:57:13 :: [aarch64] #2300 kernel-modules-rtl8192eu-un-def.git sisyphus/kernel-modules-rtl8192eu-un-def-5.11.2.1-alt1: build SKIPPED
2026-Oct-03 12:57:13 :: [aarch64] #2400 kernel-modules-rtl8723du-un-def.git sisyphus/kernel-modules-rtl8723du-un-def-5.13.4-alt1: build start
2026-Oct-03 12:57:38 :: [aarch64] #2400 kernel-modules-rtl8723du-un-def.git sisyphus/kernel-modules-rtl8723du-un-def-5.13.4-alt1: build SKIPPED
2026-Oct-03 12:57:38 :: [aarch64] #2500 kernel-modules-rtl8812au-un-def.git sisyphus/kernel-modules-rtl8812au-un-def-5.6.4.2-alt1: build start
2026-Oct-03 12:58:03 :: [aarch64] #2500 kernel-modules-rtl8812au-un-def.git sisyphus/kernel-modules-rtl8812au-un-def-5.6.4.2-alt1: build SKIPPED
2026-Oct-03 12:58:03 :: [aarch64] #2600 kernel-modules-rtl8821cu-un-def.git sisyphus/kernel-modules-rtl8821cu-un-def-5.12.0.4-alt1: build start
2026-Oct-03 12:58:28 :: [aarch64] #2600 kernel-modules-rtl8821cu-un-def.git sisyphus/kernel-modules-rtl8821cu-un-def-5.12.0.4-alt1: build SKIPPED
2026-Oct-03 12:58:28 :: [aarch64] #2700 kernel-modules-rtl88x2bu-un-def.git sisyphus/kernel-modules-rtl88x2bu-un-def-5.8.7.1-alt5: build start
[aarch64] In file included from /usr/src/RPM/BUILD/kernel-source-rtl88x2bu-5.8.7.1/include/drv_types.h:105,
[aarch64]                  from /usr/src/RPM/BUILD/kernel-source-rtl88x2bu-5.8.7.1/hal/hal_com_phycfg.c:17:
[aarch64] /usr/src/RPM/BUILD/kernel-source-rtl88x2bu-5.8.7.1/include/rtw_mlme_ext.h: In function 'check_mlmeinfo_state':
[aarch64] /usr/src/RPM/BUILD/kernel-source-rtl88x2bu-5.8.7.1/include/rtw_mlme_ext.h:603:42: warning: comparison of integer expressions of different signedness: 'u32' {aka 'unsigned int'} and 'sint' {aka 'int'} [-Wsign-compare]
[aarch64]   603 |  if ((plmeext->mlmext_info.state & 0x03) == state)
[aarch64] make[1]: *** [Makefile:2022: /usr/src/RPM/BUILD/kernel-source-rtl88x2bu-5.8.7.1] Error 2
[aarch64] make: *** [Makefile:2392: modules] Error 2
[aarch64] error: Bad exit status from /usr/src/tmp/rpm-tmp.67593 (%build)
[aarch64] RPM build errors:
[aarch64]     line 27: Deprecated PreReq converted to Requires(pre,postun): PreReq: kernel-image-un-def = 1:6.1.189-alt1
2026-Oct-03 12:59:10 :: [aarch64] kernel-modules-rtl88x2bu-un-def.git sisyphus/kernel-modules-rtl88x2bu-un-def-5.8.7.1-alt5: remote: build failed
2026-Oct-03 12:59:10 :: [aarch64] #2700 kernel-modules-rtl88x2bu-un-def.git sisyphus/kernel-modules-rtl88x2bu-un-def-5.8.7.1-alt5: build FAILED
2026-Oct-03 13:07:14 :: [armh] #100 kernel-image.git kernel-image-un-def-6.1.189-alt1: build OK
2026-Oct-03 13:07:15 :: [armh] #200 kernel-modules-LiME-un-def.git sisyphus/kernel-modules-LiME-un-def-1.9.1-alt1: build start
2026-Oct-03 13:08:19 :: [armh] #200 kernel-modules-LiME-un-def.git sisyphus/kernel-modules-LiME-un-def-1.9.1-alt1: build OK
2026-Oct-03 13:08:19 :: [armh] #300 kernel-modules-accel-ppp-un-def.git sisyphus/kernel-modules-accel-ppp-un-def-1.12.0-alt3: build start
2026-Oct-03 13:08:57 :: [armh] #300 kernel-modules-accel-ppp-un-def.git sisyphus/kernel-modules-accel-ppp-un-def-1.12.0-alt3: build SKIPPED
2026-Oct-03 13:08:57 :: [armh] #400 kernel-modules-anbox-un-def.git sisyphus/kernel-modules-anbox-un-def-14-alt2.gae26ba2: build start
2026-Oct-03 13:10:02 :: [armh] #400 kernel-modules-anbox-un-def.git sisyphus/kernel-modules-anbox-un-def-14-alt2.gae26ba2: build OK
2026-Oct-03 13:10:02 :: [armh] #500 kernel-modules-bcmwl-un-def.git sisyphus/kernel-modules-bcmwl-un-def-6.30.223.271-alt15: build start
2026-Oct-03 13:10:37 :: [armh] #500 kernel-modules-bcmwl-un-def.git sisyphus/kernel-modules-bcmwl-un-def-6.30.223.271-alt15: build SKIPPED
2026-Oct-03 13:10:37 :: [armh] #600 kernel-modules-dm-secdel-un-def.git sisyphus/kernel-modules-dm-secdel-un-def-1.0.9-alt1: build start
2026-Oct-03 13:12:44 :: [armh] #600 kernel-modules-dm-secdel-un-def.git sisyphus/kernel-modules-dm-secdel-un-def-1.0.9-alt1: build OK
2026-Oct-03 13:12:44 :: [armh] #700 kernel-modules-drbd9-un-def.git sisyphus/kernel-modules-drbd9-un-def-9.2.12-alt1: build start
2026-Oct-03 13:13:21 :: [armh] #700 kernel-modules-drbd9-un-def.git sisyphus/kernel-modules-drbd9-un-def-9.2.12-alt1: build SKIPPED
2026-Oct-03 13:13:21 :: [armh] #1000 kernel-modules-evdi-un-def.git sisyphus/kernel-modules-evdi-un-def-1.14.1-alt1: build start
2026-Oct-03 13:14:25 :: [armh] #1000 kernel-modules-evdi-un-def.git sisyphus/kernel-modules-evdi-un-def-1.14.1-alt1: build OK
2026-Oct-03 13:14:25 :: [armh] #1100 kernel-modules-i40e-un-def.git sisyphus/kernel-modules-i40e-un-def-2.22.20-alt1: build start
2026-Oct-03 13:15:00 :: [armh] #1100 kernel-modules-i40e-un-def.git sisyphus/kernel-modules-i40e-un-def-2.22.20-alt1: build SKIPPED
2026-Oct-03 13:15:01 :: [armh] #1200 kernel-modules-iavf-un-def.git sisyphus/kernel-modules-iavf-un-def-4.8.3-alt1: build start
2026-Oct-03 13:15:37 :: [armh] #1200 kernel-modules-iavf-un-def.git sisyphus/kernel-modules-iavf-un-def-4.8.3-alt1: build SKIPPED
2026-Oct-03 13:15:37 :: [armh] #1300 kernel-modules-ipt-ratelimit-un-def.git sisyphus/kernel-modules-ipt-ratelimit-un-def-0.3.3-alt1: build start
2026-Oct-03 13:16:39 :: [armh] #1300 kernel-modules-ipt-ratelimit-un-def.git sisyphus/kernel-modules-ipt-ratelimit-un-def-0.3.3-alt1: build OK
2026-Oct-03 13:16:39 :: [armh] #1400 kernel-modules-ipt_netflow-un-def.git sisyphus/kernel-modules-ipt_netflow-un-def-2.6-alt1: build start
2026-Oct-03 13:17:14 :: [armh] #1400 kernel-modules-ipt_netflow-un-def.git sisyphus/kernel-modules-ipt_netflow-un-def-2.6-alt1: build SKIPPED
2026-Oct-03 13:17:14 :: [armh] #1500 kernel-modules-ixgbe-un-def.git sisyphus/kernel-modules-ixgbe-un-def-5.20.10-alt1: build start
2026-Oct-03 13:17:51 :: [armh] #1500 kernel-modules-ixgbe-un-def.git sisyphus/kernel-modules-ixgbe-un-def-5.20.10-alt1: build SKIPPED
2026-Oct-03 13:17:52 :: [armh] #1600 kernel-modules-lkrg-un-def.git sisyphus/kernel-modules-lkrg-un-def-0.9.8-alt3: build start
2026-Oct-03 13:18:28 :: [armh] #1600 kernel-modules-lkrg-un-def.git sisyphus/kernel-modules-lkrg-un-def-0.9.8-alt3: build SKIPPED
2026-Oct-03 13:18:28 :: [armh] #1700 kernel-modules-nvidia-un-def.git sisyphus/kernel-modules-nvidia-un-def-550.144.03-alt1: build start
2026-Oct-03 13:19:15 :: [armh] #1700 kernel-modules-nvidia-un-def.git sisyphus/kernel-modules-nvidia-un-def-550.144.03-alt1: build SKIPPED
2026-Oct-03 13:19:15 :: [armh] #2000 kernel-modules-r8125-un-def.git sisyphus/kernel-modules-r8125-un-def-9.011.01-alt1: build start
2026-Oct-03 13:19:52 :: [armh] #2000 kernel-modules-r8125-un-def.git sisyphus/kernel-modules-r8125-un-def-9.011.01-alt1: build SKIPPED
2026-Oct-03 13:19:52 :: [armh] #2100 kernel-modules-r8168-un-def.git sisyphus/kernel-modules-r8168-un-def-8.053.01-alt1.k: build start
2026-Oct-03 13:21:40 :: [armh] #2100 kernel-modules-r8168-un-def.git sisyphus/kernel-modules-r8168-un-def-8.053.01-alt1.k: build OK
2026-Oct-03 13:21:41 :: [armh] #2200 kernel-modules-rtl8188eu-un-def.git sisyphus/kernel-modules-rtl8188eu-un-def-5.13.3-alt2: build start
2026-Oct-03 13:22:16 :: [armh] #2200 kernel-modules-rtl8188eu-un-def.git sisyphus/kernel-modules-rtl8188eu-un-def-5.13.3-alt2: build SKIPPED
2026-Oct-03 13:22:16 :: [armh] #2300 kernel-modules-rtl8192eu-un-def.git sisyphus/kernel-modules-rtl8192eu-un-def-5.11.2.1-alt1: build start
2026-Oct-03 13:22:52 :: [armh] #2300 kernel-modules-rtl8192eu-un-def.git sisyphus/kernel-modules-rtl8192eu-un-def-5.11.2.1-alt1: build SKIPPED
2026-Oct-03 13:22:52 :: [armh] #2400 kernel-modules-rtl8723du-un-def.git sisyphus/kernel-modules-rtl8723du-un-def-5.13.4-alt1: build start
2026-Oct-03 13:23:29 :: [armh] #2400 kernel-modules-rtl8723du-un-def.git sisyphus/kernel-modules-rtl8723du-un-def-5.13.4-alt1: build SKIPPED
2026-Oct-03 13:23:29 :: [armh] #2500 kernel-modules-rtl8812au-un-def.git sisyphus/kernel-modules-rtl8812au-un-def-5.6.4.2-alt1: build start
2026-Oct-03 13:24:07 :: [armh] #2500 kernel-modules-rtl8812au-un-def.git sisyphus/kernel-modules-rtl8812au-un-def-5.6.4.2-alt1: build SKIPPED
2026-Oct-03 13:24:07 :: [armh] #2600 kernel-modules-rtl8821cu-un-def.git sisyphus/kernel-modules-rtl8821cu-un-def-5.12.0.4-alt1: build start
2026-Oct-03 13:24:46 :: [armh] #2600 kernel-modules-rtl8821cu-un-def.git sisyphus/kernel-modules-rtl8821cu-un-def-5.12.0.4-alt1: build SKIPPED
2026-Oct-03 13:24:46 :: [armh] #2700 kernel-modules-rtl88x2bu-un-def.git sisyphus/kernel-modules-rtl88x2bu-un-def-5.8.7.1-alt5: build start
2026-Oct-03 13:25:24 :: [armh] #2700 kernel-modules-rtl88x2bu-un-def.git sisyphus/kernel-modules-rtl88x2bu-un-def-5.8.7.1-alt5: build SKIPPED
2026-Oct-03 13:25:24 :: [armh] #3000 kernel-modules-rtw89-un-def.git sisyphus/kernel-modules-rtw89-un-def-0.0-alt4.git.4f3464d: build start
2026-Oct-03 13:26:40 :: [armh] #3000 kernel-modules-rtw89-un-def.git sisyphus/kernel-modules-rtw89-un-def-0.0-alt4.git.4f3464d: build OK
2026-Oct-03 13:26:40 :: [armh] #3100 kernel-modules-sysdig-un-def.git sisyphus/kernel-modules-sysdig-un-def-7.3.0-alt1: build start
2026-Oct-03 13:27:16 :: [armh] #3100 kernel-modules-sysdig-un-def.git sisyphus/kernel-modules-sysdig-un-def-7.3.0-alt1: build SKIPPED
2026-Oct-03 13:27:16 :: [armh] #3200 kernel-modules-v4l2loopback-un-def.git sisyphus/kernel-modules-v4l2loopback-un-def-0.12.7-alt1.g5e9dd41: build start
2026-Oct-03 13:28:16 :: [armh] #3200 kernel-modules-v4l2loopback-un-def.git sisyphus/kernel-modules-v4l2loopback-un-def-0.12.7-alt1.g5e9dd41: build OK
2026-Oct-03 13:28:17 :: [armh] #3300 kernel-modules-vhba-un-def.git sisyphus/kernel-modules-vhba-un-def-20211218-alt1.k: build start
2026-Oct-03 13:29:17 :: [armh] #3300 kernel-modules-vhba-un-def.git sisyphus/kernel-modules-vhba-un-def-20211218-alt1.k: build OK
2026-Oct-03 13:29:17 :: [armh] #3400 kernel-modules-virtualbox-addition-un-def.git sisyphus/kernel-modules-virtualbox-addition-p10-un-def-7.1.16-alt1: build start
2026-Oct-03 13:29:53 :: [armh] #3400 kernel-modules-virtualbox-addition-un-def.git sisyphus/kernel-modules-virtualbox-addition-p10-un-def-7.1.16-alt1: build SKIPPED
2026-Oct-03 13:29:53 :: [armh] #3500 kernel-modules-virtualbox-un-def.git sisyphus/kernel-modules-virtualbox-p10-un-def-7.1.16-alt1: build start
2026-Oct-03 13:30:31 :: [armh] #3500 kernel-modules-virtualbox-un-def.git sisyphus/kernel-modules-virtualbox-p10-un-def-7.1.16-alt1: build SKIPPED
2026-Oct-03 13:30:31 :: [armh] #3600 kernel-modules-xtables-addons-un-def.git sisyphus/kernel-modules-xtables-addons-un-def-3.23-alt1: build start
2026-Oct-03 13:32:20 :: [armh] #3600 kernel-modules-xtables-addons-un-def.git sisyphus/kernel-modules-xtables-addons-un-def-3.23-alt1: build OK
2026-Oct-03 13:32:20 :: [armh] #3700 kernel-modules-zfs-un-def.git p10/kernel-modules-zfs-un-def-2.1.16-alt1: build start
2026-Oct-03 13:40:24 :: [armh] #3700 kernel-modules-zfs-un-def.git p10/kernel-modules-zfs-un-def-2.1.16-alt1: build OK
2026-Oct-03 12:52:04 :: [i586] build FAILED
2026-Oct-03 12:55:03 :: [x86_64] build FAILED
2026-Oct-03 12:59:10 :: [aarch64] build FAILED
2026-Oct-03 13:40:24 :: task #435322 for p10 FAILED


             reply	other threads:[~2026-10-03 13:40 UTC|newest]

Thread overview: 6+ messages / expand[flat|nested]  mbox.gz  Atom feed  top
2026-10-03 13:40 Girar awaiter (kernelbot) [this message]
2026-10-03 15:16 ` [#435322] p10 FAILED (try 2) kernel-image.git=kernel-image-un-def-6.1.189-alt1 Girar awaiter (kernelbot)
2026-10-03 15:47 ` [#435322] p10 FAILED (try 3) kernel-image.git=kernel-image-un-def-6.1.189-alt1 Girar awaiter (kernelbot)
2026-10-03 16:19 ` [#435322] p10 FAILED (try 4) kernel-image.git=kernel-image-un-def-6.1.189-alt1 Girar awaiter (kernelbot)
2026-10-04  5:40 ` [#435322] p10 FAILED (try 5) kernel-image.git=kernel-image-un-def-6.1.189-alt1 Girar awaiter (kernelbot)
2026-10-04  8:23 ` [#435322] p10 FAILED (try 6) kernel-image.git=kernel-image-un-def-6.1.189-alt1 Girar awaiter (kernelbot)

Reply instructions:

You may reply publicly to this message via plain-text email
using any one of the following methods:

* Save the following mbox file, import it into your mail client,
  and reply-to-all from there: mbox

  Avoid top-posting and favor interleaved quoting:
  https://en.wikipedia.org/wiki/Posting_style#Interleaved_style

* Reply using the --to, --cc, and --in-reply-to
  switches of git-send-email(1):

  git send-email \
    --in-reply-to=girar.task.435322.1.1@gyle.mskdc.altlinux.org \
    --to=girar-builder@altlinux.org \
    --cc=devel@lists.altlinux.org \
    --cc=girar-builder-p10@altlinux.org \
    --cc=girar-builder-p10@lists.altlinux.org \
    --cc=kernelbot@altlinux.org \
    --cc=sisyphus-incominger@lists.altlinux.org \
    /path/to/YOUR_REPLY

  https://kernel.org/pub/software/scm/git/docs/git-send-email.html

* If your mail client supports setting the In-Reply-To header
  via mailto: links, try the mailto: link

ALT Linux Girar Builder robot reports

This inbox may be cloned and mirrored by anyone:

	# this inbox consists of 2 epochs:
	git clone --mirror http://lore.altlinux.org/sisyphus-incominger/0 sisyphus-incominger/git/0.git	# oldest
	git clone --mirror http://lore.altlinux.org/sisyphus-incominger/1 sisyphus-incominger/git/1.git	# newest

	# If you have public-inbox 1.1+ installed, you may
	# initialize and index your mirror using the following commands:
	public-inbox-init -V2 sisyphus-incominger sisyphus-incominger/ http://lore.altlinux.org/sisyphus-incominger \
		sisyphus-incominger@lists.altlinux.org sisyphus-incominger@lists.altlinux.ru sisyphus-incominger@lists.altlinux.com
	public-inbox-index sisyphus-incominger

Example config snippet for mirrors.
Newsgroup available over NNTP:
	nntp://lore.altlinux.org/org.altlinux.lists.sisyphus-incominger


AGPL code for this site: git clone https://public-inbox.org/public-inbox.git