ALT Linux Sisyphus cybertalk
 help / color / mirror / Atom feed
* [cyber] I: p10-20240505 x86_64 beehive_status: +7 -5 (71)
@ 2024-05-05  4:10 ALT beekeeper
  0 siblings, 0 replies; only message in thread
From: ALT beekeeper @ 2024-05-05  4:10 UTC (permalink / raw)
  To: sisyphus-cybertalk

	7 NEW error logs

	ranlib	libfunc.a
	make[1]: Leaving directory '/usr/src/RPM/BUILD/SNNSv4.3/kernel/sources'
	make[1]: Entering directory '/usr/src/RPM/BUILD/SNNSv4.3/xgui/sources'
	x86_64-alt-linux-gcc  libxgui1.a libxgui2.a lib3d.a \
	-lXaw3d -lXmu -lXt -lXext -lSM -lICE  -lX11  \
	../../kernel/sources/libkernel.a ../../kernel/sources/libfunc.a -lm -lfl  -o xgui
	ld: libxgui1.a(ui_controlP.o): in function `ui_rem_performPrunInit':
	/usr/src/RPM/BUILD/SNNSv4.3/xgui/sources/ui_controlP.c:1191: warning: the use of
	`tempnam' is dangerous, better use `mkstemp'
	make[1]: Leaving directory '/usr/src/RPM/BUILD/SNNSv4.3/xgui/sources'

	Full log written to
	FAILED: meson-internal__test
	/usr/bin/meson test --no-rebuild --print-errorlogs

	checking for a BSD-compatible install... /bin/install -c
	./configure: line 2846: syntax error near unexpected token `0,'
	./configure: line 2846: `NE_REQUIRE_VERSIONS(0, 26 27 28 29 30 31)'

	Died at t/90_regression/hinrik-wheel-run-die.t line 21.
	#   Failed test 'Timed out'
	#   at t/90_regression/hinrik-wheel-run-die.t line 40.
	t/90_regression/hinrik-wheel-run-die.t		(Wstat: 256 Tests: 1 Failed: 1)
	Failed test:  1
	Non-zero exit status: 1
	Result: FAIL
	Failed 1/82 test programs. 1/2909 subtests failed.
	make: *** [Makefile:840: test_dynamic] Error 255

	test_msilib test_nis test_ossaudiodev test_smtpnet
	test_socketserver test_startfile test_tix test_tk test_ttk_guionly
	test_urllib2net test_urllibnet test_winconsoleio test_winreg
	test_winsound test_xmlrpc_net test_zipfile64
	Total duration: 2 min 19 sec
	Tests result: FAILURE
	error: Bad exit status from /usr/src/tmp/rpm-tmp.62780 (%check)
	RPM build errors:
	Macro %optflags_lto not found
	Macro %optflags_lto failed to expand

	tests/test_fast/ PASSED				 [ 31%]
	tests/test_fast/ FAILED				 [ 34%]
	tests/test_fast/ PASSED				 [ 36%]
	=========================== short test summary info ============================
	FAILED tests/test_fast/ - assert False
	=================== 1 failed, 37 passed in 81.08s (0:01:21) ====================

	[358] --	Execute command: "print"
	[358] --	Error: command 'print' expects argument, but none received.
	[358] Type 'h' and press return for a command list.
	[358] [test-run server "luatest_server"] Last 15 lines of the log file
	[358] child's stdout logger: <ESC>[91mError: <ESC>[0mcommand 'print' expects argument, but
	none received.<LF>Type 'h' and press return for a command list.<LF><ESC>[90m 520<ESC>[0m
	end<LF><ESC>[90m 521<ESC>[0m	   check_table(obj, '')<LF><ESC>[90m
	522<ESC>[0m   <LF><ESC>[90m 523<ESC>[0m<ESC>[92m=><ESC>[0m     local ymd =
	false<LF><ESC>[90m 524<ESC>[0m	     local hms = false<LF><ESC>[90m 525<ESC>[0m
	local dt = DAYS_EPOCH_OFFSET<LF><ESC>[90m 526<ESC>[0m	<LF><ESC>[91mluadebug> <ESC>[0m
	[358] child's stdout logger: print obj<LF>

	5 error logs REMOVED from the list

Total 71 error logs.

^ permalink raw reply	[flat|nested] only message in thread

only message in thread, other threads:[~2024-05-05  4:10 UTC | newest]

Thread overview: (only message) (download: mbox.gz / follow: Atom feed)
-- links below jump to the message on this page --
2024-05-05  4:10 [cyber] I: p10-20240505 x86_64 beehive_status: +7 -5 (71) ALT beekeeper

ALT Linux Sisyphus cybertalk

This inbox may be cloned and mirrored by anyone:

	git clone --mirror sisyphus-cybertalk/git/0.git

	# If you have public-inbox 1.1+ installed, you may
	# initialize and index your mirror using the following commands:
	public-inbox-init -V2 sisyphus-cybertalk sisyphus-cybertalk/ \
	public-inbox-index sisyphus-cybertalk

Example config snippet for mirrors.
Newsgroup available over NNTP:

AGPL code for this site: git clone