ALT Linux Sisyphus cybertalk
 help / color / mirror / Atom feed
* [cyber] I: Sisyphus-20240511 x86_64 beehive_status: +7 -9 (112)
@ 2024-05-11  5:09 ALT beekeeper
  0 siblings, 0 replies; only message in thread
From: ALT beekeeper @ 2024-05-11  5:09 UTC (permalink / raw)
  To: sisyphus-cybertalk

	7 NEW error logs

	Full log written to
	FAILED: meson-internal__test
	/usr/bin/meson test --no-rebuild --print-errorlogs

	gcc -shared graph.o gbipart.o gbisect.o ddcreate.o ddbisect.o nestdiss.o
	multisector.o gelim.o bucket.o tree.o symbfac.o interface.o sort.o minpriority.o
	-Wl,-soname, -o -fopenmp -lrt -Wl,-z,defs
	lto1: internal compiler error: resolution sub id 0x2e431a76d466831f not in object file
	libbacktrace could not find executable to open
	See <> for instructions.
	lto-wrapper: fatal error: x86_64-alt-linux-gcc returned 1 exit status
	compilation terminated.
	ld: error: lto-wrapper failed
	collect2: error: ld returned 1 exit status
	make[2]: *** [Makefile:34:] Error 1

	There's a <1% chance that this data is random.
	# Failed test 1 in t/chisquare.t at line 39
	#  t/chisquare.t line 39 is:	 ok($chi =~ m/\>[1-9]/);
	t/chisquare.t	   (Wstat: 0 Tests: 1 Failed: 1)
	Failed test:  1
	Files=6, Tests=21,  0 wallclock secs ( 0.04 usr  0.01 sys +  0.24 cusr	0.05 csys =
	0.34 CPU)
	Result: FAIL
	Failed 1/6 test programs. 1/21 subtests failed.
	make: *** [Makefile:795: test_dynamic] Error 255

	received TERM, sending TERM to all workers:1578083
	hasher-privd: parent: handle_io: idle time limit (3600 seconds) exceeded

	[ERROR] io.prometheus.client.HistogramTest.testTimeWithExemplar  Time elapsed: 0.018
	s  <<< FAILURE!
	java.lang.AssertionError: expected:<0.015> but was:<0.016064204>
	at io.prometheus.client.HistogramTest.assertExemplar(

	XPASS tests/ - known to be problematic
	FAILED tests/
	============= 1 failed, 166 passed, 4 skipped, 1 xpassed in 59.84s =============
	INFO	 : Command's result: FAILURE
	INFO	 : Command's error: Command '['python3', '-m', 'pytest', '-ra']' returned
	non-zero exit status 1.

	Compiling strsim v0.8.0
	error: rustc interrupted by SIGSEGV, printing backtrace
	note: backtrace dumped due to SIGSEGV! resuming signal
	error: could not compile `frunk_core` (lib)
	Caused by:

	9 error logs REMOVED from the list

Total 112 error logs.

^ permalink raw reply	[flat|nested] only message in thread

only message in thread, other threads:[~2024-05-11  5:09 UTC | newest]

Thread overview: (only message) (download: mbox.gz / follow: Atom feed)
-- links below jump to the message on this page --
2024-05-11  5:09 [cyber] I: Sisyphus-20240511 x86_64 beehive_status: +7 -9 (112) ALT beekeeper

ALT Linux Sisyphus cybertalk

This inbox may be cloned and mirrored by anyone:

	git clone --mirror sisyphus-cybertalk/git/0.git

	# If you have public-inbox 1.1+ installed, you may
	# initialize and index your mirror using the following commands:
	public-inbox-init -V2 sisyphus-cybertalk sisyphus-cybertalk/ \
	public-inbox-index sisyphus-cybertalk

Example config snippet for mirrors.
Newsgroup available over NNTP:

AGPL code for this site: git clone