ALT Linux Sisyphus cybertalk
 help / color / mirror / Atom feed
* [cyber] I: Sisyphus-20240212 x86_64 beehive_status: +12 -11 (167)
@ 2024-02-12  5:11 ALT beekeeper
  0 siblings, 0 replies; only message in thread
From: ALT beekeeper @ 2024-02-12  5:11 UTC (permalink / raw)
  To: sisyphus-cybertalk

	12 NEW error logs

	ld: ../../carla/build/modules/Release/jackbridge.min.a: error adding symbols: archive
	has no index; run ranlib to add one
	collect2: error: ld returned 1 exit status
	make[2]: *** [../../dpf/ ../../bin/Cardinal] Error 1
	ld: ../../carla/build/modules/Release/jackbridge.min.a: error adding symbols: archive
	has no index; run ranlib to add one
	collect2: error: ld returned 1 exit status
	make[2]: *** [../../dpf/ ../../bin/Cardinal.lv2/]
	Error 1

	[   info] adding source lib
	/usr/src/RPM/BUILD/mod_perl-2.0.13/Apache-Reload/../Apache-Test/lib to @INC
	# Failed test 2 in t/reload.t at line 47
	t/reload.t ..
	t/reload.t (Wstat: 0 Tests: 3 Failed: 1)
	Failed test:  2
	Files=1, Tests=3,  0 wallclock secs ( 0.01 usr	0.00 sys +  0.17 cusr  0.05 csys =
	0.23 CPU)
	Result: FAIL
	Failed 1/1 test programs. 1/3 subtests failed.
	[warning] server localhost.localdomain:8529 shutdown

	make[5]: Entering directory
	make[5]: *** No rule to make target 'built_sources'.  Stop.
	make[5]: Leaving directory
	make[5]: Entering directory
	make[5]: *** No rule to make target 'jobqueue.c', needed by 'jobqueue.lo'.  Stop.
	make[5]: Leaving directory

	Compiling qrencode v0.14.0
	Summary of Failures:
	4/4 Cargo tests		   TIMEOUT	  600.04s   killed by signal 15 SIGTERM
	Ok:		    3
	Expected Fail:	    0
	Fail:		    0
	Unexpected Pass:    0
	Skipped:	    0
	Timeout:	    1
	Full log written to

	gmake[1]: *** Waiting for unfinished jobs....
	gmake[2]: Entering directory '/usr/src/RPM/BUILD/cgns-4.2.0/x86_64-alt-linux'
	[  8%] Building C object src/CMakeFiles/cgns_static.dir/cgns_internals.c.o
	cd /usr/src/RPM/BUILD/cgns-4.2.0/x86_64-alt-linux/src && /usr/bin/cc
	-DH5_BUILT_AS_STATIC_LIB -I/usr/src/RPM/BUILD/cgns-4.2.0/x86_64-alt-linux/src
	-I/usr/src/RPM/BUILD/cgns-4.2.0/src -pipe -frecord-gcc-switches -Wall -g -O2
	-flto=auto -ffat-lto-objects -D_FILE_OFFSET_BITS=64 -std=gnu99 -O2 -DNDEBUG
	-std=gnu99 -MD -MT src/CMakeFiles/cgns_static.dir/cgns_internals.c.o
	-MF CMakeFiles/cgns_static.dir/cgns_internals.c.o.d
	-o CMakeFiles/cgns_static.dir/cgns_internals.c.o -c
	/usr/src/RPM/BUILD/cgns-4.2.0/src/cgns_internals.c: In function 'cgi_rind_address':
	/usr/src/RPM/BUILD/cgns-4.2.0/src/cgns_internals.c:11887:9: warning: variable 'error1'
	set but not used [-Wunused-but-set-variable]
	11887 |     int error1, index_dim;
	gmake[2]: Leaving directory '/usr/src/RPM/BUILD/cgns-4.2.0/x86_64-alt-linux'
	gmake[1]: *** [CMakeFiles/Makefile2:531: src/CMakeFiles/cgns_static.dir/all] Error 2
	gmake: *** [Makefile:166: all] Error 2

	Compiling regex-syntax v0.6.28
	error: could not compile `rustc-serialize` (lib) due to 1 previous error
	warning: build failed, waiting for other jobs to finish...
	[8/9] Merging translations for data/io.github.nate_xyz.Chromatic.appdata.xml
	FAILED: src/chromatic
	/usr/bin/env CARGO_HOME=/usr/src/RPM/BUILD/chromatic-0.1.2/x86_64-alt-linux/cargo-home
	/usr/bin/cargo build --manifest-path /usr/src/RPM/BUILD/chromatic-0.1.2/Cargo.toml
	--target-dir /usr/src/RPM/BUILD/chromatic-0.1.2/x86_64-alt-linux/src && cp
	src/debug/chromatic src/chromatic

	-- Check for HDF5 ...
	-- Found HDF5:
	/usr/lib64/;/usr/lib64/;/usr/lib64/libdl.a;/usr/lib64/ (found
	version "1.14.3")
	-- Found HDF5 version 1.14.3 -- parallel flag is set to
	-- _versionComponents=1;14;3
	-- HDF5_VERSION=1.14.3
	CMake Error at config/cmake_files/medMacros.cmake:451 (MESSAGE):
	HDF5 version is 1.14.3.  Only versions >= 1.10.2 are supported.
	Call Stack (most recent call first):
	CMakeLists.txt:110 (MED_FIND_HDF5)
	-- Configuring incomplete, errors occurred!

	gcc -c -g -O2 -pipe -Wall -fPIC -DPIC -DHAVE_CONFIG_H spbkp.c
	spbkp.c: In function 'spBKPfactor':
	spbkp.c:614:17: warning: variable 'row_num' set but not used [-Wunused-but-set-variable]
	614 |	  int	      row_num;
	spbkp.c:612:42: warning: variable 'r' set but not used [-Wunused-but-set-variable]
	612 |	  int	      i, j, k, l, n, onebyone, r;
	spbkp.c: At top level:
	spbkp.c:34:17: warning: 'rcsid' defined but not used [-Wunused-variable]
	34 | static  char    rcsid[] = "$Id: spbkp.c,v 1.6 1996/08/20 19:53:10 stewart Exp $";
	make: Leaving directory '/usr/src/RPM/BUILD/meschach-1.2'

	Checking paper-plane v0.1.0-beta.5 (/usr/src/RPM/BUILD/paper-plane-0.1.0.beta5)
	error: writing `&Vec` instead of `&[_]` involves a new object where a slice will do
	--> src/
	= help: to override `-D warnings` add `#[allow(clippy::ptr_arg)]`
	error: could not compile `paper-plane` (bin "paper-plane") due to 1 previous error
	Summary of Failures:

	[ERROR] io.prometheus.client.HistogramTest.testTimeWithExemplar  Time elapsed: 0.019
	s  <<< FAILURE!
	java.lang.AssertionError: expected:<0.015> but was:<0.016012683>
	at io.prometheus.client.HistogramTest.assertExemplar(

	tests/ FAILED			 [  6%]
	tests/ FAILED			 [  6%]
	tests/ FAILED		 [  7%]
	tests/ FAILED		 [  7%]
	tests/ FAILED			 [  8%]
	tests/ PASSED [  8%]
	tests/ PASSED		 [ 15%]
	tests/ FAILED		 [ 15%]
	tests/ PASSED	 [ 16%]
	tests/ PASSED [ 39%]
	tests/ FAILED [ 40%]
	tests/ FAILED		 [ 40%]
	tests/ PASSED	 [ 41%]
	tests/ PASSED			 [ 53%]
	tests/ FAILED		 [ 54%]
	tests/ PASSED		 [ 54%]
	tests/ PASSED	 [ 58%]
	tests/ FAILED	 [ 58%]
	tests/ FAILED		 [ 59%]

	For more information about this error, try `rustc --explain E0512`.
	error: could not compile `ruff_python_ast` (lib) due to 2 previous errors
	warning: build failed, waiting for other jobs to finish...
	Caused by: Cargo build finished with "exit status: 101": `env
	-u CARGO CARGO_ENCODED_RUSTFLAGS="-Clink-args=-ljemalloc" "cargo"
	"rustc" "--message-format" "json-render-diagnostics" "--manifest-path"
	"/usr/src/RPM/BUILD/ruff-0.2.1/crates/ruff/Cargo.toml" "--release" "--bin" "ruff" "--"
	"-C" "link-arg=-s"`
	Error: command ['maturin', 'pep517', 'build-wheel', '-i', '/usr/bin/python3',
	'--compatibility', 'off'] returned non-zero exit status 1
	Traceback (most recent call last):
	raise RuntimeError(err_msg) from None
	RuntimeError: build_wheel failed

	11 error logs REMOVED from the list

Total 167 error logs.

^ permalink raw reply	[flat|nested] only message in thread

only message in thread, other threads:[~2024-02-12  5:11 UTC | newest]

Thread overview: (only message) (download: mbox.gz / follow: Atom feed)
-- links below jump to the message on this page --
2024-02-12  5:11 [cyber] I: Sisyphus-20240212 x86_64 beehive_status: +12 -11 (167) ALT beekeeper

ALT Linux Sisyphus cybertalk

This inbox may be cloned and mirrored by anyone:

	git clone --mirror sisyphus-cybertalk/git/0.git

	# If you have public-inbox 1.1+ installed, you may
	# initialize and index your mirror using the following commands:
	public-inbox-init -V2 sisyphus-cybertalk sisyphus-cybertalk/ \
	public-inbox-index sisyphus-cybertalk

Example config snippet for mirrors.
Newsgroup available over NNTP:

AGPL code for this site: git clone