ALT Linux Sisyphus cybertalk
 help / color / mirror / Atom feed
* [cyber] I: Sisyphus-20230526 x86_64 beehive_status: +4 -6 (121)
@ 2023-05-26  4:58 ALT beekeeper
  0 siblings, 0 replies; only message in thread
From: ALT beekeeper @ 2023-05-26  4:58 UTC (permalink / raw)
  To: sisyphus-cybertalk

	4 NEW error logs

	RPM build errors:
	Unparseable macro: % by %%)
	Macro %z not found
	ignored self-provides: java-1.8.0-openjdk = 0:
	ignored self-provides: java-1.8.0-openjdk-headless = 0:
	ignored self-provides: java-1.8.0-openjdk-devel = 0:
	ignored self-provides: java-1.8.0-openjdk-demo = 0:
	ignored self-provides: java-1.8.0-openjdk-src = 0:
	ignored self-provides: java-1.8.0-openjdk-javadoc = 0:
	Unparseable macro: %.*}"

	[  PASSED  ] 232 tests.
	[  FAILED  ] 1 test, listed below:
	[  FAILED  ] ThreadDecodeFile/ThreadDecoderOutputTest.CompareOutput/29, where GetParam()
	= 16-byte object <26-E0 FD-57 8F-55 00-00 28-FE FD-57 8F-55 00-00>
	[OpenH264] this = 0x0x558f593b9730, Error:Don't support width(7) or height(15) which
	is less than 16!
	[OpenH264] this = 0x0x558f593b9730, Error:CWelsH264SVCEncoder::EncodeFrame(),
	kiEncoderReturn 5
	Summary of Failures:

	ERROR: delorean_tests (unittest.loader._FailedTest)
	ImportError: Failed to import test module: delorean_tests
	Traceback (most recent call last):
	from import tzlocal
	ModuleNotFoundError: No module named 'dateutil'
	Ran 1 test in 0.000s
	FAILED (errors=1)
	INFO	 : Command's result: FAILURE
	INFO	 : Command's error: Command '['python3', '-m', 'unittest',
	'tests/']' returned non-zero exit status 1.

	result = pytester.runpytest("-n1")
	>	result.stdout.fnmatch_lines(["*RuntimeError: Some runtime error*"])
	E	Failed: nomatch: '*RuntimeError: Some runtime error*'
	E	    and: '============================= test session starts
	E	    and: 'INTERNALERROR>     raise IOError("cannot send to {!r}".format(self))'
	E	    and: 'INTERNALERROR> OSError: cannot send to <Channel id=1 closed>'
	E	    and: ''
	E	    and: '============================ no tests ran in 0.33s
	E	remains unmatched: '*RuntimeError: Some runtime error*'
	INTERNALERROR>	   raise IOError("cannot send to {!r}".format(self))
	INTERNALERROR> OSError: cannot send to <Channel id=1 closed>
	============================ no tests ran in 0.33s =============================
	XFAIL testing/[Nested] - Nested
	warning classes are not supported.
	FAILED testing/
	======= 1 failed, 185 passed, 6 skipped, 11 xfailed in 64.90s (0:01:04) ========
	INFO	 : Command's result: FAILURE
	INFO	 : Command's error: Command '['python3', '-m', 'pytest', '-ra']' returned
	non-zero exit status 1.
	error: Bad exit status from /usr/src/tmp/rpm-tmp.55088 (%check)

	6 error logs REMOVED from the list

Total 121 error logs.

^ permalink raw reply	[flat|nested] only message in thread

only message in thread, other threads:[~2023-05-26  4:58 UTC | newest]

Thread overview: (only message) (download: mbox.gz / follow: Atom feed)
-- links below jump to the message on this page --
2023-05-26  4:58 [cyber] I: Sisyphus-20230526 x86_64 beehive_status: +4 -6 (121) ALT beekeeper

ALT Linux Sisyphus cybertalk

This inbox may be cloned and mirrored by anyone:

	git clone --mirror sisyphus-cybertalk/git/0.git

	# If you have public-inbox 1.1+ installed, you may
	# initialize and index your mirror using the following commands:
	public-inbox-init -V2 sisyphus-cybertalk sisyphus-cybertalk/ \
	public-inbox-index sisyphus-cybertalk

Example config snippet for mirrors.
Newsgroup available over NNTP:

AGPL code for this site: git clone