ALT Linux Sisyphus cybertalk
 help / color / mirror / Atom feed
* [cyber] I: p10-20220918 x86_64 beehive_status: +6 -7 (33)
@ 2022-09-18  2:51 ALT beekeeper
  0 siblings, 0 replies; only message in thread
From: ALT beekeeper @ 2022-09-18  2:51 UTC (permalink / raw)
  To: sisyphus-cybertalk

	6 NEW error logs

	/bin/sh ../../libtool --mode=link x86_64-alt-linux-gcc	-pipe -frecord-gcc-switches
	-Wall -g -O2 -Wall  -o -rpath /usr/lib64 -lSDL -lpthread -lSDL_mixer
	sound_sdl.lo  -lglib-2.0
	libtool: link: rm -fr  .libs/libsound_sdl.a
	libtool: link: x86_64-alt-linux-gcc -shared  -fPIC -DPIC  .libs/sound_sdl.o   -lSDL
	-lpthread -lSDL_mixer -lglib-2.0  -g -O2   -Wl,-soname -Wl, -o
	libtool: link: (cd ".libs" && rm -f "" && ln -s ""
	libtool: link: (cd ".libs" && rm -f "" && ln -s ""
	libtool: link: ( cd ".libs" && rm -f "" && ln -s "../"
	"" )
	make[3]: Leaving directory '/usr/src/RPM/BUILD/dopewars/src/plugins'
	make[2]: *** [Makefile:574: all-recursive] Error 1
	make[1]: *** [Makefile:476: all-recursive] Error 1
	make: *** [Makefile:404: all] Error 2

	UNSUPPORTED: sunrpc/tst-svc_register
	FAIL: time/tst-cpuclock1
	Summary of test results:
	+ rc=2
	+ grep '^FAIL:' build-x86_64-linux/tests.sum
	+ cut '-d ' -f2-
	==> build-x86_64-linux/time/tst-cpuclock1.test-result <==
	FAIL: time/tst-cpuclock1
	original exit status 1

	libxfce4util-private.c: In function '_xfce_i18n_init':
	libxfce4util-private.c:57:23: error: 'GETTEXT_PACKAGE' undeclared (first use in this
	57 |	   bindtextdomain (GETTEXT_PACKAGE, PACKAGE_LOCALE_DIR);

	Verifying ELF objects in /usr/src/tmp/meschach-buildroot
	verify-elf: ERROR: ./usr/lib64/ undefined symbol: _zv_copy
	verify-elf: ERROR: ./usr/lib64/ undefined symbol: zv_zero
	verify-elf: ERROR: ./usr/lib64/ undefined symbol: zadd
	verify-elf: ERROR: ./usr/lib64/ undefined symbol: zv_resize
	verify-elf: ERROR: ./usr/lib64/ undefined symbol: zsqrt
	verify-elf: ERROR: ./usr/lib64/ undefined symbol: _zm_copy
	verify-elf: ERROR: ./usr/lib64/ undefined symbol: _zv_norm2
	verify-elf: ERROR: ./usr/lib64/ undefined symbol: zget_col
	verify-elf: ERROR: ./usr/lib64/ undefined symbol: __zzero__
	verify-elf: ERROR: ./usr/lib64/ undefined symbol: _zin_prod
	verify-elf: ERROR: ./usr/lib64/ undefined symbol: zabs

	Result: FAIL
	Failed 1/13 test programs. 0/116 subtests failed.
	make: *** [Makefile:773: test_dynamic] Error 255

	[Internal test-run error] The following tasks were dispatched to some worker task queue,
	but were not reported as done (does not matters success or fail):
	- [box-py/, null]
	make[3]: *** [test/CMakeFiles/test-force.dir/build.make:70: test/CMakeFiles/test-force]
	Error 4
	make[3]: Leaving directory '/usr/src/RPM/BUILD/tarantool-2.8.4'
	make[2]: *** [CMakeFiles/Makefile2:5330: test/CMakeFiles/test-force.dir/all] Error 2
	make[2]: Leaving directory '/usr/src/RPM/BUILD/tarantool-2.8.4'
	make[1]: *** [CMakeFiles/Makefile2:5337: test/CMakeFiles/test-force.dir/rule] Error 2
	make[1]: Leaving directory '/usr/src/RPM/BUILD/tarantool-2.8.4'
	make: *** [Makefile:2061: test-force] Error 2
	make: Leaving directory '/usr/src/RPM/BUILD/tarantool-2.8.4'

	7 error logs REMOVED from the list

Total 33 error logs.

^ permalink raw reply	[flat|nested] only message in thread

only message in thread, other threads:[~2022-09-18  2:51 UTC | newest]

Thread overview: (only message) (download: mbox.gz / follow: Atom feed)
-- links below jump to the message on this page --
2022-09-18  2:51 [cyber] I: p10-20220918 x86_64 beehive_status: +6 -7 (33) ALT beekeeper

ALT Linux Sisyphus cybertalk

This inbox may be cloned and mirrored by anyone:

	git clone --mirror sisyphus-cybertalk/git/0.git

	# If you have public-inbox 1.1+ installed, you may
	# initialize and index your mirror using the following commands:
	public-inbox-init -V2 sisyphus-cybertalk sisyphus-cybertalk/ \
	public-inbox-index sisyphus-cybertalk

Example config snippet for mirrors.
Newsgroup available over NNTP:

AGPL code for this site: git clone