ALT Linux Girar Builder robot reports
 help / color / mirror / Atom feed
* [#435322] p10 FAILED kernel-image.git=kernel-image-un-def-6.1.189-alt1 ...
@ 2026-10-03 13:40 Girar awaiter (kernelbot)
  2026-10-03 15:16 ` [#435322] p10 FAILED (try 2) kernel-image.git=kernel-image-un-def-6.1.189-alt1 Girar awaiter (kernelbot)
                   ` (4 more replies)
  0 siblings, 5 replies; 6+ messages in thread
From: Girar awaiter (kernelbot) @ 2026-10-03 13:40 UTC (permalink / raw)
  To: Kernel Bot; +Cc: girar-builder-p10, sisyphus-incominger, girar-builder-p10

https://git.altlinux.org/tasks/435322/logs/events.1.1.log
https://packages.altlinux.org/tasks/435322

subtask  name                                  aarch64   armh    i586  x86_64
   #100  kernel-image                            29:48  57:33   33:32   32:18
   #200  kernel-modules-LiME-un-def                 45   1:04      29      30
   #300  kernel-modules-accel-ppp-un-def            47      -      30      31
   #400  kernel-modules-anbox-un-def                46   1:05      29      29
   #500  kernel-modules-bcmwl-un-def                 -      -       -      33
   #600  kernel-modules-dm-secdel-un-def          1:14   2:07      54      55
   #700  kernel-modules-drbd9-un-def              3:48      -       -    2:06
  #1000  kernel-modules-evdi-un-def                 43   1:04      28      29
  #1100  kernel-modules-i40e-un-def                 53      -       -      35
  #1200  kernel-modules-iavf-un-def                 45      -       -      30
  #1300  kernel-modules-ipt-ratelimit-un-def        42   1:02      28      28
  #1400  kernel-modules-ipt_netflow-un-def          53      -      33      34
  #1500  kernel-modules-ixgbe-un-def                54      -       -      36
  #1600  kernel-modules-lkrg-un-def                  -      -      53      54
  #1700  kernel-modules-nvidia-un-def             2:06      -    1:11    2:07
  #2000  kernel-modules-r8125-un-def                 -      -      33      35
  #2100  kernel-modules-r8168-un-def              1:21   1:48      40      41
  #2200  kernel-modules-rtl8188eu-un-def             -      -  failed  failed
  #2700  kernel-modules-rtl88x2bu-un-def        failed      -       ?       ?
  #3000  kernel-modules-rtw89-un-def                 ?   1:16       ?       ?
  #3200  kernel-modules-v4l2loopback-un-def          ?   1:00       ?       ?
  #3300  kernel-modules-vhba-un-def                  ?   1:00       ?       ?
  #3600  kernel-modules-xtables-addons-un-def        ?   1:49       ?       ?
  #3700  kernel-modules-zfs-un-def                   ?   8:04       ?       ?

2026-Oct-03 12:09:39 :: task #435322 for p10 started by kernelbot:
2026-Oct-03 12:09:39 :: message: v6.1.189
#100 build kernel-image-un-def-6.1.189-alt1 from /people/kernelbot/packages/kernel-image.git fetched at 2026-Oct-03 12:07:12
#200 build sisyphus/kernel-modules-LiME-un-def-1.9.1-alt1 from /gears/k/kernel-modules-LiME-un-def.git fetched at 2026-Oct-03 12:07:17 from p10
#300 build sisyphus/kernel-modules-accel-ppp-un-def-1.12.0-alt3 from /gears/k/kernel-modules-accel-ppp-un-def.git fetched at 2026-Oct-03 12:07:22 from p10
#400 build sisyphus/kernel-modules-anbox-un-def-14-alt2.gae26ba2 from /gears/k/kernel-modules-anbox-un-def.git fetched at 2026-Oct-03 12:07:23 from p10
#500 build sisyphus/kernel-modules-bcmwl-un-def-6.30.223.271-alt15 from /gears/k/kernel-modules-bcmwl-un-def.git fetched at 2026-Oct-03 12:07:32 from p10
#600 build sisyphus/kernel-modules-dm-secdel-un-def-1.0.9-alt1 from /gears/k/kernel-modules-dm-secdel-un-def.git fetched at 2026-Oct-03 12:07:33 from p10
#700 build sisyphus/kernel-modules-drbd9-un-def-9.2.12-alt1 from /gears/k/kernel-modules-drbd9-un-def.git fetched at 2026-Oct-03 12:07:37 from p10
#1000 build sisyphus/kernel-modules-evdi-un-def-1.14.1-alt1 from /gears/k/kernel-modules-evdi-un-def.git fetched at 2026-Oct-03 12:07:39 from p10
#1100 build sisyphus/kernel-modules-i40e-un-def-2.22.20-alt1 from /gears/k/kernel-modules-i40e-un-def.git fetched at 2026-Oct-03 12:07:40 from p10
#1200 build sisyphus/kernel-modules-iavf-un-def-4.8.3-alt1 from /gears/k/kernel-modules-iavf-un-def.git fetched at 2026-Oct-03 12:07:41 from p10
#1300 build sisyphus/kernel-modules-ipt-ratelimit-un-def-0.3.3-alt1 from /gears/k/kernel-modules-ipt-ratelimit-un-def.git fetched at 2026-Oct-03 12:07:48 from p10
#1400 build sisyphus/kernel-modules-ipt_netflow-un-def-2.6-alt1 from /gears/k/kernel-modules-ipt_netflow-un-def.git fetched at 2026-Oct-03 12:07:54 from p10
#1500 build sisyphus/kernel-modules-ixgbe-un-def-5.20.10-alt1 from /gears/k/kernel-modules-ixgbe-un-def.git fetched at 2026-Oct-03 12:07:57 from p10
#1600 build sisyphus/kernel-modules-lkrg-un-def-0.9.8-alt3 from /gears/k/kernel-modules-lkrg-un-def.git fetched at 2026-Oct-03 12:08:01 from p10
#1700 build sisyphus/kernel-modules-nvidia-un-def-550.144.03-alt1 from /gears/k/kernel-modules-nvidia-un-def.git fetched at 2026-Oct-03 12:08:15 from p10
#2000 build sisyphus/kernel-modules-r8125-un-def-9.011.01-alt1 from /gears/k/kernel-modules-r8125-un-def.git fetched at 2026-Oct-03 12:08:18 from p10
#2100 build sisyphus/kernel-modules-r8168-un-def-8.053.01-alt1.k from /gears/k/kernel-modules-r8168-un-def.git fetched at 2026-Oct-03 12:08:26 from p10
#2200 build sisyphus/kernel-modules-rtl8188eu-un-def-5.13.3-alt2 from /gears/k/kernel-modules-rtl8188eu-un-def.git fetched at 2026-Oct-03 12:08:28 from p10
#2300 build sisyphus/kernel-modules-rtl8192eu-un-def-5.11.2.1-alt1 from /gears/k/kernel-modules-rtl8192eu-un-def.git fetched at 2026-Oct-03 12:08:30 from p10
#2400 build sisyphus/kernel-modules-rtl8723du-un-def-5.13.4-alt1 from /gears/k/kernel-modules-rtl8723du-un-def.git fetched at 2026-Oct-03 12:08:31 from p10
#2500 build sisyphus/kernel-modules-rtl8812au-un-def-5.6.4.2-alt1 from /gears/k/kernel-modules-rtl8812au-un-def.git fetched at 2026-Oct-03 12:08:33 from p10
#2600 build sisyphus/kernel-modules-rtl8821cu-un-def-5.12.0.4-alt1 from /gears/k/kernel-modules-rtl8821cu-un-def.git fetched at 2026-Oct-03 12:08:36 from p10
#2700 build sisyphus/kernel-modules-rtl88x2bu-un-def-5.8.7.1-alt5 from /gears/k/kernel-modules-rtl88x2bu-un-def.git fetched at 2026-Oct-03 12:08:37 from p10
#3000 build sisyphus/kernel-modules-rtw89-un-def-0.0-alt4.git.4f3464d from /gears/k/kernel-modules-rtw89-un-def.git fetched at 2026-Oct-03 12:08:40 from p10
#3100 build sisyphus/kernel-modules-sysdig-un-def-7.3.0-alt1 from /gears/k/kernel-modules-sysdig-un-def.git fetched at 2026-Oct-03 12:08:41 from p10
#3200 build sisyphus/kernel-modules-v4l2loopback-un-def-0.12.7-alt1.g5e9dd41 from /gears/k/kernel-modules-v4l2loopback-un-def.git fetched at 2026-Oct-03 12:08:44 from p10
#3300 build sisyphus/kernel-modules-vhba-un-def-20211218-alt1.k from /gears/k/kernel-modules-vhba-un-def.git fetched at 2026-Oct-03 12:08:51 from p10
#3400 build sisyphus/kernel-modules-virtualbox-addition-p10-un-def-7.1.16-alt1 from /gears/k/kernel-modules-virtualbox-addition-un-def.git fetched at 2026-Oct-03 12:09:02 from p10
#3500 build sisyphus/kernel-modules-virtualbox-p10-un-def-7.1.16-alt1 from /gears/k/kernel-modules-virtualbox-un-def.git fetched at 2026-Oct-03 12:09:13 from p10
#3600 build sisyphus/kernel-modules-xtables-addons-un-def-3.23-alt1 from /gears/k/kernel-modules-xtables-addons-un-def.git fetched at 2026-Oct-03 12:09:21 from p10
#3700 build p10/kernel-modules-zfs-un-def-2.1.16-alt1 from /gears/k/kernel-modules-zfs-un-def.git fetched at 2026-Oct-03 12:09:27 from p10
2026-Oct-03 12:09:40 :: created build repo
2026-Oct-03 12:09:41 :: [armh] #100 kernel-image.git kernel-image-un-def-6.1.189-alt1: build start
2026-Oct-03 12:09:41 :: [aarch64] #100 kernel-image.git kernel-image-un-def-6.1.189-alt1: build start
2026-Oct-03 12:09:41 :: [x86_64] #100 kernel-image.git kernel-image-un-def-6.1.189-alt1: build start
2026-Oct-03 12:09:41 :: [i586] #100 kernel-image.git kernel-image-un-def-6.1.189-alt1: build start
2026-Oct-03 12:39:29 :: [aarch64] #100 kernel-image.git kernel-image-un-def-6.1.189-alt1: build OK
2026-Oct-03 12:39:29 :: [aarch64] #200 kernel-modules-LiME-un-def.git sisyphus/kernel-modules-LiME-un-def-1.9.1-alt1: build start
2026-Oct-03 12:40:07 :: [x86_64] #100: pesigning approved by kernelbot
2026-Oct-03 12:40:14 :: [aarch64] #200 kernel-modules-LiME-un-def.git sisyphus/kernel-modules-LiME-un-def-1.9.1-alt1: build OK
2026-Oct-03 12:40:14 :: [aarch64] #300 kernel-modules-accel-ppp-un-def.git sisyphus/kernel-modules-accel-ppp-un-def-1.12.0-alt3: build start
2026-Oct-03 12:41:01 :: [aarch64] #300 kernel-modules-accel-ppp-un-def.git sisyphus/kernel-modules-accel-ppp-un-def-1.12.0-alt3: build OK
2026-Oct-03 12:41:01 :: [aarch64] #400 kernel-modules-anbox-un-def.git sisyphus/kernel-modules-anbox-un-def-14-alt2.gae26ba2: build start
2026-Oct-03 12:41:44 :: [x86_64] #100: kernel-image-un-def: pesign OK
2026-Oct-03 12:41:47 :: [aarch64] #400 kernel-modules-anbox-un-def.git sisyphus/kernel-modules-anbox-un-def-14-alt2.gae26ba2: build OK
2026-Oct-03 12:41:47 :: [aarch64] #500 kernel-modules-bcmwl-un-def.git sisyphus/kernel-modules-bcmwl-un-def-6.30.223.271-alt15: build start
2026-Oct-03 12:41:59 :: [x86_64] #100 kernel-image.git kernel-image-un-def-6.1.189-alt1: build OK
2026-Oct-03 12:41:59 :: [x86_64] #200 kernel-modules-LiME-un-def.git sisyphus/kernel-modules-LiME-un-def-1.9.1-alt1: build start
2026-Oct-03 12:42:10 :: [aarch64] #500 kernel-modules-bcmwl-un-def.git sisyphus/kernel-modules-bcmwl-un-def-6.30.223.271-alt15: build SKIPPED
2026-Oct-03 12:42:11 :: [aarch64] #600 kernel-modules-dm-secdel-un-def.git sisyphus/kernel-modules-dm-secdel-un-def-1.0.9-alt1: build start
2026-Oct-03 12:42:29 :: [x86_64] #200 kernel-modules-LiME-un-def.git sisyphus/kernel-modules-LiME-un-def-1.9.1-alt1: build OK
2026-Oct-03 12:42:30 :: [x86_64] #300 kernel-modules-accel-ppp-un-def.git sisyphus/kernel-modules-accel-ppp-un-def-1.12.0-alt3: build start
2026-Oct-03 12:43:01 :: [x86_64] #300 kernel-modules-accel-ppp-un-def.git sisyphus/kernel-modules-accel-ppp-un-def-1.12.0-alt3: build OK
2026-Oct-03 12:43:01 :: [x86_64] #400 kernel-modules-anbox-un-def.git sisyphus/kernel-modules-anbox-un-def-14-alt2.gae26ba2: build start
2026-Oct-03 12:43:13 :: [i586] #100 kernel-image.git kernel-image-un-def-6.1.189-alt1: build OK
2026-Oct-03 12:43:14 :: [i586] #200 kernel-modules-LiME-un-def.git sisyphus/kernel-modules-LiME-un-def-1.9.1-alt1: build start
2026-Oct-03 12:43:25 :: [aarch64] #600 kernel-modules-dm-secdel-un-def.git sisyphus/kernel-modules-dm-secdel-un-def-1.0.9-alt1: build OK
2026-Oct-03 12:43:25 :: [aarch64] #700 kernel-modules-drbd9-un-def.git sisyphus/kernel-modules-drbd9-un-def-9.2.12-alt1: build start
2026-Oct-03 12:43:30 :: [x86_64] #400 kernel-modules-anbox-un-def.git sisyphus/kernel-modules-anbox-un-def-14-alt2.gae26ba2: build OK
2026-Oct-03 12:43:30 :: [x86_64] #500 kernel-modules-bcmwl-un-def.git sisyphus/kernel-modules-bcmwl-un-def-6.30.223.271-alt15: build start
2026-Oct-03 12:43:43 :: [i586] #200 kernel-modules-LiME-un-def.git sisyphus/kernel-modules-LiME-un-def-1.9.1-alt1: build OK
2026-Oct-03 12:43:44 :: [i586] #300 kernel-modules-accel-ppp-un-def.git sisyphus/kernel-modules-accel-ppp-un-def-1.12.0-alt3: build start
2026-Oct-03 12:44:03 :: [x86_64] #500 kernel-modules-bcmwl-un-def.git sisyphus/kernel-modules-bcmwl-un-def-6.30.223.271-alt15: build OK
2026-Oct-03 12:44:03 :: [x86_64] #600 kernel-modules-dm-secdel-un-def.git sisyphus/kernel-modules-dm-secdel-un-def-1.0.9-alt1: build start
2026-Oct-03 12:44:14 :: [i586] #300 kernel-modules-accel-ppp-un-def.git sisyphus/kernel-modules-accel-ppp-un-def-1.12.0-alt3: build OK
2026-Oct-03 12:44:14 :: [i586] #400 kernel-modules-anbox-un-def.git sisyphus/kernel-modules-anbox-un-def-14-alt2.gae26ba2: build start
2026-Oct-03 12:44:43 :: [i586] #400 kernel-modules-anbox-un-def.git sisyphus/kernel-modules-anbox-un-def-14-alt2.gae26ba2: build OK
2026-Oct-03 12:44:43 :: [i586] #500 kernel-modules-bcmwl-un-def.git sisyphus/kernel-modules-bcmwl-un-def-6.30.223.271-alt15: build start
2026-Oct-03 12:44:57 :: [i586] #500 kernel-modules-bcmwl-un-def.git sisyphus/kernel-modules-bcmwl-un-def-6.30.223.271-alt15: build SKIPPED
2026-Oct-03 12:44:57 :: [i586] #600 kernel-modules-dm-secdel-un-def.git sisyphus/kernel-modules-dm-secdel-un-def-1.0.9-alt1: build start
2026-Oct-03 12:44:58 :: [x86_64] #600 kernel-modules-dm-secdel-un-def.git sisyphus/kernel-modules-dm-secdel-un-def-1.0.9-alt1: build OK
2026-Oct-03 12:44:59 :: [x86_64] #700 kernel-modules-drbd9-un-def.git sisyphus/kernel-modules-drbd9-un-def-9.2.12-alt1: build start
2026-Oct-03 12:45:51 :: [i586] #600 kernel-modules-dm-secdel-un-def.git sisyphus/kernel-modules-dm-secdel-un-def-1.0.9-alt1: build OK
2026-Oct-03 12:45:51 :: [i586] #700 kernel-modules-drbd9-un-def.git sisyphus/kernel-modules-drbd9-un-def-9.2.12-alt1: build start
2026-Oct-03 12:46:05 :: [i586] #700 kernel-modules-drbd9-un-def.git sisyphus/kernel-modules-drbd9-un-def-9.2.12-alt1: build SKIPPED
2026-Oct-03 12:46:06 :: [i586] #1000 kernel-modules-evdi-un-def.git sisyphus/kernel-modules-evdi-un-def-1.14.1-alt1: build start
2026-Oct-03 12:46:34 :: [i586] #1000 kernel-modules-evdi-un-def.git sisyphus/kernel-modules-evdi-un-def-1.14.1-alt1: build OK
2026-Oct-03 12:46:35 :: [i586] #1100 kernel-modules-i40e-un-def.git sisyphus/kernel-modules-i40e-un-def-2.22.20-alt1: build start
2026-Oct-03 12:46:49 :: [i586] #1100 kernel-modules-i40e-un-def.git sisyphus/kernel-modules-i40e-un-def-2.22.20-alt1: build SKIPPED
2026-Oct-03 12:46:49 :: [i586] #1200 kernel-modules-iavf-un-def.git sisyphus/kernel-modules-iavf-un-def-4.8.3-alt1: build start
2026-Oct-03 12:47:03 :: [i586] #1200 kernel-modules-iavf-un-def.git sisyphus/kernel-modules-iavf-un-def-4.8.3-alt1: build SKIPPED
2026-Oct-03 12:47:04 :: [i586] #1300 kernel-modules-ipt-ratelimit-un-def.git sisyphus/kernel-modules-ipt-ratelimit-un-def-0.3.3-alt1: build start
2026-Oct-03 12:47:05 :: [x86_64] #700 kernel-modules-drbd9-un-def.git sisyphus/kernel-modules-drbd9-un-def-9.2.12-alt1: build OK
2026-Oct-03 12:47:05 :: [x86_64] #1000 kernel-modules-evdi-un-def.git sisyphus/kernel-modules-evdi-un-def-1.14.1-alt1: build start
2026-Oct-03 12:47:13 :: [aarch64] #700 kernel-modules-drbd9-un-def.git sisyphus/kernel-modules-drbd9-un-def-9.2.12-alt1: build OK
2026-Oct-03 12:47:13 :: [aarch64] #1000 kernel-modules-evdi-un-def.git sisyphus/kernel-modules-evdi-un-def-1.14.1-alt1: build start
2026-Oct-03 12:47:32 :: [i586] #1300 kernel-modules-ipt-ratelimit-un-def.git sisyphus/kernel-modules-ipt-ratelimit-un-def-0.3.3-alt1: build OK
2026-Oct-03 12:47:33 :: [i586] #1400 kernel-modules-ipt_netflow-un-def.git sisyphus/kernel-modules-ipt_netflow-un-def-2.6-alt1: build start
2026-Oct-03 12:47:34 :: [x86_64] #1000 kernel-modules-evdi-un-def.git sisyphus/kernel-modules-evdi-un-def-1.14.1-alt1: build OK
2026-Oct-03 12:47:34 :: [x86_64] #1100 kernel-modules-i40e-un-def.git sisyphus/kernel-modules-i40e-un-def-2.22.20-alt1: build start
2026-Oct-03 12:47:56 :: [aarch64] #1000 kernel-modules-evdi-un-def.git sisyphus/kernel-modules-evdi-un-def-1.14.1-alt1: build OK
2026-Oct-03 12:47:56 :: [aarch64] #1100 kernel-modules-i40e-un-def.git sisyphus/kernel-modules-i40e-un-def-2.22.20-alt1: build start
2026-Oct-03 12:48:06 :: [i586] #1400 kernel-modules-ipt_netflow-un-def.git sisyphus/kernel-modules-ipt_netflow-un-def-2.6-alt1: build OK
2026-Oct-03 12:48:06 :: [i586] #1500 kernel-modules-ixgbe-un-def.git sisyphus/kernel-modules-ixgbe-un-def-5.20.10-alt1: build start
2026-Oct-03 12:48:09 :: [x86_64] #1100 kernel-modules-i40e-un-def.git sisyphus/kernel-modules-i40e-un-def-2.22.20-alt1: build OK
2026-Oct-03 12:48:09 :: [x86_64] #1200 kernel-modules-iavf-un-def.git sisyphus/kernel-modules-iavf-un-def-4.8.3-alt1: build start
2026-Oct-03 12:48:20 :: [i586] #1500 kernel-modules-ixgbe-un-def.git sisyphus/kernel-modules-ixgbe-un-def-5.20.10-alt1: build SKIPPED
2026-Oct-03 12:48:20 :: [i586] #1600 kernel-modules-lkrg-un-def.git sisyphus/kernel-modules-lkrg-un-def-0.9.8-alt3: build start
2026-Oct-03 12:48:39 :: [x86_64] #1200 kernel-modules-iavf-un-def.git sisyphus/kernel-modules-iavf-un-def-4.8.3-alt1: build OK
2026-Oct-03 12:48:40 :: [x86_64] #1300 kernel-modules-ipt-ratelimit-un-def.git sisyphus/kernel-modules-ipt-ratelimit-un-def-0.3.3-alt1: build start
2026-Oct-03 12:48:49 :: [aarch64] #1100 kernel-modules-i40e-un-def.git sisyphus/kernel-modules-i40e-un-def-2.22.20-alt1: build OK
2026-Oct-03 12:48:50 :: [aarch64] #1200 kernel-modules-iavf-un-def.git sisyphus/kernel-modules-iavf-un-def-4.8.3-alt1: build start
2026-Oct-03 12:49:08 :: [x86_64] #1300 kernel-modules-ipt-ratelimit-un-def.git sisyphus/kernel-modules-ipt-ratelimit-un-def-0.3.3-alt1: build OK
2026-Oct-03 12:49:08 :: [x86_64] #1400 kernel-modules-ipt_netflow-un-def.git sisyphus/kernel-modules-ipt_netflow-un-def-2.6-alt1: build start
2026-Oct-03 12:49:13 :: [i586] #1600 kernel-modules-lkrg-un-def.git sisyphus/kernel-modules-lkrg-un-def-0.9.8-alt3: build OK
2026-Oct-03 12:49:13 :: [i586] #1700 kernel-modules-nvidia-un-def.git sisyphus/kernel-modules-nvidia-un-def-550.144.03-alt1: build start
2026-Oct-03 12:49:35 :: [aarch64] #1200 kernel-modules-iavf-un-def.git sisyphus/kernel-modules-iavf-un-def-4.8.3-alt1: build OK
2026-Oct-03 12:49:36 :: [aarch64] #1300 kernel-modules-ipt-ratelimit-un-def.git sisyphus/kernel-modules-ipt-ratelimit-un-def-0.3.3-alt1: build start
2026-Oct-03 12:49:42 :: [x86_64] #1400 kernel-modules-ipt_netflow-un-def.git sisyphus/kernel-modules-ipt_netflow-un-def-2.6-alt1: build OK
2026-Oct-03 12:49:42 :: [x86_64] #1500 kernel-modules-ixgbe-un-def.git sisyphus/kernel-modules-ixgbe-un-def-5.20.10-alt1: build start
2026-Oct-03 12:50:18 :: [x86_64] #1500 kernel-modules-ixgbe-un-def.git sisyphus/kernel-modules-ixgbe-un-def-5.20.10-alt1: build OK
2026-Oct-03 12:50:18 :: [aarch64] #1300 kernel-modules-ipt-ratelimit-un-def.git sisyphus/kernel-modules-ipt-ratelimit-un-def-0.3.3-alt1: build OK
2026-Oct-03 12:50:18 :: [x86_64] #1600 kernel-modules-lkrg-un-def.git sisyphus/kernel-modules-lkrg-un-def-0.9.8-alt3: build start
2026-Oct-03 12:50:18 :: [aarch64] #1400 kernel-modules-ipt_netflow-un-def.git sisyphus/kernel-modules-ipt_netflow-un-def-2.6-alt1: build start
2026-Oct-03 12:50:24 :: [i586] #1700 kernel-modules-nvidia-un-def.git sisyphus/kernel-modules-nvidia-un-def-550.144.03-alt1: build OK
2026-Oct-03 12:50:25 :: [i586] #2000 kernel-modules-r8125-un-def.git sisyphus/kernel-modules-r8125-un-def-9.011.01-alt1: build start
2026-Oct-03 12:50:58 :: [i586] #2000 kernel-modules-r8125-un-def.git sisyphus/kernel-modules-r8125-un-def-9.011.01-alt1: build OK
2026-Oct-03 12:50:59 :: [i586] #2100 kernel-modules-r8168-un-def.git sisyphus/kernel-modules-r8168-un-def-8.053.01-alt1.k: build start
2026-Oct-03 12:51:11 :: [aarch64] #1400 kernel-modules-ipt_netflow-un-def.git sisyphus/kernel-modules-ipt_netflow-un-def-2.6-alt1: build OK
2026-Oct-03 12:51:12 :: [aarch64] #1500 kernel-modules-ixgbe-un-def.git sisyphus/kernel-modules-ixgbe-un-def-5.20.10-alt1: build start
2026-Oct-03 12:51:12 :: [x86_64] #1600 kernel-modules-lkrg-un-def.git sisyphus/kernel-modules-lkrg-un-def-0.9.8-alt3: build OK
2026-Oct-03 12:51:13 :: [x86_64] #1700 kernel-modules-nvidia-un-def.git sisyphus/kernel-modules-nvidia-un-def-550.144.03-alt1: build start
2026-Oct-03 12:51:39 :: [i586] #2100 kernel-modules-r8168-un-def.git sisyphus/kernel-modules-r8168-un-def-8.053.01-alt1.k: build OK
2026-Oct-03 12:51:39 :: [i586] #2200 kernel-modules-rtl8188eu-un-def.git sisyphus/kernel-modules-rtl8188eu-un-def-5.13.3-alt2: build start
[i586]   CC [M]  /usr/src/RPM/BUILD/kernel-source-rtl8188eu-5.13.3/os_dep/linux/usb_intf.o
[i586] /usr/src/RPM/BUILD/kernel-source-rtl8188eu-5.13.3/os_dep/linux/usb_intf.c:351:10: error: 'struct usb_driver' has no member named 'drvwrap'
[i586]   351 |  .usbdrv.drvwrap.driver.shutdown = rtw_dev_shutdown,
2026-Oct-03 12:52:04 :: [i586] kernel-modules-rtl8188eu-un-def.git sisyphus/kernel-modules-rtl8188eu-un-def-5.13.3-alt2: remote: build failed
2026-Oct-03 12:52:04 :: [i586] #2200 kernel-modules-rtl8188eu-un-def.git sisyphus/kernel-modules-rtl8188eu-un-def-5.13.3-alt2: build FAILED
2026-Oct-03 12:52:06 :: [aarch64] #1500 kernel-modules-ixgbe-un-def.git sisyphus/kernel-modules-ixgbe-un-def-5.20.10-alt1: build OK
2026-Oct-03 12:52:06 :: [aarch64] #1600 kernel-modules-lkrg-un-def.git sisyphus/kernel-modules-lkrg-un-def-0.9.8-alt3: build start
2026-Oct-03 12:52:30 :: [aarch64] #1600 kernel-modules-lkrg-un-def.git sisyphus/kernel-modules-lkrg-un-def-0.9.8-alt3: build SKIPPED
2026-Oct-03 12:52:30 :: [aarch64] #1700 kernel-modules-nvidia-un-def.git sisyphus/kernel-modules-nvidia-un-def-550.144.03-alt1: build start
2026-Oct-03 12:53:20 :: [x86_64] #1700 kernel-modules-nvidia-un-def.git sisyphus/kernel-modules-nvidia-un-def-550.144.03-alt1: build OK
2026-Oct-03 12:53:21 :: [x86_64] #2000 kernel-modules-r8125-un-def.git sisyphus/kernel-modules-r8125-un-def-9.011.01-alt1: build start
2026-Oct-03 12:53:56 :: [x86_64] #2000 kernel-modules-r8125-un-def.git sisyphus/kernel-modules-r8125-un-def-9.011.01-alt1: build OK
2026-Oct-03 12:53:57 :: [x86_64] #2100 kernel-modules-r8168-un-def.git sisyphus/kernel-modules-r8168-un-def-8.053.01-alt1.k: build start
2026-Oct-03 12:54:36 :: [aarch64] #1700 kernel-modules-nvidia-un-def.git sisyphus/kernel-modules-nvidia-un-def-550.144.03-alt1: build OK
2026-Oct-03 12:54:36 :: [aarch64] #2000 kernel-modules-r8125-un-def.git sisyphus/kernel-modules-r8125-un-def-9.011.01-alt1: build start
2026-Oct-03 12:54:38 :: [x86_64] #2100 kernel-modules-r8168-un-def.git sisyphus/kernel-modules-r8168-un-def-8.053.01-alt1.k: build OK
2026-Oct-03 12:54:38 :: [x86_64] #2200 kernel-modules-rtl8188eu-un-def.git sisyphus/kernel-modules-rtl8188eu-un-def-5.13.3-alt2: build start
2026-Oct-03 12:55:00 :: [aarch64] #2000 kernel-modules-r8125-un-def.git sisyphus/kernel-modules-r8125-un-def-9.011.01-alt1: build SKIPPED
2026-Oct-03 12:55:00 :: [aarch64] #2100 kernel-modules-r8168-un-def.git sisyphus/kernel-modules-r8168-un-def-8.053.01-alt1.k: build start
[x86_64]   CC [M]  /usr/src/RPM/BUILD/kernel-source-rtl8188eu-5.13.3/os_dep/linux/usb_intf.o
[x86_64] /usr/src/RPM/BUILD/kernel-source-rtl8188eu-5.13.3/os_dep/linux/usb_intf.c:351:10: error: 'struct usb_driver' has no member named 'drvwrap'
[x86_64]   351 |  .usbdrv.drvwrap.driver.shutdown = rtw_dev_shutdown,
2026-Oct-03 12:55:03 :: [x86_64] kernel-modules-rtl8188eu-un-def.git sisyphus/kernel-modules-rtl8188eu-un-def-5.13.3-alt2: remote: build failed
2026-Oct-03 12:55:03 :: [x86_64] #2200 kernel-modules-rtl8188eu-un-def.git sisyphus/kernel-modules-rtl8188eu-un-def-5.13.3-alt2: build FAILED
2026-Oct-03 12:56:21 :: [aarch64] #2100 kernel-modules-r8168-un-def.git sisyphus/kernel-modules-r8168-un-def-8.053.01-alt1.k: build OK
2026-Oct-03 12:56:21 :: [aarch64] #2200 kernel-modules-rtl8188eu-un-def.git sisyphus/kernel-modules-rtl8188eu-un-def-5.13.3-alt2: build start
2026-Oct-03 12:56:47 :: [aarch64] #2200 kernel-modules-rtl8188eu-un-def.git sisyphus/kernel-modules-rtl8188eu-un-def-5.13.3-alt2: build SKIPPED
2026-Oct-03 12:56:47 :: [aarch64] #2300 kernel-modules-rtl8192eu-un-def.git sisyphus/kernel-modules-rtl8192eu-un-def-5.11.2.1-alt1: build start
2026-Oct-03 12:57:13 :: [aarch64] #2300 kernel-modules-rtl8192eu-un-def.git sisyphus/kernel-modules-rtl8192eu-un-def-5.11.2.1-alt1: build SKIPPED
2026-Oct-03 12:57:13 :: [aarch64] #2400 kernel-modules-rtl8723du-un-def.git sisyphus/kernel-modules-rtl8723du-un-def-5.13.4-alt1: build start
2026-Oct-03 12:57:38 :: [aarch64] #2400 kernel-modules-rtl8723du-un-def.git sisyphus/kernel-modules-rtl8723du-un-def-5.13.4-alt1: build SKIPPED
2026-Oct-03 12:57:38 :: [aarch64] #2500 kernel-modules-rtl8812au-un-def.git sisyphus/kernel-modules-rtl8812au-un-def-5.6.4.2-alt1: build start
2026-Oct-03 12:58:03 :: [aarch64] #2500 kernel-modules-rtl8812au-un-def.git sisyphus/kernel-modules-rtl8812au-un-def-5.6.4.2-alt1: build SKIPPED
2026-Oct-03 12:58:03 :: [aarch64] #2600 kernel-modules-rtl8821cu-un-def.git sisyphus/kernel-modules-rtl8821cu-un-def-5.12.0.4-alt1: build start
2026-Oct-03 12:58:28 :: [aarch64] #2600 kernel-modules-rtl8821cu-un-def.git sisyphus/kernel-modules-rtl8821cu-un-def-5.12.0.4-alt1: build SKIPPED
2026-Oct-03 12:58:28 :: [aarch64] #2700 kernel-modules-rtl88x2bu-un-def.git sisyphus/kernel-modules-rtl88x2bu-un-def-5.8.7.1-alt5: build start
[aarch64] In file included from /usr/src/RPM/BUILD/kernel-source-rtl88x2bu-5.8.7.1/include/drv_types.h:105,
[aarch64]                  from /usr/src/RPM/BUILD/kernel-source-rtl88x2bu-5.8.7.1/hal/hal_com_phycfg.c:17:
[aarch64] /usr/src/RPM/BUILD/kernel-source-rtl88x2bu-5.8.7.1/include/rtw_mlme_ext.h: In function 'check_mlmeinfo_state':
[aarch64] /usr/src/RPM/BUILD/kernel-source-rtl88x2bu-5.8.7.1/include/rtw_mlme_ext.h:603:42: warning: comparison of integer expressions of different signedness: 'u32' {aka 'unsigned int'} and 'sint' {aka 'int'} [-Wsign-compare]
[aarch64]   603 |  if ((plmeext->mlmext_info.state & 0x03) == state)
[aarch64] make[1]: *** [Makefile:2022: /usr/src/RPM/BUILD/kernel-source-rtl88x2bu-5.8.7.1] Error 2
[aarch64] make: *** [Makefile:2392: modules] Error 2
[aarch64] error: Bad exit status from /usr/src/tmp/rpm-tmp.67593 (%build)
[aarch64] RPM build errors:
[aarch64]     line 27: Deprecated PreReq converted to Requires(pre,postun): PreReq: kernel-image-un-def = 1:6.1.189-alt1
2026-Oct-03 12:59:10 :: [aarch64] kernel-modules-rtl88x2bu-un-def.git sisyphus/kernel-modules-rtl88x2bu-un-def-5.8.7.1-alt5: remote: build failed
2026-Oct-03 12:59:10 :: [aarch64] #2700 kernel-modules-rtl88x2bu-un-def.git sisyphus/kernel-modules-rtl88x2bu-un-def-5.8.7.1-alt5: build FAILED
2026-Oct-03 13:07:14 :: [armh] #100 kernel-image.git kernel-image-un-def-6.1.189-alt1: build OK
2026-Oct-03 13:07:15 :: [armh] #200 kernel-modules-LiME-un-def.git sisyphus/kernel-modules-LiME-un-def-1.9.1-alt1: build start
2026-Oct-03 13:08:19 :: [armh] #200 kernel-modules-LiME-un-def.git sisyphus/kernel-modules-LiME-un-def-1.9.1-alt1: build OK
2026-Oct-03 13:08:19 :: [armh] #300 kernel-modules-accel-ppp-un-def.git sisyphus/kernel-modules-accel-ppp-un-def-1.12.0-alt3: build start
2026-Oct-03 13:08:57 :: [armh] #300 kernel-modules-accel-ppp-un-def.git sisyphus/kernel-modules-accel-ppp-un-def-1.12.0-alt3: build SKIPPED
2026-Oct-03 13:08:57 :: [armh] #400 kernel-modules-anbox-un-def.git sisyphus/kernel-modules-anbox-un-def-14-alt2.gae26ba2: build start
2026-Oct-03 13:10:02 :: [armh] #400 kernel-modules-anbox-un-def.git sisyphus/kernel-modules-anbox-un-def-14-alt2.gae26ba2: build OK
2026-Oct-03 13:10:02 :: [armh] #500 kernel-modules-bcmwl-un-def.git sisyphus/kernel-modules-bcmwl-un-def-6.30.223.271-alt15: build start
2026-Oct-03 13:10:37 :: [armh] #500 kernel-modules-bcmwl-un-def.git sisyphus/kernel-modules-bcmwl-un-def-6.30.223.271-alt15: build SKIPPED
2026-Oct-03 13:10:37 :: [armh] #600 kernel-modules-dm-secdel-un-def.git sisyphus/kernel-modules-dm-secdel-un-def-1.0.9-alt1: build start
2026-Oct-03 13:12:44 :: [armh] #600 kernel-modules-dm-secdel-un-def.git sisyphus/kernel-modules-dm-secdel-un-def-1.0.9-alt1: build OK
2026-Oct-03 13:12:44 :: [armh] #700 kernel-modules-drbd9-un-def.git sisyphus/kernel-modules-drbd9-un-def-9.2.12-alt1: build start
2026-Oct-03 13:13:21 :: [armh] #700 kernel-modules-drbd9-un-def.git sisyphus/kernel-modules-drbd9-un-def-9.2.12-alt1: build SKIPPED
2026-Oct-03 13:13:21 :: [armh] #1000 kernel-modules-evdi-un-def.git sisyphus/kernel-modules-evdi-un-def-1.14.1-alt1: build start
2026-Oct-03 13:14:25 :: [armh] #1000 kernel-modules-evdi-un-def.git sisyphus/kernel-modules-evdi-un-def-1.14.1-alt1: build OK
2026-Oct-03 13:14:25 :: [armh] #1100 kernel-modules-i40e-un-def.git sisyphus/kernel-modules-i40e-un-def-2.22.20-alt1: build start
2026-Oct-03 13:15:00 :: [armh] #1100 kernel-modules-i40e-un-def.git sisyphus/kernel-modules-i40e-un-def-2.22.20-alt1: build SKIPPED
2026-Oct-03 13:15:01 :: [armh] #1200 kernel-modules-iavf-un-def.git sisyphus/kernel-modules-iavf-un-def-4.8.3-alt1: build start
2026-Oct-03 13:15:37 :: [armh] #1200 kernel-modules-iavf-un-def.git sisyphus/kernel-modules-iavf-un-def-4.8.3-alt1: build SKIPPED
2026-Oct-03 13:15:37 :: [armh] #1300 kernel-modules-ipt-ratelimit-un-def.git sisyphus/kernel-modules-ipt-ratelimit-un-def-0.3.3-alt1: build start
2026-Oct-03 13:16:39 :: [armh] #1300 kernel-modules-ipt-ratelimit-un-def.git sisyphus/kernel-modules-ipt-ratelimit-un-def-0.3.3-alt1: build OK
2026-Oct-03 13:16:39 :: [armh] #1400 kernel-modules-ipt_netflow-un-def.git sisyphus/kernel-modules-ipt_netflow-un-def-2.6-alt1: build start
2026-Oct-03 13:17:14 :: [armh] #1400 kernel-modules-ipt_netflow-un-def.git sisyphus/kernel-modules-ipt_netflow-un-def-2.6-alt1: build SKIPPED
2026-Oct-03 13:17:14 :: [armh] #1500 kernel-modules-ixgbe-un-def.git sisyphus/kernel-modules-ixgbe-un-def-5.20.10-alt1: build start
2026-Oct-03 13:17:51 :: [armh] #1500 kernel-modules-ixgbe-un-def.git sisyphus/kernel-modules-ixgbe-un-def-5.20.10-alt1: build SKIPPED
2026-Oct-03 13:17:52 :: [armh] #1600 kernel-modules-lkrg-un-def.git sisyphus/kernel-modules-lkrg-un-def-0.9.8-alt3: build start
2026-Oct-03 13:18:28 :: [armh] #1600 kernel-modules-lkrg-un-def.git sisyphus/kernel-modules-lkrg-un-def-0.9.8-alt3: build SKIPPED
2026-Oct-03 13:18:28 :: [armh] #1700 kernel-modules-nvidia-un-def.git sisyphus/kernel-modules-nvidia-un-def-550.144.03-alt1: build start
2026-Oct-03 13:19:15 :: [armh] #1700 kernel-modules-nvidia-un-def.git sisyphus/kernel-modules-nvidia-un-def-550.144.03-alt1: build SKIPPED
2026-Oct-03 13:19:15 :: [armh] #2000 kernel-modules-r8125-un-def.git sisyphus/kernel-modules-r8125-un-def-9.011.01-alt1: build start
2026-Oct-03 13:19:52 :: [armh] #2000 kernel-modules-r8125-un-def.git sisyphus/kernel-modules-r8125-un-def-9.011.01-alt1: build SKIPPED
2026-Oct-03 13:19:52 :: [armh] #2100 kernel-modules-r8168-un-def.git sisyphus/kernel-modules-r8168-un-def-8.053.01-alt1.k: build start
2026-Oct-03 13:21:40 :: [armh] #2100 kernel-modules-r8168-un-def.git sisyphus/kernel-modules-r8168-un-def-8.053.01-alt1.k: build OK
2026-Oct-03 13:21:41 :: [armh] #2200 kernel-modules-rtl8188eu-un-def.git sisyphus/kernel-modules-rtl8188eu-un-def-5.13.3-alt2: build start
2026-Oct-03 13:22:16 :: [armh] #2200 kernel-modules-rtl8188eu-un-def.git sisyphus/kernel-modules-rtl8188eu-un-def-5.13.3-alt2: build SKIPPED
2026-Oct-03 13:22:16 :: [armh] #2300 kernel-modules-rtl8192eu-un-def.git sisyphus/kernel-modules-rtl8192eu-un-def-5.11.2.1-alt1: build start
2026-Oct-03 13:22:52 :: [armh] #2300 kernel-modules-rtl8192eu-un-def.git sisyphus/kernel-modules-rtl8192eu-un-def-5.11.2.1-alt1: build SKIPPED
2026-Oct-03 13:22:52 :: [armh] #2400 kernel-modules-rtl8723du-un-def.git sisyphus/kernel-modules-rtl8723du-un-def-5.13.4-alt1: build start
2026-Oct-03 13:23:29 :: [armh] #2400 kernel-modules-rtl8723du-un-def.git sisyphus/kernel-modules-rtl8723du-un-def-5.13.4-alt1: build SKIPPED
2026-Oct-03 13:23:29 :: [armh] #2500 kernel-modules-rtl8812au-un-def.git sisyphus/kernel-modules-rtl8812au-un-def-5.6.4.2-alt1: build start
2026-Oct-03 13:24:07 :: [armh] #2500 kernel-modules-rtl8812au-un-def.git sisyphus/kernel-modules-rtl8812au-un-def-5.6.4.2-alt1: build SKIPPED
2026-Oct-03 13:24:07 :: [armh] #2600 kernel-modules-rtl8821cu-un-def.git sisyphus/kernel-modules-rtl8821cu-un-def-5.12.0.4-alt1: build start
2026-Oct-03 13:24:46 :: [armh] #2600 kernel-modules-rtl8821cu-un-def.git sisyphus/kernel-modules-rtl8821cu-un-def-5.12.0.4-alt1: build SKIPPED
2026-Oct-03 13:24:46 :: [armh] #2700 kernel-modules-rtl88x2bu-un-def.git sisyphus/kernel-modules-rtl88x2bu-un-def-5.8.7.1-alt5: build start
2026-Oct-03 13:25:24 :: [armh] #2700 kernel-modules-rtl88x2bu-un-def.git sisyphus/kernel-modules-rtl88x2bu-un-def-5.8.7.1-alt5: build SKIPPED
2026-Oct-03 13:25:24 :: [armh] #3000 kernel-modules-rtw89-un-def.git sisyphus/kernel-modules-rtw89-un-def-0.0-alt4.git.4f3464d: build start
2026-Oct-03 13:26:40 :: [armh] #3000 kernel-modules-rtw89-un-def.git sisyphus/kernel-modules-rtw89-un-def-0.0-alt4.git.4f3464d: build OK
2026-Oct-03 13:26:40 :: [armh] #3100 kernel-modules-sysdig-un-def.git sisyphus/kernel-modules-sysdig-un-def-7.3.0-alt1: build start
2026-Oct-03 13:27:16 :: [armh] #3100 kernel-modules-sysdig-un-def.git sisyphus/kernel-modules-sysdig-un-def-7.3.0-alt1: build SKIPPED
2026-Oct-03 13:27:16 :: [armh] #3200 kernel-modules-v4l2loopback-un-def.git sisyphus/kernel-modules-v4l2loopback-un-def-0.12.7-alt1.g5e9dd41: build start
2026-Oct-03 13:28:16 :: [armh] #3200 kernel-modules-v4l2loopback-un-def.git sisyphus/kernel-modules-v4l2loopback-un-def-0.12.7-alt1.g5e9dd41: build OK
2026-Oct-03 13:28:17 :: [armh] #3300 kernel-modules-vhba-un-def.git sisyphus/kernel-modules-vhba-un-def-20211218-alt1.k: build start
2026-Oct-03 13:29:17 :: [armh] #3300 kernel-modules-vhba-un-def.git sisyphus/kernel-modules-vhba-un-def-20211218-alt1.k: build OK
2026-Oct-03 13:29:17 :: [armh] #3400 kernel-modules-virtualbox-addition-un-def.git sisyphus/kernel-modules-virtualbox-addition-p10-un-def-7.1.16-alt1: build start
2026-Oct-03 13:29:53 :: [armh] #3400 kernel-modules-virtualbox-addition-un-def.git sisyphus/kernel-modules-virtualbox-addition-p10-un-def-7.1.16-alt1: build SKIPPED
2026-Oct-03 13:29:53 :: [armh] #3500 kernel-modules-virtualbox-un-def.git sisyphus/kernel-modules-virtualbox-p10-un-def-7.1.16-alt1: build start
2026-Oct-03 13:30:31 :: [armh] #3500 kernel-modules-virtualbox-un-def.git sisyphus/kernel-modules-virtualbox-p10-un-def-7.1.16-alt1: build SKIPPED
2026-Oct-03 13:30:31 :: [armh] #3600 kernel-modules-xtables-addons-un-def.git sisyphus/kernel-modules-xtables-addons-un-def-3.23-alt1: build start
2026-Oct-03 13:32:20 :: [armh] #3600 kernel-modules-xtables-addons-un-def.git sisyphus/kernel-modules-xtables-addons-un-def-3.23-alt1: build OK
2026-Oct-03 13:32:20 :: [armh] #3700 kernel-modules-zfs-un-def.git p10/kernel-modules-zfs-un-def-2.1.16-alt1: build start
2026-Oct-03 13:40:24 :: [armh] #3700 kernel-modules-zfs-un-def.git p10/kernel-modules-zfs-un-def-2.1.16-alt1: build OK
2026-Oct-03 12:52:04 :: [i586] build FAILED
2026-Oct-03 12:55:03 :: [x86_64] build FAILED
2026-Oct-03 12:59:10 :: [aarch64] build FAILED
2026-Oct-03 13:40:24 :: task #435322 for p10 FAILED


^ permalink raw reply	[flat|nested] 6+ messages in thread

* [#435322] p10 FAILED (try 2) kernel-image.git=kernel-image-un-def-6.1.189-alt1 ...
  2026-10-03 13:40 [#435322] p10 FAILED kernel-image.git=kernel-image-un-def-6.1.189-alt1 Girar awaiter (kernelbot)
@ 2026-10-03 15:16 ` Girar awaiter (kernelbot)
  2026-10-03 15:47 ` [#435322] p10 FAILED (try 3) kernel-image.git=kernel-image-un-def-6.1.189-alt1 Girar awaiter (kernelbot)
                   ` (3 subsequent siblings)
  4 siblings, 0 replies; 6+ messages in thread
From: Girar awaiter (kernelbot) @ 2026-10-03 15:16 UTC (permalink / raw)
  To: Kernel Bot; +Cc: girar-builder-p10, sisyphus-incominger, girar-builder-p10

https://git.altlinux.org/tasks/435322/logs/events.2.1.log
https://packages.altlinux.org/tasks/435322

subtask  name                                  aarch64  armh    i586  x86_64
   #600  kernel-modules-dm-secdel-un-def             -     -       -      58
  #1600  kernel-modules-lkrg-un-def                  -     -       -      55
  #2300  kernel-modules-rtl8192eu-un-def             -     -  failed  failed
  #3000  kernel-modules-rtw89-un-def                53  1:14       ?       ?
  #3100  kernel-modules-sysdig-un-def               48     -       ?       ?
  #3200  kernel-modules-v4l2loopback-un-def         41    58       ?       ?
  #3300  kernel-modules-vhba-un-def                 42    58       ?       ?
  #3600  kernel-modules-xtables-addons-un-def     1:16     ?       ?       ?
  #3700  kernel-modules-zfs-un-def                6:05     ?       ?       ?

2026-Oct-03 14:57:43 :: task #435322 for p10 resumed by kernelbot:
2026-Oct-03 14:57:43 :: message: v6.1.189
#100 build kernel-image-un-def-6.1.189-alt1 from /people/kernelbot/packages/kernel-image.git fetched at 2026-Oct-03 12:07:12
#200 build sisyphus/kernel-modules-LiME-un-def-1.9.1-alt1 from /gears/k/kernel-modules-LiME-un-def.git fetched at 2026-Oct-03 12:07:17 from p10
#300 build sisyphus/kernel-modules-accel-ppp-un-def-1.12.0-alt3 from /gears/k/kernel-modules-accel-ppp-un-def.git fetched at 2026-Oct-03 12:07:22 from p10
#400 build sisyphus/kernel-modules-anbox-un-def-14-alt2.gae26ba2 from /gears/k/kernel-modules-anbox-un-def.git fetched at 2026-Oct-03 12:07:23 from p10
#500 build sisyphus/kernel-modules-bcmwl-un-def-6.30.223.271-alt15 from /gears/k/kernel-modules-bcmwl-un-def.git fetched at 2026-Oct-03 12:07:32 from p10
#600 build sisyphus/kernel-modules-dm-secdel-un-def-1.0.9-alt1 from /gears/k/kernel-modules-dm-secdel-un-def.git fetched at 2026-Oct-03 12:07:33 from p10
#700 build sisyphus/kernel-modules-drbd9-un-def-9.2.12-alt1 from /gears/k/kernel-modules-drbd9-un-def.git fetched at 2026-Oct-03 12:07:37 from p10
#1000 build sisyphus/kernel-modules-evdi-un-def-1.14.1-alt1 from /gears/k/kernel-modules-evdi-un-def.git fetched at 2026-Oct-03 12:07:39 from p10
#1100 build sisyphus/kernel-modules-i40e-un-def-2.22.20-alt1 from /gears/k/kernel-modules-i40e-un-def.git fetched at 2026-Oct-03 12:07:40 from p10
#1200 build sisyphus/kernel-modules-iavf-un-def-4.8.3-alt1 from /gears/k/kernel-modules-iavf-un-def.git fetched at 2026-Oct-03 12:07:41 from p10
#1300 build sisyphus/kernel-modules-ipt-ratelimit-un-def-0.3.3-alt1 from /gears/k/kernel-modules-ipt-ratelimit-un-def.git fetched at 2026-Oct-03 12:07:48 from p10
#1400 build sisyphus/kernel-modules-ipt_netflow-un-def-2.6-alt1 from /gears/k/kernel-modules-ipt_netflow-un-def.git fetched at 2026-Oct-03 12:07:54 from p10
#1500 build sisyphus/kernel-modules-ixgbe-un-def-5.20.10-alt1 from /gears/k/kernel-modules-ixgbe-un-def.git fetched at 2026-Oct-03 12:07:57 from p10
#1600 build sisyphus/kernel-modules-lkrg-un-def-0.9.8-alt3 from /gears/k/kernel-modules-lkrg-un-def.git fetched at 2026-Oct-03 12:08:01 from p10
#1700 build sisyphus/kernel-modules-nvidia-un-def-550.144.03-alt1 from /gears/k/kernel-modules-nvidia-un-def.git fetched at 2026-Oct-03 12:08:15 from p10
#2000 build sisyphus/kernel-modules-r8125-un-def-9.011.01-alt1 from /gears/k/kernel-modules-r8125-un-def.git fetched at 2026-Oct-03 12:08:18 from p10
#2100 build sisyphus/kernel-modules-r8168-un-def-8.053.01-alt1.k from /gears/k/kernel-modules-r8168-un-def.git fetched at 2026-Oct-03 12:08:26 from p10
#2200 removed
#2300 build sisyphus/kernel-modules-rtl8192eu-un-def-5.11.2.1-alt1 from /gears/k/kernel-modules-rtl8192eu-un-def.git fetched at 2026-Oct-03 12:08:30 from p10
#2400 build sisyphus/kernel-modules-rtl8723du-un-def-5.13.4-alt1 from /gears/k/kernel-modules-rtl8723du-un-def.git fetched at 2026-Oct-03 12:08:31 from p10
#2500 build sisyphus/kernel-modules-rtl8812au-un-def-5.6.4.2-alt1 from /gears/k/kernel-modules-rtl8812au-un-def.git fetched at 2026-Oct-03 12:08:33 from p10
#2600 build sisyphus/kernel-modules-rtl8821cu-un-def-5.12.0.4-alt1 from /gears/k/kernel-modules-rtl8821cu-un-def.git fetched at 2026-Oct-03 12:08:36 from p10
#2700 removed
#3000 build sisyphus/kernel-modules-rtw89-un-def-0.0-alt4.git.4f3464d from /gears/k/kernel-modules-rtw89-un-def.git fetched at 2026-Oct-03 12:08:40 from p10
#3100 build sisyphus/kernel-modules-sysdig-un-def-7.3.0-alt1 from /gears/k/kernel-modules-sysdig-un-def.git fetched at 2026-Oct-03 12:08:41 from p10
#3200 build sisyphus/kernel-modules-v4l2loopback-un-def-0.12.7-alt1.g5e9dd41 from /gears/k/kernel-modules-v4l2loopback-un-def.git fetched at 2026-Oct-03 12:08:44 from p10
#3300 build sisyphus/kernel-modules-vhba-un-def-20211218-alt1.k from /gears/k/kernel-modules-vhba-un-def.git fetched at 2026-Oct-03 12:08:51 from p10
#3400 build sisyphus/kernel-modules-virtualbox-addition-p10-un-def-7.1.16-alt1 from /gears/k/kernel-modules-virtualbox-addition-un-def.git fetched at 2026-Oct-03 12:09:02 from p10
#3500 build sisyphus/kernel-modules-virtualbox-p10-un-def-7.1.16-alt1 from /gears/k/kernel-modules-virtualbox-un-def.git fetched at 2026-Oct-03 12:09:13 from p10
#3600 build sisyphus/kernel-modules-xtables-addons-un-def-3.23-alt1 from /gears/k/kernel-modules-xtables-addons-un-def.git fetched at 2026-Oct-03 12:09:21 from p10
#3700 build p10/kernel-modules-zfs-un-def-2.1.16-alt1 from /gears/k/kernel-modules-zfs-un-def.git fetched at 2026-Oct-03 12:09:27 from p10
2026-Oct-03 14:57:43 :: created build repo
2026-Oct-03 14:57:44 :: #3000: force rebuild
2026-Oct-03 14:57:44 :: #3200: force rebuild
2026-Oct-03 14:57:44 :: #3300: force rebuild
2026-Oct-03 14:57:44 :: #3600: force rebuild
2026-Oct-03 14:57:44 :: #3700: force rebuild
2026-Oct-03 14:57:45 :: [x86_64] #100 kernel-image.git kernel-image-un-def-6.1.189-alt1: build start
2026-Oct-03 14:57:45 :: [aarch64] #100 kernel-image.git kernel-image-un-def-6.1.189-alt1: build start
2026-Oct-03 14:57:45 :: [i586] #100 kernel-image.git kernel-image-un-def-6.1.189-alt1: build start
2026-Oct-03 14:57:45 :: [armh] #100 kernel-image.git kernel-image-un-def-6.1.189-alt1: build start
2026-Oct-03 14:58:08 :: [i586] #100 kernel-image.git kernel-image-un-def-6.1.189-alt1: build OK (cached)
2026-Oct-03 14:58:08 :: [i586] #200 kernel-modules-LiME-un-def.git sisyphus/kernel-modules-LiME-un-def-1.9.1-alt1: build start
2026-Oct-03 14:58:10 :: [x86_64] #100 kernel-image.git kernel-image-un-def-6.1.189-alt1: build OK (cached)
2026-Oct-03 14:58:10 :: [x86_64] #200 kernel-modules-LiME-un-def.git sisyphus/kernel-modules-LiME-un-def-1.9.1-alt1: build start
2026-Oct-03 14:58:20 :: [i586] #200 kernel-modules-LiME-un-def.git sisyphus/kernel-modules-LiME-un-def-1.9.1-alt1: build OK (cached)
2026-Oct-03 14:58:20 :: [i586] #300 kernel-modules-accel-ppp-un-def.git sisyphus/kernel-modules-accel-ppp-un-def-1.12.0-alt3: build start
2026-Oct-03 14:58:21 :: [aarch64] #100 kernel-image.git kernel-image-un-def-6.1.189-alt1: build OK (cached)
2026-Oct-03 14:58:22 :: [aarch64] #200 kernel-modules-LiME-un-def.git sisyphus/kernel-modules-LiME-un-def-1.9.1-alt1: build start
2026-Oct-03 14:58:22 :: [x86_64] #200 kernel-modules-LiME-un-def.git sisyphus/kernel-modules-LiME-un-def-1.9.1-alt1: build OK (cached)
2026-Oct-03 14:58:22 :: [x86_64] #300 kernel-modules-accel-ppp-un-def.git sisyphus/kernel-modules-accel-ppp-un-def-1.12.0-alt3: build start
2026-Oct-03 14:58:31 :: [i586] #300 kernel-modules-accel-ppp-un-def.git sisyphus/kernel-modules-accel-ppp-un-def-1.12.0-alt3: build OK (cached)
2026-Oct-03 14:58:32 :: [i586] #400 kernel-modules-anbox-un-def.git sisyphus/kernel-modules-anbox-un-def-14-alt2.gae26ba2: build start
2026-Oct-03 14:58:34 :: [x86_64] #300 kernel-modules-accel-ppp-un-def.git sisyphus/kernel-modules-accel-ppp-un-def-1.12.0-alt3: build OK (cached)
2026-Oct-03 14:58:34 :: [x86_64] #400 kernel-modules-anbox-un-def.git sisyphus/kernel-modules-anbox-un-def-14-alt2.gae26ba2: build start
2026-Oct-03 14:58:34 :: [armh] #100 kernel-image.git kernel-image-un-def-6.1.189-alt1: build OK (cached)
2026-Oct-03 14:58:34 :: [armh] #200 kernel-modules-LiME-un-def.git sisyphus/kernel-modules-LiME-un-def-1.9.1-alt1: build start
2026-Oct-03 14:58:41 :: [aarch64] #200 kernel-modules-LiME-un-def.git sisyphus/kernel-modules-LiME-un-def-1.9.1-alt1: build OK (cached)
2026-Oct-03 14:58:41 :: [aarch64] #300 kernel-modules-accel-ppp-un-def.git sisyphus/kernel-modules-accel-ppp-un-def-1.12.0-alt3: build start
2026-Oct-03 14:58:43 :: [i586] #400 kernel-modules-anbox-un-def.git sisyphus/kernel-modules-anbox-un-def-14-alt2.gae26ba2: build OK (cached)
2026-Oct-03 14:58:43 :: [i586] #500 kernel-modules-bcmwl-un-def.git sisyphus/kernel-modules-bcmwl-un-def-6.30.223.271-alt15: build start
2026-Oct-03 14:58:46 :: [x86_64] #400 kernel-modules-anbox-un-def.git sisyphus/kernel-modules-anbox-un-def-14-alt2.gae26ba2: build OK (cached)
2026-Oct-03 14:58:46 :: [x86_64] #500 kernel-modules-bcmwl-un-def.git sisyphus/kernel-modules-bcmwl-un-def-6.30.223.271-alt15: build start
2026-Oct-03 14:58:58 :: [i586] #500 kernel-modules-bcmwl-un-def.git sisyphus/kernel-modules-bcmwl-un-def-6.30.223.271-alt15: build SKIPPED
2026-Oct-03 14:58:58 :: [i586] #600 kernel-modules-dm-secdel-un-def.git sisyphus/kernel-modules-dm-secdel-un-def-1.0.9-alt1: build start
2026-Oct-03 14:58:58 :: [x86_64] #500 kernel-modules-bcmwl-un-def.git sisyphus/kernel-modules-bcmwl-un-def-6.30.223.271-alt15: build OK (cached)
2026-Oct-03 14:58:58 :: [x86_64] #600 kernel-modules-dm-secdel-un-def.git sisyphus/kernel-modules-dm-secdel-un-def-1.0.9-alt1: build start
2026-Oct-03 14:59:01 :: [aarch64] #300 kernel-modules-accel-ppp-un-def.git sisyphus/kernel-modules-accel-ppp-un-def-1.12.0-alt3: build OK (cached)
2026-Oct-03 14:59:01 :: [aarch64] #400 kernel-modules-anbox-un-def.git sisyphus/kernel-modules-anbox-un-def-14-alt2.gae26ba2: build start
2026-Oct-03 14:59:04 :: [armh] #200 kernel-modules-LiME-un-def.git sisyphus/kernel-modules-LiME-un-def-1.9.1-alt1: build OK (cached)
2026-Oct-03 14:59:04 :: [armh] #300 kernel-modules-accel-ppp-un-def.git sisyphus/kernel-modules-accel-ppp-un-def-1.12.0-alt3: build start
2026-Oct-03 14:59:10 :: [i586] #600 kernel-modules-dm-secdel-un-def.git sisyphus/kernel-modules-dm-secdel-un-def-1.0.9-alt1: build OK (cached)
2026-Oct-03 14:59:10 :: [i586] #700 kernel-modules-drbd9-un-def.git sisyphus/kernel-modules-drbd9-un-def-9.2.12-alt1: build start
2026-Oct-03 14:59:21 :: [aarch64] #400 kernel-modules-anbox-un-def.git sisyphus/kernel-modules-anbox-un-def-14-alt2.gae26ba2: build OK (cached)
2026-Oct-03 14:59:21 :: [aarch64] #500 kernel-modules-bcmwl-un-def.git sisyphus/kernel-modules-bcmwl-un-def-6.30.223.271-alt15: build start
2026-Oct-03 14:59:25 :: [i586] #700 kernel-modules-drbd9-un-def.git sisyphus/kernel-modules-drbd9-un-def-9.2.12-alt1: build SKIPPED
2026-Oct-03 14:59:25 :: [i586] #1000 kernel-modules-evdi-un-def.git sisyphus/kernel-modules-evdi-un-def-1.14.1-alt1: build start
2026-Oct-03 14:59:36 :: [i586] #1000 kernel-modules-evdi-un-def.git sisyphus/kernel-modules-evdi-un-def-1.14.1-alt1: build OK (cached)
2026-Oct-03 14:59:37 :: [i586] #1100 kernel-modules-i40e-un-def.git sisyphus/kernel-modules-i40e-un-def-2.22.20-alt1: build start
2026-Oct-03 14:59:42 :: [armh] #300 kernel-modules-accel-ppp-un-def.git sisyphus/kernel-modules-accel-ppp-un-def-1.12.0-alt3: build SKIPPED
2026-Oct-03 14:59:42 :: [armh] #400 kernel-modules-anbox-un-def.git sisyphus/kernel-modules-anbox-un-def-14-alt2.gae26ba2: build start
2026-Oct-03 14:59:45 :: [aarch64] #500 kernel-modules-bcmwl-un-def.git sisyphus/kernel-modules-bcmwl-un-def-6.30.223.271-alt15: build SKIPPED
2026-Oct-03 14:59:45 :: [aarch64] #600 kernel-modules-dm-secdel-un-def.git sisyphus/kernel-modules-dm-secdel-un-def-1.0.9-alt1: build start
2026-Oct-03 14:59:51 :: [i586] #1100 kernel-modules-i40e-un-def.git sisyphus/kernel-modules-i40e-un-def-2.22.20-alt1: build SKIPPED
2026-Oct-03 14:59:52 :: [i586] #1200 kernel-modules-iavf-un-def.git sisyphus/kernel-modules-iavf-un-def-4.8.3-alt1: build start
2026-Oct-03 14:59:56 :: [x86_64] #600 kernel-modules-dm-secdel-un-def.git sisyphus/kernel-modules-dm-secdel-un-def-1.0.9-alt1: build OK
2026-Oct-03 14:59:56 :: [x86_64] #700 kernel-modules-drbd9-un-def.git sisyphus/kernel-modules-drbd9-un-def-9.2.12-alt1: build start
2026-Oct-03 15:00:05 :: [aarch64] #600 kernel-modules-dm-secdel-un-def.git sisyphus/kernel-modules-dm-secdel-un-def-1.0.9-alt1: build OK (cached)
2026-Oct-03 15:00:05 :: [aarch64] #700 kernel-modules-drbd9-un-def.git sisyphus/kernel-modules-drbd9-un-def-9.2.12-alt1: build start
2026-Oct-03 15:00:06 :: [i586] #1200 kernel-modules-iavf-un-def.git sisyphus/kernel-modules-iavf-un-def-4.8.3-alt1: build SKIPPED
2026-Oct-03 15:00:06 :: [i586] #1300 kernel-modules-ipt-ratelimit-un-def.git sisyphus/kernel-modules-ipt-ratelimit-un-def-0.3.3-alt1: build start
2026-Oct-03 15:00:08 :: [x86_64] #700 kernel-modules-drbd9-un-def.git sisyphus/kernel-modules-drbd9-un-def-9.2.12-alt1: build OK (cached)
2026-Oct-03 15:00:08 :: [x86_64] #1000 kernel-modules-evdi-un-def.git sisyphus/kernel-modules-evdi-un-def-1.14.1-alt1: build start
2026-Oct-03 15:00:12 :: [armh] #400 kernel-modules-anbox-un-def.git sisyphus/kernel-modules-anbox-un-def-14-alt2.gae26ba2: build OK (cached)
2026-Oct-03 15:00:12 :: [armh] #500 kernel-modules-bcmwl-un-def.git sisyphus/kernel-modules-bcmwl-un-def-6.30.223.271-alt15: build start
2026-Oct-03 15:00:18 :: [i586] #1300 kernel-modules-ipt-ratelimit-un-def.git sisyphus/kernel-modules-ipt-ratelimit-un-def-0.3.3-alt1: build OK (cached)
2026-Oct-03 15:00:18 :: [i586] #1400 kernel-modules-ipt_netflow-un-def.git sisyphus/kernel-modules-ipt_netflow-un-def-2.6-alt1: build start
2026-Oct-03 15:00:20 :: [x86_64] #1000 kernel-modules-evdi-un-def.git sisyphus/kernel-modules-evdi-un-def-1.14.1-alt1: build OK (cached)
2026-Oct-03 15:00:20 :: [x86_64] #1100 kernel-modules-i40e-un-def.git sisyphus/kernel-modules-i40e-un-def-2.22.20-alt1: build start
2026-Oct-03 15:00:25 :: [aarch64] #700 kernel-modules-drbd9-un-def.git sisyphus/kernel-modules-drbd9-un-def-9.2.12-alt1: build OK (cached)
2026-Oct-03 15:00:25 :: [aarch64] #1000 kernel-modules-evdi-un-def.git sisyphus/kernel-modules-evdi-un-def-1.14.1-alt1: build start
2026-Oct-03 15:00:30 :: [i586] #1400 kernel-modules-ipt_netflow-un-def.git sisyphus/kernel-modules-ipt_netflow-un-def-2.6-alt1: build OK (cached)
2026-Oct-03 15:00:30 :: [i586] #1500 kernel-modules-ixgbe-un-def.git sisyphus/kernel-modules-ixgbe-un-def-5.20.10-alt1: build start
2026-Oct-03 15:00:32 :: [x86_64] #1100 kernel-modules-i40e-un-def.git sisyphus/kernel-modules-i40e-un-def-2.22.20-alt1: build OK (cached)
2026-Oct-03 15:00:32 :: [x86_64] #1200 kernel-modules-iavf-un-def.git sisyphus/kernel-modules-iavf-un-def-4.8.3-alt1: build start
2026-Oct-03 15:00:44 :: [x86_64] #1200 kernel-modules-iavf-un-def.git sisyphus/kernel-modules-iavf-un-def-4.8.3-alt1: build OK (cached)
2026-Oct-03 15:00:44 :: [x86_64] #1300 kernel-modules-ipt-ratelimit-un-def.git sisyphus/kernel-modules-ipt-ratelimit-un-def-0.3.3-alt1: build start
2026-Oct-03 15:00:45 :: [i586] #1500 kernel-modules-ixgbe-un-def.git sisyphus/kernel-modules-ixgbe-un-def-5.20.10-alt1: build SKIPPED
2026-Oct-03 15:00:45 :: [aarch64] #1000 kernel-modules-evdi-un-def.git sisyphus/kernel-modules-evdi-un-def-1.14.1-alt1: build OK (cached)
2026-Oct-03 15:00:45 :: [i586] #1600 kernel-modules-lkrg-un-def.git sisyphus/kernel-modules-lkrg-un-def-0.9.8-alt3: build start
2026-Oct-03 15:00:45 :: [aarch64] #1100 kernel-modules-i40e-un-def.git sisyphus/kernel-modules-i40e-un-def-2.22.20-alt1: build start
2026-Oct-03 15:00:48 :: [armh] #500 kernel-modules-bcmwl-un-def.git sisyphus/kernel-modules-bcmwl-un-def-6.30.223.271-alt15: build SKIPPED
2026-Oct-03 15:00:48 :: [armh] #600 kernel-modules-dm-secdel-un-def.git sisyphus/kernel-modules-dm-secdel-un-def-1.0.9-alt1: build start
2026-Oct-03 15:00:56 :: [x86_64] #1300 kernel-modules-ipt-ratelimit-un-def.git sisyphus/kernel-modules-ipt-ratelimit-un-def-0.3.3-alt1: build OK (cached)
2026-Oct-03 15:00:56 :: [x86_64] #1400 kernel-modules-ipt_netflow-un-def.git sisyphus/kernel-modules-ipt_netflow-un-def-2.6-alt1: build start
2026-Oct-03 15:00:57 :: [i586] #1600 kernel-modules-lkrg-un-def.git sisyphus/kernel-modules-lkrg-un-def-0.9.8-alt3: build OK (cached)
2026-Oct-03 15:00:57 :: [i586] #1700 kernel-modules-nvidia-un-def.git sisyphus/kernel-modules-nvidia-un-def-550.144.03-alt1: build start
2026-Oct-03 15:01:04 :: [aarch64] #1100 kernel-modules-i40e-un-def.git sisyphus/kernel-modules-i40e-un-def-2.22.20-alt1: build OK (cached)
2026-Oct-03 15:01:05 :: [aarch64] #1200 kernel-modules-iavf-un-def.git sisyphus/kernel-modules-iavf-un-def-4.8.3-alt1: build start
2026-Oct-03 15:01:08 :: [x86_64] #1400 kernel-modules-ipt_netflow-un-def.git sisyphus/kernel-modules-ipt_netflow-un-def-2.6-alt1: build OK (cached)
2026-Oct-03 15:01:08 :: [x86_64] #1500 kernel-modules-ixgbe-un-def.git sisyphus/kernel-modules-ixgbe-un-def-5.20.10-alt1: build start
2026-Oct-03 15:01:09 :: [i586] #1700 kernel-modules-nvidia-un-def.git sisyphus/kernel-modules-nvidia-un-def-550.144.03-alt1: build OK (cached)
2026-Oct-03 15:01:09 :: [i586] #2000 kernel-modules-r8125-un-def.git sisyphus/kernel-modules-r8125-un-def-9.011.01-alt1: build start
2026-Oct-03 15:01:18 :: [armh] #600 kernel-modules-dm-secdel-un-def.git sisyphus/kernel-modules-dm-secdel-un-def-1.0.9-alt1: build OK (cached)
2026-Oct-03 15:01:18 :: [armh] #700 kernel-modules-drbd9-un-def.git sisyphus/kernel-modules-drbd9-un-def-9.2.12-alt1: build start
2026-Oct-03 15:01:20 :: [x86_64] #1500 kernel-modules-ixgbe-un-def.git sisyphus/kernel-modules-ixgbe-un-def-5.20.10-alt1: build OK (cached)
2026-Oct-03 15:01:20 :: [i586] #2000 kernel-modules-r8125-un-def.git sisyphus/kernel-modules-r8125-un-def-9.011.01-alt1: build OK (cached)
2026-Oct-03 15:01:20 :: [x86_64] #1600 kernel-modules-lkrg-un-def.git sisyphus/kernel-modules-lkrg-un-def-0.9.8-alt3: build start
2026-Oct-03 15:01:20 :: [i586] #2100 kernel-modules-r8168-un-def.git sisyphus/kernel-modules-r8168-un-def-8.053.01-alt1.k: build start
2026-Oct-03 15:01:24 :: [aarch64] #1200 kernel-modules-iavf-un-def.git sisyphus/kernel-modules-iavf-un-def-4.8.3-alt1: build OK (cached)
2026-Oct-03 15:01:24 :: [aarch64] #1300 kernel-modules-ipt-ratelimit-un-def.git sisyphus/kernel-modules-ipt-ratelimit-un-def-0.3.3-alt1: build start
2026-Oct-03 15:01:32 :: [i586] #2100 kernel-modules-r8168-un-def.git sisyphus/kernel-modules-r8168-un-def-8.053.01-alt1.k: build OK (cached)
2026-Oct-03 15:01:32 :: [i586] #2300 kernel-modules-rtl8192eu-un-def.git sisyphus/kernel-modules-rtl8192eu-un-def-5.11.2.1-alt1: build start
2026-Oct-03 15:01:44 :: [aarch64] #1300 kernel-modules-ipt-ratelimit-un-def.git sisyphus/kernel-modules-ipt-ratelimit-un-def-0.3.3-alt1: build OK (cached)
2026-Oct-03 15:01:44 :: [aarch64] #1400 kernel-modules-ipt_netflow-un-def.git sisyphus/kernel-modules-ipt_netflow-un-def-2.6-alt1: build start
2026-Oct-03 15:01:53 :: [armh] #700 kernel-modules-drbd9-un-def.git sisyphus/kernel-modules-drbd9-un-def-9.2.12-alt1: build SKIPPED
2026-Oct-03 15:01:54 :: [armh] #1000 kernel-modules-evdi-un-def.git sisyphus/kernel-modules-evdi-un-def-1.14.1-alt1: build start
[i586]   CC [M]  /usr/src/RPM/BUILD/kernel-source-rtl8192eu-5.11.2.1/os_dep/linux/usb_intf.o
[i586] /usr/src/RPM/BUILD/kernel-source-rtl8192eu-5.11.2.1/os_dep/linux/usb_intf.c:309:10: error: 'struct usb_driver' has no member named 'drvwrap'
[i586]   309 |  .usbdrv.drvwrap.driver.shutdown = rtw_dev_shutdown,
[i586] /usr/src/RPM/BUILD/kernel-source-rtl8192eu-5.11.2.1/os_dep/linux/usb_intf.c:309:36: error: initialization of 'const char *' from incompatible pointer type 'void (*)(struct device *)' [-Werror=incompatible-pointer-types]
[i586]   309 |  .usbdrv.drvwrap.driver.shutdown = rtw_dev_shutdown,
[i586] /usr/src/RPM/BUILD/kernel-source-rtl8192eu-5.11.2.1/os_dep/linux/usb_intf.c:309:36: note: (near initialization for 'usb_drv.usbdrv.name')
[i586] cc1: some warnings being treated as errors
[i586] make[2]: *** [scripts/Makefile.build:250: /usr/src/RPM/BUILD/kernel-source-rtl8192eu-5.11.2.1/os_dep/linux/usb_intf.o] Error 1
2026-Oct-03 15:01:58 :: [i586] kernel-modules-rtl8192eu-un-def.git sisyphus/kernel-modules-rtl8192eu-un-def-5.11.2.1-alt1: remote: build failed
2026-Oct-03 15:01:58 :: [i586] #2300 kernel-modules-rtl8192eu-un-def.git sisyphus/kernel-modules-rtl8192eu-un-def-5.11.2.1-alt1: build FAILED
2026-Oct-03 15:02:05 :: [aarch64] #1400 kernel-modules-ipt_netflow-un-def.git sisyphus/kernel-modules-ipt_netflow-un-def-2.6-alt1: build OK (cached)
2026-Oct-03 15:02:05 :: [aarch64] #1500 kernel-modules-ixgbe-un-def.git sisyphus/kernel-modules-ixgbe-un-def-5.20.10-alt1: build start
2026-Oct-03 15:02:15 :: [x86_64] #1600 kernel-modules-lkrg-un-def.git sisyphus/kernel-modules-lkrg-un-def-0.9.8-alt3: build OK
2026-Oct-03 15:02:15 :: [x86_64] #1700 kernel-modules-nvidia-un-def.git sisyphus/kernel-modules-nvidia-un-def-550.144.03-alt1: build start
2026-Oct-03 15:02:23 :: [armh] #1000 kernel-modules-evdi-un-def.git sisyphus/kernel-modules-evdi-un-def-1.14.1-alt1: build OK (cached)
2026-Oct-03 15:02:23 :: [armh] #1100 kernel-modules-i40e-un-def.git sisyphus/kernel-modules-i40e-un-def-2.22.20-alt1: build start
2026-Oct-03 15:02:26 :: [aarch64] #1500 kernel-modules-ixgbe-un-def.git sisyphus/kernel-modules-ixgbe-un-def-5.20.10-alt1: build OK (cached)
2026-Oct-03 15:02:26 :: [aarch64] #1600 kernel-modules-lkrg-un-def.git sisyphus/kernel-modules-lkrg-un-def-0.9.8-alt3: build start
2026-Oct-03 15:02:28 :: [x86_64] #1700 kernel-modules-nvidia-un-def.git sisyphus/kernel-modules-nvidia-un-def-550.144.03-alt1: build OK (cached)
2026-Oct-03 15:02:28 :: [x86_64] #2000 kernel-modules-r8125-un-def.git sisyphus/kernel-modules-r8125-un-def-9.011.01-alt1: build start
2026-Oct-03 15:02:40 :: [x86_64] #2000 kernel-modules-r8125-un-def.git sisyphus/kernel-modules-r8125-un-def-9.011.01-alt1: build OK (cached)
2026-Oct-03 15:02:40 :: [x86_64] #2100 kernel-modules-r8168-un-def.git sisyphus/kernel-modules-r8168-un-def-8.053.01-alt1.k: build start
2026-Oct-03 15:02:50 :: [aarch64] #1600 kernel-modules-lkrg-un-def.git sisyphus/kernel-modules-lkrg-un-def-0.9.8-alt3: build SKIPPED
2026-Oct-03 15:02:50 :: [aarch64] #1700 kernel-modules-nvidia-un-def.git sisyphus/kernel-modules-nvidia-un-def-550.144.03-alt1: build start
2026-Oct-03 15:02:52 :: [x86_64] #2100 kernel-modules-r8168-un-def.git sisyphus/kernel-modules-r8168-un-def-8.053.01-alt1.k: build OK (cached)
2026-Oct-03 15:02:52 :: [x86_64] #2300 kernel-modules-rtl8192eu-un-def.git sisyphus/kernel-modules-rtl8192eu-un-def-5.11.2.1-alt1: build start
2026-Oct-03 15:02:58 :: [armh] #1100 kernel-modules-i40e-un-def.git sisyphus/kernel-modules-i40e-un-def-2.22.20-alt1: build SKIPPED
2026-Oct-03 15:02:59 :: [armh] #1200 kernel-modules-iavf-un-def.git sisyphus/kernel-modules-iavf-un-def-4.8.3-alt1: build start
2026-Oct-03 15:03:11 :: [aarch64] #1700 kernel-modules-nvidia-un-def.git sisyphus/kernel-modules-nvidia-un-def-550.144.03-alt1: build OK (cached)
2026-Oct-03 15:03:12 :: [aarch64] #2000 kernel-modules-r8125-un-def.git sisyphus/kernel-modules-r8125-un-def-9.011.01-alt1: build start
[x86_64]   CC [M]  /usr/src/RPM/BUILD/kernel-source-rtl8192eu-5.11.2.1/os_dep/linux/usb_intf.o
[x86_64] /usr/src/RPM/BUILD/kernel-source-rtl8192eu-5.11.2.1/os_dep/linux/usb_intf.c:309:10: error: 'struct usb_driver' has no member named 'drvwrap'
[x86_64]   309 |  .usbdrv.drvwrap.driver.shutdown = rtw_dev_shutdown,
[x86_64] /usr/src/RPM/BUILD/kernel-source-rtl8192eu-5.11.2.1/os_dep/linux/usb_intf.c:309:36: error: initialization of 'const char *' from incompatible pointer type 'void (*)(struct device *)' [-Werror=incompatible-pointer-types]
[x86_64]   309 |  .usbdrv.drvwrap.driver.shutdown = rtw_dev_shutdown,
[x86_64] /usr/src/RPM/BUILD/kernel-source-rtl8192eu-5.11.2.1/os_dep/linux/usb_intf.c:309:36: note: (near initialization for 'usb_drv.usbdrv.name')
[x86_64] cc1: some warnings being treated as errors
[x86_64] make[2]: *** [scripts/Makefile.build:250: /usr/src/RPM/BUILD/kernel-source-rtl8192eu-5.11.2.1/os_dep/linux/usb_intf.o] Error 1
2026-Oct-03 15:03:18 :: [x86_64] kernel-modules-rtl8192eu-un-def.git sisyphus/kernel-modules-rtl8192eu-un-def-5.11.2.1-alt1: remote: build failed
2026-Oct-03 15:03:18 :: [x86_64] #2300 kernel-modules-rtl8192eu-un-def.git sisyphus/kernel-modules-rtl8192eu-un-def-5.11.2.1-alt1: build FAILED
2026-Oct-03 15:03:35 :: [armh] #1200 kernel-modules-iavf-un-def.git sisyphus/kernel-modules-iavf-un-def-4.8.3-alt1: build SKIPPED
2026-Oct-03 15:03:35 :: [armh] #1300 kernel-modules-ipt-ratelimit-un-def.git sisyphus/kernel-modules-ipt-ratelimit-un-def-0.3.3-alt1: build start
2026-Oct-03 15:03:35 :: [aarch64] #2000 kernel-modules-r8125-un-def.git sisyphus/kernel-modules-r8125-un-def-9.011.01-alt1: build SKIPPED
2026-Oct-03 15:03:36 :: [aarch64] #2100 kernel-modules-r8168-un-def.git sisyphus/kernel-modules-r8168-un-def-8.053.01-alt1.k: build start
2026-Oct-03 15:03:55 :: [aarch64] #2100 kernel-modules-r8168-un-def.git sisyphus/kernel-modules-r8168-un-def-8.053.01-alt1.k: build OK (cached)
2026-Oct-03 15:03:56 :: [aarch64] #2300 kernel-modules-rtl8192eu-un-def.git sisyphus/kernel-modules-rtl8192eu-un-def-5.11.2.1-alt1: build start
2026-Oct-03 15:04:04 :: [armh] #1300 kernel-modules-ipt-ratelimit-un-def.git sisyphus/kernel-modules-ipt-ratelimit-un-def-0.3.3-alt1: build OK (cached)
2026-Oct-03 15:04:04 :: [armh] #1400 kernel-modules-ipt_netflow-un-def.git sisyphus/kernel-modules-ipt_netflow-un-def-2.6-alt1: build start
2026-Oct-03 15:04:19 :: [aarch64] #2300 kernel-modules-rtl8192eu-un-def.git sisyphus/kernel-modules-rtl8192eu-un-def-5.11.2.1-alt1: build SKIPPED
2026-Oct-03 15:04:19 :: [aarch64] #2400 kernel-modules-rtl8723du-un-def.git sisyphus/kernel-modules-rtl8723du-un-def-5.13.4-alt1: build start
2026-Oct-03 15:04:40 :: [armh] #1400 kernel-modules-ipt_netflow-un-def.git sisyphus/kernel-modules-ipt_netflow-un-def-2.6-alt1: build SKIPPED
2026-Oct-03 15:04:40 :: [armh] #1500 kernel-modules-ixgbe-un-def.git sisyphus/kernel-modules-ixgbe-un-def-5.20.10-alt1: build start
2026-Oct-03 15:04:44 :: [aarch64] #2400 kernel-modules-rtl8723du-un-def.git sisyphus/kernel-modules-rtl8723du-un-def-5.13.4-alt1: build SKIPPED
2026-Oct-03 15:04:44 :: [aarch64] #2500 kernel-modules-rtl8812au-un-def.git sisyphus/kernel-modules-rtl8812au-un-def-5.6.4.2-alt1: build start
2026-Oct-03 15:05:08 :: [aarch64] #2500 kernel-modules-rtl8812au-un-def.git sisyphus/kernel-modules-rtl8812au-un-def-5.6.4.2-alt1: build SKIPPED
2026-Oct-03 15:05:08 :: [aarch64] #2600 kernel-modules-rtl8821cu-un-def.git sisyphus/kernel-modules-rtl8821cu-un-def-5.12.0.4-alt1: build start
2026-Oct-03 15:05:16 :: [armh] #1500 kernel-modules-ixgbe-un-def.git sisyphus/kernel-modules-ixgbe-un-def-5.20.10-alt1: build SKIPPED
2026-Oct-03 15:05:17 :: [armh] #1600 kernel-modules-lkrg-un-def.git sisyphus/kernel-modules-lkrg-un-def-0.9.8-alt3: build start
2026-Oct-03 15:05:32 :: [aarch64] #2600 kernel-modules-rtl8821cu-un-def.git sisyphus/kernel-modules-rtl8821cu-un-def-5.12.0.4-alt1: build SKIPPED
2026-Oct-03 15:05:32 :: [aarch64] #3000 kernel-modules-rtw89-un-def.git sisyphus/kernel-modules-rtw89-un-def-0.0-alt4.git.4f3464d: build start
2026-Oct-03 15:05:52 :: [armh] #1600 kernel-modules-lkrg-un-def.git sisyphus/kernel-modules-lkrg-un-def-0.9.8-alt3: build SKIPPED
2026-Oct-03 15:05:53 :: [armh] #1700 kernel-modules-nvidia-un-def.git sisyphus/kernel-modules-nvidia-un-def-550.144.03-alt1: build start
2026-Oct-03 15:06:25 :: [aarch64] #3000 kernel-modules-rtw89-un-def.git sisyphus/kernel-modules-rtw89-un-def-0.0-alt4.git.4f3464d: build OK
2026-Oct-03 15:06:25 :: [aarch64] #3100 kernel-modules-sysdig-un-def.git sisyphus/kernel-modules-sysdig-un-def-7.3.0-alt1: build start
2026-Oct-03 15:06:38 :: [armh] #1700 kernel-modules-nvidia-un-def.git sisyphus/kernel-modules-nvidia-un-def-550.144.03-alt1: build SKIPPED
2026-Oct-03 15:06:38 :: [armh] #2000 kernel-modules-r8125-un-def.git sisyphus/kernel-modules-r8125-un-def-9.011.01-alt1: build start
2026-Oct-03 15:07:13 :: [aarch64] #3100 kernel-modules-sysdig-un-def.git sisyphus/kernel-modules-sysdig-un-def-7.3.0-alt1: build OK
2026-Oct-03 15:07:13 :: [aarch64] #3200 kernel-modules-v4l2loopback-un-def.git sisyphus/kernel-modules-v4l2loopback-un-def-0.12.7-alt1.g5e9dd41: build start
2026-Oct-03 15:07:14 :: [armh] #2000 kernel-modules-r8125-un-def.git sisyphus/kernel-modules-r8125-un-def-9.011.01-alt1: build SKIPPED
2026-Oct-03 15:07:15 :: [armh] #2100 kernel-modules-r8168-un-def.git sisyphus/kernel-modules-r8168-un-def-8.053.01-alt1.k: build start
2026-Oct-03 15:07:44 :: [armh] #2100 kernel-modules-r8168-un-def.git sisyphus/kernel-modules-r8168-un-def-8.053.01-alt1.k: build OK (cached)
2026-Oct-03 15:07:45 :: [armh] #2300 kernel-modules-rtl8192eu-un-def.git sisyphus/kernel-modules-rtl8192eu-un-def-5.11.2.1-alt1: build start
2026-Oct-03 15:07:54 :: [aarch64] #3200 kernel-modules-v4l2loopback-un-def.git sisyphus/kernel-modules-v4l2loopback-un-def-0.12.7-alt1.g5e9dd41: build OK
2026-Oct-03 15:07:54 :: [aarch64] #3300 kernel-modules-vhba-un-def.git sisyphus/kernel-modules-vhba-un-def-20211218-alt1.k: build start
2026-Oct-03 15:08:21 :: [armh] #2300 kernel-modules-rtl8192eu-un-def.git sisyphus/kernel-modules-rtl8192eu-un-def-5.11.2.1-alt1: build SKIPPED
2026-Oct-03 15:08:21 :: [armh] #2400 kernel-modules-rtl8723du-un-def.git sisyphus/kernel-modules-rtl8723du-un-def-5.13.4-alt1: build start
2026-Oct-03 15:08:36 :: [aarch64] #3300 kernel-modules-vhba-un-def.git sisyphus/kernel-modules-vhba-un-def-20211218-alt1.k: build OK
2026-Oct-03 15:08:36 :: [aarch64] #3400 kernel-modules-virtualbox-addition-un-def.git sisyphus/kernel-modules-virtualbox-addition-p10-un-def-7.1.16-alt1: build start
2026-Oct-03 15:08:57 :: [armh] #2400 kernel-modules-rtl8723du-un-def.git sisyphus/kernel-modules-rtl8723du-un-def-5.13.4-alt1: build SKIPPED
2026-Oct-03 15:08:57 :: [armh] #2500 kernel-modules-rtl8812au-un-def.git sisyphus/kernel-modules-rtl8812au-un-def-5.6.4.2-alt1: build start
2026-Oct-03 15:08:59 :: [aarch64] #3400 kernel-modules-virtualbox-addition-un-def.git sisyphus/kernel-modules-virtualbox-addition-p10-un-def-7.1.16-alt1: build SKIPPED
2026-Oct-03 15:08:59 :: [aarch64] #3500 kernel-modules-virtualbox-un-def.git sisyphus/kernel-modules-virtualbox-p10-un-def-7.1.16-alt1: build start
2026-Oct-03 15:09:23 :: [aarch64] #3500 kernel-modules-virtualbox-un-def.git sisyphus/kernel-modules-virtualbox-p10-un-def-7.1.16-alt1: build SKIPPED
2026-Oct-03 15:09:23 :: [aarch64] #3600 kernel-modules-xtables-addons-un-def.git sisyphus/kernel-modules-xtables-addons-un-def-3.23-alt1: build start
2026-Oct-03 15:09:33 :: [armh] #2500 kernel-modules-rtl8812au-un-def.git sisyphus/kernel-modules-rtl8812au-un-def-5.6.4.2-alt1: build SKIPPED
2026-Oct-03 15:09:33 :: [armh] #2600 kernel-modules-rtl8821cu-un-def.git sisyphus/kernel-modules-rtl8821cu-un-def-5.12.0.4-alt1: build start
2026-Oct-03 15:10:08 :: [armh] #2600 kernel-modules-rtl8821cu-un-def.git sisyphus/kernel-modules-rtl8821cu-un-def-5.12.0.4-alt1: build SKIPPED
2026-Oct-03 15:10:09 :: [armh] #3000 kernel-modules-rtw89-un-def.git sisyphus/kernel-modules-rtw89-un-def-0.0-alt4.git.4f3464d: build start
2026-Oct-03 15:10:39 :: [aarch64] #3600 kernel-modules-xtables-addons-un-def.git sisyphus/kernel-modules-xtables-addons-un-def-3.23-alt1: build OK
2026-Oct-03 15:10:39 :: [aarch64] #3700 kernel-modules-zfs-un-def.git p10/kernel-modules-zfs-un-def-2.1.16-alt1: build start
2026-Oct-03 15:11:23 :: [armh] #3000 kernel-modules-rtw89-un-def.git sisyphus/kernel-modules-rtw89-un-def-0.0-alt4.git.4f3464d: build OK
2026-Oct-03 15:11:23 :: [armh] #3100 kernel-modules-sysdig-un-def.git sisyphus/kernel-modules-sysdig-un-def-7.3.0-alt1: build start
2026-Oct-03 15:11:58 :: [armh] #3100 kernel-modules-sysdig-un-def.git sisyphus/kernel-modules-sysdig-un-def-7.3.0-alt1: build SKIPPED
2026-Oct-03 15:11:58 :: [armh] #3200 kernel-modules-v4l2loopback-un-def.git sisyphus/kernel-modules-v4l2loopback-un-def-0.12.7-alt1.g5e9dd41: build start
2026-Oct-03 15:12:56 :: [armh] #3200 kernel-modules-v4l2loopback-un-def.git sisyphus/kernel-modules-v4l2loopback-un-def-0.12.7-alt1.g5e9dd41: build OK
2026-Oct-03 15:12:56 :: [armh] #3300 kernel-modules-vhba-un-def.git sisyphus/kernel-modules-vhba-un-def-20211218-alt1.k: build start
2026-Oct-03 15:13:38 :: task abort requested by kernelbot.
2026-Oct-03 15:13:54 :: [armh] #3300 kernel-modules-vhba-un-def.git sisyphus/kernel-modules-vhba-un-def-20211218-alt1.k: build OK
2026-Oct-03 15:13:54 :: [armh] task processing CANCELLED
2026-Oct-03 15:16:44 :: [aarch64] #3700 kernel-modules-zfs-un-def.git p10/kernel-modules-zfs-un-def-2.1.16-alt1: build OK
2026-Oct-03 15:01:58 :: [i586] build FAILED
2026-Oct-03 15:03:18 :: [x86_64] build FAILED
2026-Oct-03 15:13:54 :: [armh] build FAILED
2026-Oct-03 15:16:44 :: task #435322 for p10 FAILED


^ permalink raw reply	[flat|nested] 6+ messages in thread

* [#435322] p10 FAILED (try 3) kernel-image.git=kernel-image-un-def-6.1.189-alt1 ...
  2026-10-03 13:40 [#435322] p10 FAILED kernel-image.git=kernel-image-un-def-6.1.189-alt1 Girar awaiter (kernelbot)
  2026-10-03 15:16 ` [#435322] p10 FAILED (try 2) kernel-image.git=kernel-image-un-def-6.1.189-alt1 Girar awaiter (kernelbot)
@ 2026-10-03 15:47 ` Girar awaiter (kernelbot)
  2026-10-03 16:19 ` [#435322] p10 FAILED (try 4) kernel-image.git=kernel-image-un-def-6.1.189-alt1 Girar awaiter (kernelbot)
                   ` (2 subsequent siblings)
  4 siblings, 0 replies; 6+ messages in thread
From: Girar awaiter (kernelbot) @ 2026-10-03 15:47 UTC (permalink / raw)
  To: Kernel Bot; +Cc: girar-builder-p10, sisyphus-incominger, girar-builder-p10

https://git.altlinux.org/tasks/435322/logs/events.3.1.log
https://packages.altlinux.org/tasks/435322

subtask  name                                  aarch64  armh    i586  x86_64
   #600  kernel-modules-dm-secdel-un-def          1:12  2:04      54      56
  #1600  kernel-modules-lkrg-un-def                  -     -      53      54
  #2400  kernel-modules-rtl8723du-un-def             -     -  failed  failed
  #3000  kernel-modules-rtw89-un-def                52  1:15       ?       ?
  #3100  kernel-modules-sysdig-un-def               48     -       ?       ?
  #3200  kernel-modules-v4l2loopback-un-def         41    58       ?       ?
  #3300  kernel-modules-vhba-un-def                 41    58       ?       ?
  #3600  kernel-modules-xtables-addons-un-def     1:16  1:43       ?       ?
  #3700  kernel-modules-zfs-un-def                6:05  7:48       ?       ?

2026-Oct-03 15:19:41 :: task #435322 for p10 resumed by kernelbot:
2026-Oct-03 15:19:41 :: message: v6.1.189
#100 build kernel-image-un-def-6.1.189-alt1 from /people/kernelbot/packages/kernel-image.git fetched at 2026-Oct-03 12:07:12
#200 build sisyphus/kernel-modules-LiME-un-def-1.9.1-alt1 from /gears/k/kernel-modules-LiME-un-def.git fetched at 2026-Oct-03 12:07:17 from p10
#300 build sisyphus/kernel-modules-accel-ppp-un-def-1.12.0-alt3 from /gears/k/kernel-modules-accel-ppp-un-def.git fetched at 2026-Oct-03 12:07:22 from p10
#400 build sisyphus/kernel-modules-anbox-un-def-14-alt2.gae26ba2 from /gears/k/kernel-modules-anbox-un-def.git fetched at 2026-Oct-03 12:07:23 from p10
#500 build sisyphus/kernel-modules-bcmwl-un-def-6.30.223.271-alt15 from /gears/k/kernel-modules-bcmwl-un-def.git fetched at 2026-Oct-03 12:07:32 from p10
#600 build sisyphus/kernel-modules-dm-secdel-un-def-1.0.9-alt1 from /gears/k/kernel-modules-dm-secdel-un-def.git fetched at 2026-Oct-03 12:07:33 from p10
#700 build sisyphus/kernel-modules-drbd9-un-def-9.2.12-alt1 from /gears/k/kernel-modules-drbd9-un-def.git fetched at 2026-Oct-03 12:07:37 from p10
#1000 build sisyphus/kernel-modules-evdi-un-def-1.14.1-alt1 from /gears/k/kernel-modules-evdi-un-def.git fetched at 2026-Oct-03 12:07:39 from p10
#1100 build sisyphus/kernel-modules-i40e-un-def-2.22.20-alt1 from /gears/k/kernel-modules-i40e-un-def.git fetched at 2026-Oct-03 12:07:40 from p10
#1200 build sisyphus/kernel-modules-iavf-un-def-4.8.3-alt1 from /gears/k/kernel-modules-iavf-un-def.git fetched at 2026-Oct-03 12:07:41 from p10
#1300 build sisyphus/kernel-modules-ipt-ratelimit-un-def-0.3.3-alt1 from /gears/k/kernel-modules-ipt-ratelimit-un-def.git fetched at 2026-Oct-03 12:07:48 from p10
#1400 build sisyphus/kernel-modules-ipt_netflow-un-def-2.6-alt1 from /gears/k/kernel-modules-ipt_netflow-un-def.git fetched at 2026-Oct-03 12:07:54 from p10
#1500 build sisyphus/kernel-modules-ixgbe-un-def-5.20.10-alt1 from /gears/k/kernel-modules-ixgbe-un-def.git fetched at 2026-Oct-03 12:07:57 from p10
#1600 build sisyphus/kernel-modules-lkrg-un-def-0.9.8-alt3 from /gears/k/kernel-modules-lkrg-un-def.git fetched at 2026-Oct-03 12:08:01 from p10
#1700 build sisyphus/kernel-modules-nvidia-un-def-550.144.03-alt1 from /gears/k/kernel-modules-nvidia-un-def.git fetched at 2026-Oct-03 12:08:15 from p10
#2000 build sisyphus/kernel-modules-r8125-un-def-9.011.01-alt1 from /gears/k/kernel-modules-r8125-un-def.git fetched at 2026-Oct-03 12:08:18 from p10
#2100 build sisyphus/kernel-modules-r8168-un-def-8.053.01-alt1.k from /gears/k/kernel-modules-r8168-un-def.git fetched at 2026-Oct-03 12:08:26 from p10
#2200 removed
#2300 removed
#2400 build sisyphus/kernel-modules-rtl8723du-un-def-5.13.4-alt1 from /gears/k/kernel-modules-rtl8723du-un-def.git fetched at 2026-Oct-03 12:08:31 from p10
#2500 build sisyphus/kernel-modules-rtl8812au-un-def-5.6.4.2-alt1 from /gears/k/kernel-modules-rtl8812au-un-def.git fetched at 2026-Oct-03 12:08:33 from p10
#2600 build sisyphus/kernel-modules-rtl8821cu-un-def-5.12.0.4-alt1 from /gears/k/kernel-modules-rtl8821cu-un-def.git fetched at 2026-Oct-03 12:08:36 from p10
#2700 removed
#3000 build sisyphus/kernel-modules-rtw89-un-def-0.0-alt4.git.4f3464d from /gears/k/kernel-modules-rtw89-un-def.git fetched at 2026-Oct-03 12:08:40 from p10
#3100 build sisyphus/kernel-modules-sysdig-un-def-7.3.0-alt1 from /gears/k/kernel-modules-sysdig-un-def.git fetched at 2026-Oct-03 12:08:41 from p10
#3200 build sisyphus/kernel-modules-v4l2loopback-un-def-0.12.7-alt1.g5e9dd41 from /gears/k/kernel-modules-v4l2loopback-un-def.git fetched at 2026-Oct-03 12:08:44 from p10
#3300 build sisyphus/kernel-modules-vhba-un-def-20211218-alt1.k from /gears/k/kernel-modules-vhba-un-def.git fetched at 2026-Oct-03 12:08:51 from p10
#3400 build sisyphus/kernel-modules-virtualbox-addition-p10-un-def-7.1.16-alt1 from /gears/k/kernel-modules-virtualbox-addition-un-def.git fetched at 2026-Oct-03 12:09:02 from p10
#3500 build sisyphus/kernel-modules-virtualbox-p10-un-def-7.1.16-alt1 from /gears/k/kernel-modules-virtualbox-un-def.git fetched at 2026-Oct-03 12:09:13 from p10
#3600 build sisyphus/kernel-modules-xtables-addons-un-def-3.23-alt1 from /gears/k/kernel-modules-xtables-addons-un-def.git fetched at 2026-Oct-03 12:09:21 from p10
#3700 build p10/kernel-modules-zfs-un-def-2.1.16-alt1 from /gears/k/kernel-modules-zfs-un-def.git fetched at 2026-Oct-03 12:09:27 from p10
2026-Oct-03 15:19:41 :: created build repo
2026-Oct-03 15:19:42 :: #600: force rebuild
2026-Oct-03 15:19:42 :: #1600: force rebuild
2026-Oct-03 15:19:42 :: #3000: force rebuild
2026-Oct-03 15:19:42 :: #3100: force rebuild
2026-Oct-03 15:19:42 :: #3200: force rebuild
2026-Oct-03 15:19:42 :: #3300: force rebuild
2026-Oct-03 15:19:42 :: #3600: force rebuild
2026-Oct-03 15:19:42 :: #3700: force rebuild
2026-Oct-03 15:19:43 :: [aarch64] #100 kernel-image.git kernel-image-un-def-6.1.189-alt1: build start
2026-Oct-03 15:19:43 :: [x86_64] #100 kernel-image.git kernel-image-un-def-6.1.189-alt1: build start
2026-Oct-03 15:19:43 :: [armh] #100 kernel-image.git kernel-image-un-def-6.1.189-alt1: build start
2026-Oct-03 15:19:43 :: [i586] #100 kernel-image.git kernel-image-un-def-6.1.189-alt1: build start
2026-Oct-03 15:20:01 :: [i586] #100 kernel-image.git kernel-image-un-def-6.1.189-alt1: build OK (cached)
2026-Oct-03 15:20:02 :: [i586] #200 kernel-modules-LiME-un-def.git sisyphus/kernel-modules-LiME-un-def-1.9.1-alt1: build start
2026-Oct-03 15:20:03 :: [x86_64] #100 kernel-image.git kernel-image-un-def-6.1.189-alt1: build OK (cached)
2026-Oct-03 15:20:03 :: [x86_64] #200 kernel-modules-LiME-un-def.git sisyphus/kernel-modules-LiME-un-def-1.9.1-alt1: build start
2026-Oct-03 15:20:12 :: [aarch64] #100 kernel-image.git kernel-image-un-def-6.1.189-alt1: build OK (cached)
2026-Oct-03 15:20:12 :: [aarch64] #200 kernel-modules-LiME-un-def.git sisyphus/kernel-modules-LiME-un-def-1.9.1-alt1: build start
2026-Oct-03 15:20:13 :: [i586] #200 kernel-modules-LiME-un-def.git sisyphus/kernel-modules-LiME-un-def-1.9.1-alt1: build OK (cached)
2026-Oct-03 15:20:13 :: [i586] #300 kernel-modules-accel-ppp-un-def.git sisyphus/kernel-modules-accel-ppp-un-def-1.12.0-alt3: build start
2026-Oct-03 15:20:15 :: [x86_64] #200 kernel-modules-LiME-un-def.git sisyphus/kernel-modules-LiME-un-def-1.9.1-alt1: build OK (cached)
2026-Oct-03 15:20:15 :: [x86_64] #300 kernel-modules-accel-ppp-un-def.git sisyphus/kernel-modules-accel-ppp-un-def-1.12.0-alt3: build start
2026-Oct-03 15:20:23 :: [armh] #100 kernel-image.git kernel-image-un-def-6.1.189-alt1: build OK (cached)
2026-Oct-03 15:20:23 :: [armh] #200 kernel-modules-LiME-un-def.git sisyphus/kernel-modules-LiME-un-def-1.9.1-alt1: build start
2026-Oct-03 15:20:25 :: [i586] #300 kernel-modules-accel-ppp-un-def.git sisyphus/kernel-modules-accel-ppp-un-def-1.12.0-alt3: build OK (cached)
2026-Oct-03 15:20:25 :: [i586] #400 kernel-modules-anbox-un-def.git sisyphus/kernel-modules-anbox-un-def-14-alt2.gae26ba2: build start
2026-Oct-03 15:20:27 :: [x86_64] #300 kernel-modules-accel-ppp-un-def.git sisyphus/kernel-modules-accel-ppp-un-def-1.12.0-alt3: build OK (cached)
2026-Oct-03 15:20:27 :: [x86_64] #400 kernel-modules-anbox-un-def.git sisyphus/kernel-modules-anbox-un-def-14-alt2.gae26ba2: build start
2026-Oct-03 15:20:32 :: [aarch64] #200 kernel-modules-LiME-un-def.git sisyphus/kernel-modules-LiME-un-def-1.9.1-alt1: build OK (cached)
2026-Oct-03 15:20:32 :: [aarch64] #300 kernel-modules-accel-ppp-un-def.git sisyphus/kernel-modules-accel-ppp-un-def-1.12.0-alt3: build start
2026-Oct-03 15:20:36 :: [i586] #400 kernel-modules-anbox-un-def.git sisyphus/kernel-modules-anbox-un-def-14-alt2.gae26ba2: build OK (cached)
2026-Oct-03 15:20:36 :: [i586] #500 kernel-modules-bcmwl-un-def.git sisyphus/kernel-modules-bcmwl-un-def-6.30.223.271-alt15: build start
2026-Oct-03 15:20:39 :: [x86_64] #400 kernel-modules-anbox-un-def.git sisyphus/kernel-modules-anbox-un-def-14-alt2.gae26ba2: build OK (cached)
2026-Oct-03 15:20:39 :: [x86_64] #500 kernel-modules-bcmwl-un-def.git sisyphus/kernel-modules-bcmwl-un-def-6.30.223.271-alt15: build start
2026-Oct-03 15:20:51 :: [i586] #500 kernel-modules-bcmwl-un-def.git sisyphus/kernel-modules-bcmwl-un-def-6.30.223.271-alt15: build SKIPPED
2026-Oct-03 15:20:51 :: [x86_64] #500 kernel-modules-bcmwl-un-def.git sisyphus/kernel-modules-bcmwl-un-def-6.30.223.271-alt15: build OK (cached)
2026-Oct-03 15:20:51 :: [i586] #600 kernel-modules-dm-secdel-un-def.git sisyphus/kernel-modules-dm-secdel-un-def-1.0.9-alt1: build start
2026-Oct-03 15:20:51 :: [x86_64] #600 kernel-modules-dm-secdel-un-def.git sisyphus/kernel-modules-dm-secdel-un-def-1.0.9-alt1: build start
2026-Oct-03 15:20:52 :: [aarch64] #300 kernel-modules-accel-ppp-un-def.git sisyphus/kernel-modules-accel-ppp-un-def-1.12.0-alt3: build OK (cached)
2026-Oct-03 15:20:52 :: [aarch64] #400 kernel-modules-anbox-un-def.git sisyphus/kernel-modules-anbox-un-def-14-alt2.gae26ba2: build start
2026-Oct-03 15:20:53 :: [armh] #200 kernel-modules-LiME-un-def.git sisyphus/kernel-modules-LiME-un-def-1.9.1-alt1: build OK (cached)
2026-Oct-03 15:20:53 :: [armh] #300 kernel-modules-accel-ppp-un-def.git sisyphus/kernel-modules-accel-ppp-un-def-1.12.0-alt3: build start
2026-Oct-03 15:21:11 :: [aarch64] #400 kernel-modules-anbox-un-def.git sisyphus/kernel-modules-anbox-un-def-14-alt2.gae26ba2: build OK (cached)
2026-Oct-03 15:21:12 :: [aarch64] #500 kernel-modules-bcmwl-un-def.git sisyphus/kernel-modules-bcmwl-un-def-6.30.223.271-alt15: build start
2026-Oct-03 15:21:30 :: [armh] #300 kernel-modules-accel-ppp-un-def.git sisyphus/kernel-modules-accel-ppp-un-def-1.12.0-alt3: build SKIPPED
2026-Oct-03 15:21:30 :: [armh] #400 kernel-modules-anbox-un-def.git sisyphus/kernel-modules-anbox-un-def-14-alt2.gae26ba2: build start
2026-Oct-03 15:21:35 :: [aarch64] #500 kernel-modules-bcmwl-un-def.git sisyphus/kernel-modules-bcmwl-un-def-6.30.223.271-alt15: build SKIPPED
2026-Oct-03 15:21:36 :: [aarch64] #600 kernel-modules-dm-secdel-un-def.git sisyphus/kernel-modules-dm-secdel-un-def-1.0.9-alt1: build start
2026-Oct-03 15:21:45 :: [i586] #600 kernel-modules-dm-secdel-un-def.git sisyphus/kernel-modules-dm-secdel-un-def-1.0.9-alt1: build OK
2026-Oct-03 15:21:45 :: [i586] #700 kernel-modules-drbd9-un-def.git sisyphus/kernel-modules-drbd9-un-def-9.2.12-alt1: build start
2026-Oct-03 15:21:47 :: [x86_64] #600 kernel-modules-dm-secdel-un-def.git sisyphus/kernel-modules-dm-secdel-un-def-1.0.9-alt1: build OK
2026-Oct-03 15:21:47 :: [x86_64] #700 kernel-modules-drbd9-un-def.git sisyphus/kernel-modules-drbd9-un-def-9.2.12-alt1: build start
2026-Oct-03 15:21:58 :: [x86_64] #700 kernel-modules-drbd9-un-def.git sisyphus/kernel-modules-drbd9-un-def-9.2.12-alt1: build OK (cached)
2026-Oct-03 15:21:59 :: [x86_64] #1000 kernel-modules-evdi-un-def.git sisyphus/kernel-modules-evdi-un-def-1.14.1-alt1: build start
2026-Oct-03 15:21:59 :: [i586] #700 kernel-modules-drbd9-un-def.git sisyphus/kernel-modules-drbd9-un-def-9.2.12-alt1: build SKIPPED
2026-Oct-03 15:21:59 :: [i586] #1000 kernel-modules-evdi-un-def.git sisyphus/kernel-modules-evdi-un-def-1.14.1-alt1: build start
2026-Oct-03 15:21:59 :: [armh] #400 kernel-modules-anbox-un-def.git sisyphus/kernel-modules-anbox-un-def-14-alt2.gae26ba2: build OK (cached)
2026-Oct-03 15:22:00 :: [armh] #500 kernel-modules-bcmwl-un-def.git sisyphus/kernel-modules-bcmwl-un-def-6.30.223.271-alt15: build start
2026-Oct-03 15:22:10 :: [x86_64] #1000 kernel-modules-evdi-un-def.git sisyphus/kernel-modules-evdi-un-def-1.14.1-alt1: build OK (cached)
2026-Oct-03 15:22:11 :: [i586] #1000 kernel-modules-evdi-un-def.git sisyphus/kernel-modules-evdi-un-def-1.14.1-alt1: build OK (cached)
2026-Oct-03 15:22:11 :: [x86_64] #1100 kernel-modules-i40e-un-def.git sisyphus/kernel-modules-i40e-un-def-2.22.20-alt1: build start
2026-Oct-03 15:22:11 :: [i586] #1100 kernel-modules-i40e-un-def.git sisyphus/kernel-modules-i40e-un-def-2.22.20-alt1: build start
2026-Oct-03 15:22:23 :: [x86_64] #1100 kernel-modules-i40e-un-def.git sisyphus/kernel-modules-i40e-un-def-2.22.20-alt1: build OK (cached)
2026-Oct-03 15:22:23 :: [x86_64] #1200 kernel-modules-iavf-un-def.git sisyphus/kernel-modules-iavf-un-def-4.8.3-alt1: build start
2026-Oct-03 15:22:25 :: [i586] #1100 kernel-modules-i40e-un-def.git sisyphus/kernel-modules-i40e-un-def-2.22.20-alt1: build SKIPPED
2026-Oct-03 15:22:26 :: [i586] #1200 kernel-modules-iavf-un-def.git sisyphus/kernel-modules-iavf-un-def-4.8.3-alt1: build start
2026-Oct-03 15:22:35 :: [x86_64] #1200 kernel-modules-iavf-un-def.git sisyphus/kernel-modules-iavf-un-def-4.8.3-alt1: build OK (cached)
2026-Oct-03 15:22:35 :: [x86_64] #1300 kernel-modules-ipt-ratelimit-un-def.git sisyphus/kernel-modules-ipt-ratelimit-un-def-0.3.3-alt1: build start
2026-Oct-03 15:22:35 :: [armh] #500 kernel-modules-bcmwl-un-def.git sisyphus/kernel-modules-bcmwl-un-def-6.30.223.271-alt15: build SKIPPED
2026-Oct-03 15:22:35 :: [armh] #600 kernel-modules-dm-secdel-un-def.git sisyphus/kernel-modules-dm-secdel-un-def-1.0.9-alt1: build start
2026-Oct-03 15:22:40 :: [i586] #1200 kernel-modules-iavf-un-def.git sisyphus/kernel-modules-iavf-un-def-4.8.3-alt1: build SKIPPED
2026-Oct-03 15:22:40 :: [i586] #1300 kernel-modules-ipt-ratelimit-un-def.git sisyphus/kernel-modules-ipt-ratelimit-un-def-0.3.3-alt1: build start
2026-Oct-03 15:22:47 :: [x86_64] #1300 kernel-modules-ipt-ratelimit-un-def.git sisyphus/kernel-modules-ipt-ratelimit-un-def-0.3.3-alt1: build OK (cached)
2026-Oct-03 15:22:47 :: [x86_64] #1400 kernel-modules-ipt_netflow-un-def.git sisyphus/kernel-modules-ipt_netflow-un-def-2.6-alt1: build start
2026-Oct-03 15:22:48 :: [aarch64] #600 kernel-modules-dm-secdel-un-def.git sisyphus/kernel-modules-dm-secdel-un-def-1.0.9-alt1: build OK
2026-Oct-03 15:22:48 :: [aarch64] #700 kernel-modules-drbd9-un-def.git sisyphus/kernel-modules-drbd9-un-def-9.2.12-alt1: build start
2026-Oct-03 15:22:52 :: [i586] #1300 kernel-modules-ipt-ratelimit-un-def.git sisyphus/kernel-modules-ipt-ratelimit-un-def-0.3.3-alt1: build OK (cached)
2026-Oct-03 15:22:52 :: [i586] #1400 kernel-modules-ipt_netflow-un-def.git sisyphus/kernel-modules-ipt_netflow-un-def-2.6-alt1: build start
2026-Oct-03 15:22:59 :: [x86_64] #1400 kernel-modules-ipt_netflow-un-def.git sisyphus/kernel-modules-ipt_netflow-un-def-2.6-alt1: build OK (cached)
2026-Oct-03 15:22:59 :: [x86_64] #1500 kernel-modules-ixgbe-un-def.git sisyphus/kernel-modules-ixgbe-un-def-5.20.10-alt1: build start
2026-Oct-03 15:23:03 :: [i586] #1400 kernel-modules-ipt_netflow-un-def.git sisyphus/kernel-modules-ipt_netflow-un-def-2.6-alt1: build OK (cached)
2026-Oct-03 15:23:03 :: [i586] #1500 kernel-modules-ixgbe-un-def.git sisyphus/kernel-modules-ixgbe-un-def-5.20.10-alt1: build start
2026-Oct-03 15:23:07 :: [aarch64] #700 kernel-modules-drbd9-un-def.git sisyphus/kernel-modules-drbd9-un-def-9.2.12-alt1: build OK (cached)
2026-Oct-03 15:23:08 :: [aarch64] #1000 kernel-modules-evdi-un-def.git sisyphus/kernel-modules-evdi-un-def-1.14.1-alt1: build start
2026-Oct-03 15:23:11 :: [x86_64] #1500 kernel-modules-ixgbe-un-def.git sisyphus/kernel-modules-ixgbe-un-def-5.20.10-alt1: build OK (cached)
2026-Oct-03 15:23:12 :: [x86_64] #1600 kernel-modules-lkrg-un-def.git sisyphus/kernel-modules-lkrg-un-def-0.9.8-alt3: build start
2026-Oct-03 15:23:18 :: [i586] #1500 kernel-modules-ixgbe-un-def.git sisyphus/kernel-modules-ixgbe-un-def-5.20.10-alt1: build SKIPPED
2026-Oct-03 15:23:18 :: [i586] #1600 kernel-modules-lkrg-un-def.git sisyphus/kernel-modules-lkrg-un-def-0.9.8-alt3: build start
2026-Oct-03 15:23:27 :: [aarch64] #1000 kernel-modules-evdi-un-def.git sisyphus/kernel-modules-evdi-un-def-1.14.1-alt1: build OK (cached)
2026-Oct-03 15:23:27 :: [aarch64] #1100 kernel-modules-i40e-un-def.git sisyphus/kernel-modules-i40e-un-def-2.22.20-alt1: build start
2026-Oct-03 15:23:47 :: [aarch64] #1100 kernel-modules-i40e-un-def.git sisyphus/kernel-modules-i40e-un-def-2.22.20-alt1: build OK (cached)
2026-Oct-03 15:23:47 :: [aarch64] #1200 kernel-modules-iavf-un-def.git sisyphus/kernel-modules-iavf-un-def-4.8.3-alt1: build start
2026-Oct-03 15:24:06 :: [x86_64] #1600 kernel-modules-lkrg-un-def.git sisyphus/kernel-modules-lkrg-un-def-0.9.8-alt3: build OK
2026-Oct-03 15:24:06 :: [x86_64] #1700 kernel-modules-nvidia-un-def.git sisyphus/kernel-modules-nvidia-un-def-550.144.03-alt1: build start
2026-Oct-03 15:24:07 :: [aarch64] #1200 kernel-modules-iavf-un-def.git sisyphus/kernel-modules-iavf-un-def-4.8.3-alt1: build OK (cached)
2026-Oct-03 15:24:07 :: [aarch64] #1300 kernel-modules-ipt-ratelimit-un-def.git sisyphus/kernel-modules-ipt-ratelimit-un-def-0.3.3-alt1: build start
2026-Oct-03 15:24:11 :: [i586] #1600 kernel-modules-lkrg-un-def.git sisyphus/kernel-modules-lkrg-un-def-0.9.8-alt3: build OK
2026-Oct-03 15:24:11 :: [i586] #1700 kernel-modules-nvidia-un-def.git sisyphus/kernel-modules-nvidia-un-def-550.144.03-alt1: build start
2026-Oct-03 15:24:18 :: [x86_64] #1700 kernel-modules-nvidia-un-def.git sisyphus/kernel-modules-nvidia-un-def-550.144.03-alt1: build OK (cached)
2026-Oct-03 15:24:19 :: [x86_64] #2000 kernel-modules-r8125-un-def.git sisyphus/kernel-modules-r8125-un-def-9.011.01-alt1: build start
2026-Oct-03 15:24:22 :: [i586] #1700 kernel-modules-nvidia-un-def.git sisyphus/kernel-modules-nvidia-un-def-550.144.03-alt1: build OK (cached)
2026-Oct-03 15:24:22 :: [i586] #2000 kernel-modules-r8125-un-def.git sisyphus/kernel-modules-r8125-un-def-9.011.01-alt1: build start
2026-Oct-03 15:24:26 :: [aarch64] #1300 kernel-modules-ipt-ratelimit-un-def.git sisyphus/kernel-modules-ipt-ratelimit-un-def-0.3.3-alt1: build OK (cached)
2026-Oct-03 15:24:27 :: [aarch64] #1400 kernel-modules-ipt_netflow-un-def.git sisyphus/kernel-modules-ipt_netflow-un-def-2.6-alt1: build start
2026-Oct-03 15:24:30 :: [x86_64] #2000 kernel-modules-r8125-un-def.git sisyphus/kernel-modules-r8125-un-def-9.011.01-alt1: build OK (cached)
2026-Oct-03 15:24:31 :: [x86_64] #2100 kernel-modules-r8168-un-def.git sisyphus/kernel-modules-r8168-un-def-8.053.01-alt1.k: build start
2026-Oct-03 15:24:34 :: [i586] #2000 kernel-modules-r8125-un-def.git sisyphus/kernel-modules-r8125-un-def-9.011.01-alt1: build OK (cached)
2026-Oct-03 15:24:34 :: [i586] #2100 kernel-modules-r8168-un-def.git sisyphus/kernel-modules-r8168-un-def-8.053.01-alt1.k: build start
2026-Oct-03 15:24:39 :: [armh] #600 kernel-modules-dm-secdel-un-def.git sisyphus/kernel-modules-dm-secdel-un-def-1.0.9-alt1: build OK
2026-Oct-03 15:24:39 :: [armh] #700 kernel-modules-drbd9-un-def.git sisyphus/kernel-modules-drbd9-un-def-9.2.12-alt1: build start
2026-Oct-03 15:24:42 :: [x86_64] #2100 kernel-modules-r8168-un-def.git sisyphus/kernel-modules-r8168-un-def-8.053.01-alt1.k: build OK (cached)
2026-Oct-03 15:24:43 :: [x86_64] #2400 kernel-modules-rtl8723du-un-def.git sisyphus/kernel-modules-rtl8723du-un-def-5.13.4-alt1: build start
2026-Oct-03 15:24:45 :: [i586] #2100 kernel-modules-r8168-un-def.git sisyphus/kernel-modules-r8168-un-def-8.053.01-alt1.k: build OK (cached)
2026-Oct-03 15:24:45 :: [i586] #2400 kernel-modules-rtl8723du-un-def.git sisyphus/kernel-modules-rtl8723du-un-def-5.13.4-alt1: build start
2026-Oct-03 15:24:46 :: [aarch64] #1400 kernel-modules-ipt_netflow-un-def.git sisyphus/kernel-modules-ipt_netflow-un-def-2.6-alt1: build OK (cached)
2026-Oct-03 15:24:46 :: [aarch64] #1500 kernel-modules-ixgbe-un-def.git sisyphus/kernel-modules-ixgbe-un-def-5.20.10-alt1: build start
2026-Oct-03 15:25:06 :: [aarch64] #1500 kernel-modules-ixgbe-un-def.git sisyphus/kernel-modules-ixgbe-un-def-5.20.10-alt1: build OK (cached)
[x86_64]   CC [M]  /usr/src/RPM/BUILD/kernel-source-rtl8723du-5.13.4/os_dep/usb_intf.o
[x86_64] /usr/src/RPM/BUILD/kernel-source-rtl8723du-5.13.4/os_dep/usb_intf.c:153:10: error: 'struct usb_driver' has no member named 'drvwrap'
[x86_64]   153 |  .usbdrv.drvwrap.driver.shutdown = rtw_dev_shutdown,
2026-Oct-03 15:25:06 :: [x86_64] kernel-modules-rtl8723du-un-def.git sisyphus/kernel-modules-rtl8723du-un-def-5.13.4-alt1: remote: build failed
2026-Oct-03 15:25:06 :: [x86_64] #2400 kernel-modules-rtl8723du-un-def.git sisyphus/kernel-modules-rtl8723du-un-def-5.13.4-alt1: build FAILED
2026-Oct-03 15:25:06 :: [aarch64] #1600 kernel-modules-lkrg-un-def.git sisyphus/kernel-modules-lkrg-un-def-0.9.8-alt3: build start
[i586]   CC [M]  /usr/src/RPM/BUILD/kernel-source-rtl8723du-5.13.4/os_dep/usb_intf.o
[i586] /usr/src/RPM/BUILD/kernel-source-rtl8723du-5.13.4/os_dep/usb_intf.c:153:10: error: 'struct usb_driver' has no member named 'drvwrap'
[i586]   153 |  .usbdrv.drvwrap.driver.shutdown = rtw_dev_shutdown,
2026-Oct-03 15:25:09 :: [i586] kernel-modules-rtl8723du-un-def.git sisyphus/kernel-modules-rtl8723du-un-def-5.13.4-alt1: remote: build failed
2026-Oct-03 15:25:09 :: [i586] #2400 kernel-modules-rtl8723du-un-def.git sisyphus/kernel-modules-rtl8723du-un-def-5.13.4-alt1: build FAILED
2026-Oct-03 15:25:14 :: [armh] #700 kernel-modules-drbd9-un-def.git sisyphus/kernel-modules-drbd9-un-def-9.2.12-alt1: build SKIPPED
2026-Oct-03 15:25:14 :: [armh] #1000 kernel-modules-evdi-un-def.git sisyphus/kernel-modules-evdi-un-def-1.14.1-alt1: build start
2026-Oct-03 15:25:30 :: [aarch64] #1600 kernel-modules-lkrg-un-def.git sisyphus/kernel-modules-lkrg-un-def-0.9.8-alt3: build SKIPPED
2026-Oct-03 15:25:30 :: [aarch64] #1700 kernel-modules-nvidia-un-def.git sisyphus/kernel-modules-nvidia-un-def-550.144.03-alt1: build start
2026-Oct-03 15:25:43 :: [armh] #1000 kernel-modules-evdi-un-def.git sisyphus/kernel-modules-evdi-un-def-1.14.1-alt1: build OK (cached)
2026-Oct-03 15:25:44 :: [armh] #1100 kernel-modules-i40e-un-def.git sisyphus/kernel-modules-i40e-un-def-2.22.20-alt1: build start
2026-Oct-03 15:25:51 :: [aarch64] #1700 kernel-modules-nvidia-un-def.git sisyphus/kernel-modules-nvidia-un-def-550.144.03-alt1: build OK (cached)
2026-Oct-03 15:25:51 :: [aarch64] #2000 kernel-modules-r8125-un-def.git sisyphus/kernel-modules-r8125-un-def-9.011.01-alt1: build start
2026-Oct-03 15:26:15 :: [aarch64] #2000 kernel-modules-r8125-un-def.git sisyphus/kernel-modules-r8125-un-def-9.011.01-alt1: build SKIPPED
2026-Oct-03 15:26:15 :: [aarch64] #2100 kernel-modules-r8168-un-def.git sisyphus/kernel-modules-r8168-un-def-8.053.01-alt1.k: build start
2026-Oct-03 15:26:19 :: [armh] #1100 kernel-modules-i40e-un-def.git sisyphus/kernel-modules-i40e-un-def-2.22.20-alt1: build SKIPPED
2026-Oct-03 15:26:20 :: [armh] #1200 kernel-modules-iavf-un-def.git sisyphus/kernel-modules-iavf-un-def-4.8.3-alt1: build start
2026-Oct-03 15:26:35 :: [aarch64] #2100 kernel-modules-r8168-un-def.git sisyphus/kernel-modules-r8168-un-def-8.053.01-alt1.k: build OK (cached)
2026-Oct-03 15:26:35 :: [aarch64] #2400 kernel-modules-rtl8723du-un-def.git sisyphus/kernel-modules-rtl8723du-un-def-5.13.4-alt1: build start
2026-Oct-03 15:26:55 :: [armh] #1200 kernel-modules-iavf-un-def.git sisyphus/kernel-modules-iavf-un-def-4.8.3-alt1: build SKIPPED
2026-Oct-03 15:26:56 :: [armh] #1300 kernel-modules-ipt-ratelimit-un-def.git sisyphus/kernel-modules-ipt-ratelimit-un-def-0.3.3-alt1: build start
2026-Oct-03 15:26:59 :: [aarch64] #2400 kernel-modules-rtl8723du-un-def.git sisyphus/kernel-modules-rtl8723du-un-def-5.13.4-alt1: build SKIPPED
2026-Oct-03 15:26:59 :: [aarch64] #2500 kernel-modules-rtl8812au-un-def.git sisyphus/kernel-modules-rtl8812au-un-def-5.6.4.2-alt1: build start
2026-Oct-03 15:27:23 :: [aarch64] #2500 kernel-modules-rtl8812au-un-def.git sisyphus/kernel-modules-rtl8812au-un-def-5.6.4.2-alt1: build SKIPPED
2026-Oct-03 15:27:23 :: [aarch64] #2600 kernel-modules-rtl8821cu-un-def.git sisyphus/kernel-modules-rtl8821cu-un-def-5.12.0.4-alt1: build start
2026-Oct-03 15:27:25 :: [armh] #1300 kernel-modules-ipt-ratelimit-un-def.git sisyphus/kernel-modules-ipt-ratelimit-un-def-0.3.3-alt1: build OK (cached)
2026-Oct-03 15:27:25 :: [armh] #1400 kernel-modules-ipt_netflow-un-def.git sisyphus/kernel-modules-ipt_netflow-un-def-2.6-alt1: build start
2026-Oct-03 15:27:47 :: [aarch64] #2600 kernel-modules-rtl8821cu-un-def.git sisyphus/kernel-modules-rtl8821cu-un-def-5.12.0.4-alt1: build SKIPPED
2026-Oct-03 15:27:47 :: [aarch64] #3000 kernel-modules-rtw89-un-def.git sisyphus/kernel-modules-rtw89-un-def-0.0-alt4.git.4f3464d: build start
2026-Oct-03 15:28:01 :: [armh] #1400 kernel-modules-ipt_netflow-un-def.git sisyphus/kernel-modules-ipt_netflow-un-def-2.6-alt1: build SKIPPED
2026-Oct-03 15:28:01 :: [armh] #1500 kernel-modules-ixgbe-un-def.git sisyphus/kernel-modules-ixgbe-un-def-5.20.10-alt1: build start
2026-Oct-03 15:28:37 :: [armh] #1500 kernel-modules-ixgbe-un-def.git sisyphus/kernel-modules-ixgbe-un-def-5.20.10-alt1: build SKIPPED
2026-Oct-03 15:28:37 :: [armh] #1600 kernel-modules-lkrg-un-def.git sisyphus/kernel-modules-lkrg-un-def-0.9.8-alt3: build start
2026-Oct-03 15:28:39 :: [aarch64] #3000 kernel-modules-rtw89-un-def.git sisyphus/kernel-modules-rtw89-un-def-0.0-alt4.git.4f3464d: build OK
2026-Oct-03 15:28:39 :: [aarch64] #3100 kernel-modules-sysdig-un-def.git sisyphus/kernel-modules-sysdig-un-def-7.3.0-alt1: build start
2026-Oct-03 15:29:13 :: [armh] #1600 kernel-modules-lkrg-un-def.git sisyphus/kernel-modules-lkrg-un-def-0.9.8-alt3: build SKIPPED
2026-Oct-03 15:29:13 :: [armh] #1700 kernel-modules-nvidia-un-def.git sisyphus/kernel-modules-nvidia-un-def-550.144.03-alt1: build start
2026-Oct-03 15:29:27 :: [aarch64] #3100 kernel-modules-sysdig-un-def.git sisyphus/kernel-modules-sysdig-un-def-7.3.0-alt1: build OK
2026-Oct-03 15:29:28 :: [aarch64] #3200 kernel-modules-v4l2loopback-un-def.git sisyphus/kernel-modules-v4l2loopback-un-def-0.12.7-alt1.g5e9dd41: build start
2026-Oct-03 15:29:58 :: [armh] #1700 kernel-modules-nvidia-un-def.git sisyphus/kernel-modules-nvidia-un-def-550.144.03-alt1: build SKIPPED
2026-Oct-03 15:29:58 :: [armh] #2000 kernel-modules-r8125-un-def.git sisyphus/kernel-modules-r8125-un-def-9.011.01-alt1: build start
2026-Oct-03 15:30:09 :: [aarch64] #3200 kernel-modules-v4l2loopback-un-def.git sisyphus/kernel-modules-v4l2loopback-un-def-0.12.7-alt1.g5e9dd41: build OK
2026-Oct-03 15:30:09 :: [aarch64] #3300 kernel-modules-vhba-un-def.git sisyphus/kernel-modules-vhba-un-def-20211218-alt1.k: build start
2026-Oct-03 15:30:35 :: [armh] #2000 kernel-modules-r8125-un-def.git sisyphus/kernel-modules-r8125-un-def-9.011.01-alt1: build SKIPPED
2026-Oct-03 15:30:35 :: [armh] #2100 kernel-modules-r8168-un-def.git sisyphus/kernel-modules-r8168-un-def-8.053.01-alt1.k: build start
2026-Oct-03 15:30:50 :: [aarch64] #3300 kernel-modules-vhba-un-def.git sisyphus/kernel-modules-vhba-un-def-20211218-alt1.k: build OK
2026-Oct-03 15:30:51 :: [aarch64] #3400 kernel-modules-virtualbox-addition-un-def.git sisyphus/kernel-modules-virtualbox-addition-p10-un-def-7.1.16-alt1: build start
2026-Oct-03 15:31:04 :: [armh] #2100 kernel-modules-r8168-un-def.git sisyphus/kernel-modules-r8168-un-def-8.053.01-alt1.k: build OK (cached)
2026-Oct-03 15:31:05 :: [armh] #2400 kernel-modules-rtl8723du-un-def.git sisyphus/kernel-modules-rtl8723du-un-def-5.13.4-alt1: build start
2026-Oct-03 15:31:14 :: [aarch64] #3400 kernel-modules-virtualbox-addition-un-def.git sisyphus/kernel-modules-virtualbox-addition-p10-un-def-7.1.16-alt1: build SKIPPED
2026-Oct-03 15:31:14 :: [aarch64] #3500 kernel-modules-virtualbox-un-def.git sisyphus/kernel-modules-virtualbox-p10-un-def-7.1.16-alt1: build start
2026-Oct-03 15:31:38 :: [aarch64] #3500 kernel-modules-virtualbox-un-def.git sisyphus/kernel-modules-virtualbox-p10-un-def-7.1.16-alt1: build SKIPPED
2026-Oct-03 15:31:38 :: [aarch64] #3600 kernel-modules-xtables-addons-un-def.git sisyphus/kernel-modules-xtables-addons-un-def-3.23-alt1: build start
2026-Oct-03 15:31:40 :: [armh] #2400 kernel-modules-rtl8723du-un-def.git sisyphus/kernel-modules-rtl8723du-un-def-5.13.4-alt1: build SKIPPED
2026-Oct-03 15:31:41 :: [armh] #2500 kernel-modules-rtl8812au-un-def.git sisyphus/kernel-modules-rtl8812au-un-def-5.6.4.2-alt1: build start
2026-Oct-03 15:32:16 :: [armh] #2500 kernel-modules-rtl8812au-un-def.git sisyphus/kernel-modules-rtl8812au-un-def-5.6.4.2-alt1: build SKIPPED
2026-Oct-03 15:32:17 :: [armh] #2600 kernel-modules-rtl8821cu-un-def.git sisyphus/kernel-modules-rtl8821cu-un-def-5.12.0.4-alt1: build start
2026-Oct-03 15:32:53 :: [armh] #2600 kernel-modules-rtl8821cu-un-def.git sisyphus/kernel-modules-rtl8821cu-un-def-5.12.0.4-alt1: build SKIPPED
2026-Oct-03 15:32:53 :: [armh] #3000 kernel-modules-rtw89-un-def.git sisyphus/kernel-modules-rtw89-un-def-0.0-alt4.git.4f3464d: build start
2026-Oct-03 15:32:54 :: [aarch64] #3600 kernel-modules-xtables-addons-un-def.git sisyphus/kernel-modules-xtables-addons-un-def-3.23-alt1: build OK
2026-Oct-03 15:32:54 :: [aarch64] #3700 kernel-modules-zfs-un-def.git p10/kernel-modules-zfs-un-def-2.1.16-alt1: build start
2026-Oct-03 15:34:08 :: [armh] #3000 kernel-modules-rtw89-un-def.git sisyphus/kernel-modules-rtw89-un-def-0.0-alt4.git.4f3464d: build OK
2026-Oct-03 15:34:08 :: [armh] #3100 kernel-modules-sysdig-un-def.git sisyphus/kernel-modules-sysdig-un-def-7.3.0-alt1: build start
2026-Oct-03 15:34:42 :: [armh] #3100 kernel-modules-sysdig-un-def.git sisyphus/kernel-modules-sysdig-un-def-7.3.0-alt1: build SKIPPED
2026-Oct-03 15:34:43 :: [armh] #3200 kernel-modules-v4l2loopback-un-def.git sisyphus/kernel-modules-v4l2loopback-un-def-0.12.7-alt1.g5e9dd41: build start
2026-Oct-03 15:35:41 :: [armh] #3200 kernel-modules-v4l2loopback-un-def.git sisyphus/kernel-modules-v4l2loopback-un-def-0.12.7-alt1.g5e9dd41: build OK
2026-Oct-03 15:35:41 :: [armh] #3300 kernel-modules-vhba-un-def.git sisyphus/kernel-modules-vhba-un-def-20211218-alt1.k: build start
2026-Oct-03 15:36:39 :: [armh] #3300 kernel-modules-vhba-un-def.git sisyphus/kernel-modules-vhba-un-def-20211218-alt1.k: build OK
2026-Oct-03 15:36:39 :: [armh] #3400 kernel-modules-virtualbox-addition-un-def.git sisyphus/kernel-modules-virtualbox-addition-p10-un-def-7.1.16-alt1: build start
2026-Oct-03 15:37:14 :: [armh] #3400 kernel-modules-virtualbox-addition-un-def.git sisyphus/kernel-modules-virtualbox-addition-p10-un-def-7.1.16-alt1: build SKIPPED
2026-Oct-03 15:37:14 :: [armh] #3500 kernel-modules-virtualbox-un-def.git sisyphus/kernel-modules-virtualbox-p10-un-def-7.1.16-alt1: build start
2026-Oct-03 15:37:49 :: [armh] #3500 kernel-modules-virtualbox-un-def.git sisyphus/kernel-modules-virtualbox-p10-un-def-7.1.16-alt1: build SKIPPED
2026-Oct-03 15:37:50 :: [armh] #3600 kernel-modules-xtables-addons-un-def.git sisyphus/kernel-modules-xtables-addons-un-def-3.23-alt1: build start
2026-Oct-03 15:38:59 :: [aarch64] #3700 kernel-modules-zfs-un-def.git p10/kernel-modules-zfs-un-def-2.1.16-alt1: build OK
2026-Oct-03 15:39:33 :: [armh] #3600 kernel-modules-xtables-addons-un-def.git sisyphus/kernel-modules-xtables-addons-un-def-3.23-alt1: build OK
2026-Oct-03 15:39:33 :: [armh] #3700 kernel-modules-zfs-un-def.git p10/kernel-modules-zfs-un-def-2.1.16-alt1: build start
2026-Oct-03 15:47:21 :: [armh] #3700 kernel-modules-zfs-un-def.git p10/kernel-modules-zfs-un-def-2.1.16-alt1: build OK
2026-Oct-03 15:25:06 :: [x86_64] build FAILED
2026-Oct-03 15:25:09 :: [i586] build FAILED
2026-Oct-03 15:47:21 :: task #435322 for p10 FAILED


^ permalink raw reply	[flat|nested] 6+ messages in thread

* [#435322] p10 FAILED (try 4) kernel-image.git=kernel-image-un-def-6.1.189-alt1 ...
  2026-10-03 13:40 [#435322] p10 FAILED kernel-image.git=kernel-image-un-def-6.1.189-alt1 Girar awaiter (kernelbot)
  2026-10-03 15:16 ` [#435322] p10 FAILED (try 2) kernel-image.git=kernel-image-un-def-6.1.189-alt1 Girar awaiter (kernelbot)
  2026-10-03 15:47 ` [#435322] p10 FAILED (try 3) kernel-image.git=kernel-image-un-def-6.1.189-alt1 Girar awaiter (kernelbot)
@ 2026-10-03 16:19 ` Girar awaiter (kernelbot)
  2026-10-04  5:40 ` [#435322] p10 FAILED (try 5) kernel-image.git=kernel-image-un-def-6.1.189-alt1 Girar awaiter (kernelbot)
  2026-10-04  8:23 ` [#435322] p10 FAILED (try 6) kernel-image.git=kernel-image-un-def-6.1.189-alt1 Girar awaiter (kernelbot)
  4 siblings, 0 replies; 6+ messages in thread
From: Girar awaiter (kernelbot) @ 2026-10-03 16:19 UTC (permalink / raw)
  To: Kernel Bot; +Cc: girar-builder-p10, sisyphus-incominger, girar-builder-p10

https://git.altlinux.org/tasks/435322/logs/events.4.1.log
https://packages.altlinux.org/tasks/435322

subtask  name                                  aarch64  armh    i586  x86_64
  #2500  kernel-modules-rtl8812au-un-def             -     -  failed  failed
  #3000  kernel-modules-rtw89-un-def                52  1:15       ?       ?
  #3100  kernel-modules-sysdig-un-def               47     -       ?       ?
  #3200  kernel-modules-v4l2loopback-un-def         41    59       ?       ?
  #3300  kernel-modules-vhba-un-def                 42    57       ?       ?
  #3600  kernel-modules-xtables-addons-un-def     1:16  1:42       ?       ?
  #3700  kernel-modules-zfs-un-def                6:07  7:46       ?       ?

2026-Oct-03 15:53:46 :: task #435322 for p10 resumed by kernelbot:
2026-Oct-03 15:53:46 :: message: v6.1.189
#100 build kernel-image-un-def-6.1.189-alt1 from /people/kernelbot/packages/kernel-image.git fetched at 2026-Oct-03 12:07:12
#200 build sisyphus/kernel-modules-LiME-un-def-1.9.1-alt1 from /gears/k/kernel-modules-LiME-un-def.git fetched at 2026-Oct-03 12:07:17 from p10
#300 build sisyphus/kernel-modules-accel-ppp-un-def-1.12.0-alt3 from /gears/k/kernel-modules-accel-ppp-un-def.git fetched at 2026-Oct-03 12:07:22 from p10
#400 build sisyphus/kernel-modules-anbox-un-def-14-alt2.gae26ba2 from /gears/k/kernel-modules-anbox-un-def.git fetched at 2026-Oct-03 12:07:23 from p10
#500 build sisyphus/kernel-modules-bcmwl-un-def-6.30.223.271-alt15 from /gears/k/kernel-modules-bcmwl-un-def.git fetched at 2026-Oct-03 12:07:32 from p10
#600 build sisyphus/kernel-modules-dm-secdel-un-def-1.0.9-alt1 from /gears/k/kernel-modules-dm-secdel-un-def.git fetched at 2026-Oct-03 12:07:33 from p10
#700 build sisyphus/kernel-modules-drbd9-un-def-9.2.12-alt1 from /gears/k/kernel-modules-drbd9-un-def.git fetched at 2026-Oct-03 12:07:37 from p10
#1000 build sisyphus/kernel-modules-evdi-un-def-1.14.1-alt1 from /gears/k/kernel-modules-evdi-un-def.git fetched at 2026-Oct-03 12:07:39 from p10
#1100 build sisyphus/kernel-modules-i40e-un-def-2.22.20-alt1 from /gears/k/kernel-modules-i40e-un-def.git fetched at 2026-Oct-03 12:07:40 from p10
#1200 build sisyphus/kernel-modules-iavf-un-def-4.8.3-alt1 from /gears/k/kernel-modules-iavf-un-def.git fetched at 2026-Oct-03 12:07:41 from p10
#1300 build sisyphus/kernel-modules-ipt-ratelimit-un-def-0.3.3-alt1 from /gears/k/kernel-modules-ipt-ratelimit-un-def.git fetched at 2026-Oct-03 12:07:48 from p10
#1400 build sisyphus/kernel-modules-ipt_netflow-un-def-2.6-alt1 from /gears/k/kernel-modules-ipt_netflow-un-def.git fetched at 2026-Oct-03 12:07:54 from p10
#1500 build sisyphus/kernel-modules-ixgbe-un-def-5.20.10-alt1 from /gears/k/kernel-modules-ixgbe-un-def.git fetched at 2026-Oct-03 12:07:57 from p10
#1600 build sisyphus/kernel-modules-lkrg-un-def-0.9.8-alt3 from /gears/k/kernel-modules-lkrg-un-def.git fetched at 2026-Oct-03 12:08:01 from p10
#1700 build sisyphus/kernel-modules-nvidia-un-def-550.144.03-alt1 from /gears/k/kernel-modules-nvidia-un-def.git fetched at 2026-Oct-03 12:08:15 from p10
#2000 build sisyphus/kernel-modules-r8125-un-def-9.011.01-alt1 from /gears/k/kernel-modules-r8125-un-def.git fetched at 2026-Oct-03 12:08:18 from p10
#2100 build sisyphus/kernel-modules-r8168-un-def-8.053.01-alt1.k from /gears/k/kernel-modules-r8168-un-def.git fetched at 2026-Oct-03 12:08:26 from p10
#2200 removed
#2300 removed
#2400 removed
#2500 build sisyphus/kernel-modules-rtl8812au-un-def-5.6.4.2-alt1 from /gears/k/kernel-modules-rtl8812au-un-def.git fetched at 2026-Oct-03 12:08:33 from p10
#2600 build sisyphus/kernel-modules-rtl8821cu-un-def-5.12.0.4-alt1 from /gears/k/kernel-modules-rtl8821cu-un-def.git fetched at 2026-Oct-03 12:08:36 from p10
#2700 removed
#3000 build sisyphus/kernel-modules-rtw89-un-def-0.0-alt4.git.4f3464d from /gears/k/kernel-modules-rtw89-un-def.git fetched at 2026-Oct-03 12:08:40 from p10
#3100 build sisyphus/kernel-modules-sysdig-un-def-7.3.0-alt1 from /gears/k/kernel-modules-sysdig-un-def.git fetched at 2026-Oct-03 12:08:41 from p10
#3200 build sisyphus/kernel-modules-v4l2loopback-un-def-0.12.7-alt1.g5e9dd41 from /gears/k/kernel-modules-v4l2loopback-un-def.git fetched at 2026-Oct-03 12:08:44 from p10
#3300 build sisyphus/kernel-modules-vhba-un-def-20211218-alt1.k from /gears/k/kernel-modules-vhba-un-def.git fetched at 2026-Oct-03 12:08:51 from p10
#3400 build sisyphus/kernel-modules-virtualbox-addition-p10-un-def-7.1.16-alt1 from /gears/k/kernel-modules-virtualbox-addition-un-def.git fetched at 2026-Oct-03 12:09:02 from p10
#3500 build sisyphus/kernel-modules-virtualbox-p10-un-def-7.1.16-alt1 from /gears/k/kernel-modules-virtualbox-un-def.git fetched at 2026-Oct-03 12:09:13 from p10
#3600 build sisyphus/kernel-modules-xtables-addons-un-def-3.23-alt1 from /gears/k/kernel-modules-xtables-addons-un-def.git fetched at 2026-Oct-03 12:09:21 from p10
#3700 build p10/kernel-modules-zfs-un-def-2.1.16-alt1 from /gears/k/kernel-modules-zfs-un-def.git fetched at 2026-Oct-03 12:09:27 from p10
2026-Oct-03 15:53:47 :: created build repo
2026-Oct-03 15:53:49 :: #3000: force rebuild
2026-Oct-03 15:53:49 :: #3100: force rebuild
2026-Oct-03 15:53:49 :: #3200: force rebuild
2026-Oct-03 15:53:49 :: #3300: force rebuild
2026-Oct-03 15:53:49 :: #3600: force rebuild
2026-Oct-03 15:53:49 :: #3700: force rebuild
2026-Oct-03 15:53:49 :: [aarch64] #100 kernel-image.git kernel-image-un-def-6.1.189-alt1: build start
2026-Oct-03 15:53:49 :: [armh] #100 kernel-image.git kernel-image-un-def-6.1.189-alt1: build start
2026-Oct-03 15:53:49 :: [i586] #100 kernel-image.git kernel-image-un-def-6.1.189-alt1: build start
2026-Oct-03 15:53:49 :: [x86_64] #100 kernel-image.git kernel-image-un-def-6.1.189-alt1: build start
2026-Oct-03 15:54:08 :: [i586] #100 kernel-image.git kernel-image-un-def-6.1.189-alt1: build OK (cached)
2026-Oct-03 15:54:09 :: [i586] #200 kernel-modules-LiME-un-def.git sisyphus/kernel-modules-LiME-un-def-1.9.1-alt1: build start
2026-Oct-03 15:54:10 :: [x86_64] #100 kernel-image.git kernel-image-un-def-6.1.189-alt1: build OK (cached)
2026-Oct-03 15:54:10 :: [x86_64] #200 kernel-modules-LiME-un-def.git sisyphus/kernel-modules-LiME-un-def-1.9.1-alt1: build start
2026-Oct-03 15:54:18 :: [aarch64] #100 kernel-image.git kernel-image-un-def-6.1.189-alt1: build OK (cached)
2026-Oct-03 15:54:18 :: [aarch64] #200 kernel-modules-LiME-un-def.git sisyphus/kernel-modules-LiME-un-def-1.9.1-alt1: build start
2026-Oct-03 15:54:20 :: [i586] #200 kernel-modules-LiME-un-def.git sisyphus/kernel-modules-LiME-un-def-1.9.1-alt1: build OK (cached)
2026-Oct-03 15:54:20 :: [i586] #300 kernel-modules-accel-ppp-un-def.git sisyphus/kernel-modules-accel-ppp-un-def-1.12.0-alt3: build start
2026-Oct-03 15:54:22 :: [x86_64] #200 kernel-modules-LiME-un-def.git sisyphus/kernel-modules-LiME-un-def-1.9.1-alt1: build OK (cached)
2026-Oct-03 15:54:22 :: [x86_64] #300 kernel-modules-accel-ppp-un-def.git sisyphus/kernel-modules-accel-ppp-un-def-1.12.0-alt3: build start
2026-Oct-03 15:54:29 :: [armh] #100 kernel-image.git kernel-image-un-def-6.1.189-alt1: build OK (cached)
2026-Oct-03 15:54:29 :: [armh] #200 kernel-modules-LiME-un-def.git sisyphus/kernel-modules-LiME-un-def-1.9.1-alt1: build start
2026-Oct-03 15:54:32 :: [i586] #300 kernel-modules-accel-ppp-un-def.git sisyphus/kernel-modules-accel-ppp-un-def-1.12.0-alt3: build OK (cached)
2026-Oct-03 15:54:32 :: [i586] #400 kernel-modules-anbox-un-def.git sisyphus/kernel-modules-anbox-un-def-14-alt2.gae26ba2: build start
2026-Oct-03 15:54:34 :: [x86_64] #300 kernel-modules-accel-ppp-un-def.git sisyphus/kernel-modules-accel-ppp-un-def-1.12.0-alt3: build OK (cached)
2026-Oct-03 15:54:34 :: [x86_64] #400 kernel-modules-anbox-un-def.git sisyphus/kernel-modules-anbox-un-def-14-alt2.gae26ba2: build start
2026-Oct-03 15:54:38 :: [aarch64] #200 kernel-modules-LiME-un-def.git sisyphus/kernel-modules-LiME-un-def-1.9.1-alt1: build OK (cached)
2026-Oct-03 15:54:38 :: [aarch64] #300 kernel-modules-accel-ppp-un-def.git sisyphus/kernel-modules-accel-ppp-un-def-1.12.0-alt3: build start
2026-Oct-03 15:54:43 :: [i586] #400 kernel-modules-anbox-un-def.git sisyphus/kernel-modules-anbox-un-def-14-alt2.gae26ba2: build OK (cached)
2026-Oct-03 15:54:43 :: [i586] #500 kernel-modules-bcmwl-un-def.git sisyphus/kernel-modules-bcmwl-un-def-6.30.223.271-alt15: build start
2026-Oct-03 15:54:46 :: [x86_64] #400 kernel-modules-anbox-un-def.git sisyphus/kernel-modules-anbox-un-def-14-alt2.gae26ba2: build OK (cached)
2026-Oct-03 15:54:46 :: [x86_64] #500 kernel-modules-bcmwl-un-def.git sisyphus/kernel-modules-bcmwl-un-def-6.30.223.271-alt15: build start
2026-Oct-03 15:54:58 :: [armh] #200 kernel-modules-LiME-un-def.git sisyphus/kernel-modules-LiME-un-def-1.9.1-alt1: build OK (cached)
2026-Oct-03 15:54:58 :: [i586] #500 kernel-modules-bcmwl-un-def.git sisyphus/kernel-modules-bcmwl-un-def-6.30.223.271-alt15: build SKIPPED
2026-Oct-03 15:54:58 :: [armh] #300 kernel-modules-accel-ppp-un-def.git sisyphus/kernel-modules-accel-ppp-un-def-1.12.0-alt3: build start
2026-Oct-03 15:54:58 :: [aarch64] #300 kernel-modules-accel-ppp-un-def.git sisyphus/kernel-modules-accel-ppp-un-def-1.12.0-alt3: build OK (cached)
2026-Oct-03 15:54:58 :: [i586] #600 kernel-modules-dm-secdel-un-def.git sisyphus/kernel-modules-dm-secdel-un-def-1.0.9-alt1: build start
2026-Oct-03 15:54:58 :: [aarch64] #400 kernel-modules-anbox-un-def.git sisyphus/kernel-modules-anbox-un-def-14-alt2.gae26ba2: build start
2026-Oct-03 15:54:58 :: [x86_64] #500 kernel-modules-bcmwl-un-def.git sisyphus/kernel-modules-bcmwl-un-def-6.30.223.271-alt15: build OK (cached)
2026-Oct-03 15:54:58 :: [x86_64] #600 kernel-modules-dm-secdel-un-def.git sisyphus/kernel-modules-dm-secdel-un-def-1.0.9-alt1: build start
2026-Oct-03 15:55:09 :: [i586] #600 kernel-modules-dm-secdel-un-def.git sisyphus/kernel-modules-dm-secdel-un-def-1.0.9-alt1: build OK (cached)
2026-Oct-03 15:55:10 :: [i586] #700 kernel-modules-drbd9-un-def.git sisyphus/kernel-modules-drbd9-un-def-9.2.12-alt1: build start
2026-Oct-03 15:55:11 :: [x86_64] #600 kernel-modules-dm-secdel-un-def.git sisyphus/kernel-modules-dm-secdel-un-def-1.0.9-alt1: build OK (cached)
2026-Oct-03 15:55:11 :: [x86_64] #700 kernel-modules-drbd9-un-def.git sisyphus/kernel-modules-drbd9-un-def-9.2.12-alt1: build start
2026-Oct-03 15:55:18 :: [aarch64] #400 kernel-modules-anbox-un-def.git sisyphus/kernel-modules-anbox-un-def-14-alt2.gae26ba2: build OK (cached)
2026-Oct-03 15:55:18 :: [aarch64] #500 kernel-modules-bcmwl-un-def.git sisyphus/kernel-modules-bcmwl-un-def-6.30.223.271-alt15: build start
2026-Oct-03 15:55:23 :: [x86_64] #700 kernel-modules-drbd9-un-def.git sisyphus/kernel-modules-drbd9-un-def-9.2.12-alt1: build OK (cached)
2026-Oct-03 15:55:23 :: [x86_64] #1000 kernel-modules-evdi-un-def.git sisyphus/kernel-modules-evdi-un-def-1.14.1-alt1: build start
2026-Oct-03 15:55:24 :: [i586] #700 kernel-modules-drbd9-un-def.git sisyphus/kernel-modules-drbd9-un-def-9.2.12-alt1: build SKIPPED
2026-Oct-03 15:55:25 :: [i586] #1000 kernel-modules-evdi-un-def.git sisyphus/kernel-modules-evdi-un-def-1.14.1-alt1: build start
2026-Oct-03 15:55:35 :: [armh] #300 kernel-modules-accel-ppp-un-def.git sisyphus/kernel-modules-accel-ppp-un-def-1.12.0-alt3: build SKIPPED
2026-Oct-03 15:55:35 :: [armh] #400 kernel-modules-anbox-un-def.git sisyphus/kernel-modules-anbox-un-def-14-alt2.gae26ba2: build start
2026-Oct-03 15:55:35 :: [x86_64] #1000 kernel-modules-evdi-un-def.git sisyphus/kernel-modules-evdi-un-def-1.14.1-alt1: build OK (cached)
2026-Oct-03 15:55:35 :: [x86_64] #1100 kernel-modules-i40e-un-def.git sisyphus/kernel-modules-i40e-un-def-2.22.20-alt1: build start
2026-Oct-03 15:55:36 :: [i586] #1000 kernel-modules-evdi-un-def.git sisyphus/kernel-modules-evdi-un-def-1.14.1-alt1: build OK (cached)
2026-Oct-03 15:55:36 :: [i586] #1100 kernel-modules-i40e-un-def.git sisyphus/kernel-modules-i40e-un-def-2.22.20-alt1: build start
2026-Oct-03 15:55:41 :: [aarch64] #500 kernel-modules-bcmwl-un-def.git sisyphus/kernel-modules-bcmwl-un-def-6.30.223.271-alt15: build SKIPPED
2026-Oct-03 15:55:42 :: [aarch64] #600 kernel-modules-dm-secdel-un-def.git sisyphus/kernel-modules-dm-secdel-un-def-1.0.9-alt1: build start
2026-Oct-03 15:55:47 :: [x86_64] #1100 kernel-modules-i40e-un-def.git sisyphus/kernel-modules-i40e-un-def-2.22.20-alt1: build OK (cached)
2026-Oct-03 15:55:48 :: [x86_64] #1200 kernel-modules-iavf-un-def.git sisyphus/kernel-modules-iavf-un-def-4.8.3-alt1: build start
2026-Oct-03 15:55:51 :: [i586] #1100 kernel-modules-i40e-un-def.git sisyphus/kernel-modules-i40e-un-def-2.22.20-alt1: build SKIPPED
2026-Oct-03 15:55:51 :: [i586] #1200 kernel-modules-iavf-un-def.git sisyphus/kernel-modules-iavf-un-def-4.8.3-alt1: build start
2026-Oct-03 15:55:59 :: [x86_64] #1200 kernel-modules-iavf-un-def.git sisyphus/kernel-modules-iavf-un-def-4.8.3-alt1: build OK (cached)
2026-Oct-03 15:56:00 :: [x86_64] #1300 kernel-modules-ipt-ratelimit-un-def.git sisyphus/kernel-modules-ipt-ratelimit-un-def-0.3.3-alt1: build start
2026-Oct-03 15:56:02 :: [aarch64] #600 kernel-modules-dm-secdel-un-def.git sisyphus/kernel-modules-dm-secdel-un-def-1.0.9-alt1: build OK (cached)
2026-Oct-03 15:56:02 :: [aarch64] #700 kernel-modules-drbd9-un-def.git sisyphus/kernel-modules-drbd9-un-def-9.2.12-alt1: build start
2026-Oct-03 15:56:04 :: [armh] #400 kernel-modules-anbox-un-def.git sisyphus/kernel-modules-anbox-un-def-14-alt2.gae26ba2: build OK (cached)
2026-Oct-03 15:56:04 :: [armh] #500 kernel-modules-bcmwl-un-def.git sisyphus/kernel-modules-bcmwl-un-def-6.30.223.271-alt15: build start
2026-Oct-03 15:56:05 :: [i586] #1200 kernel-modules-iavf-un-def.git sisyphus/kernel-modules-iavf-un-def-4.8.3-alt1: build SKIPPED
2026-Oct-03 15:56:06 :: [i586] #1300 kernel-modules-ipt-ratelimit-un-def.git sisyphus/kernel-modules-ipt-ratelimit-un-def-0.3.3-alt1: build start
2026-Oct-03 15:56:12 :: [x86_64] #1300 kernel-modules-ipt-ratelimit-un-def.git sisyphus/kernel-modules-ipt-ratelimit-un-def-0.3.3-alt1: build OK (cached)
2026-Oct-03 15:56:12 :: [x86_64] #1400 kernel-modules-ipt_netflow-un-def.git sisyphus/kernel-modules-ipt_netflow-un-def-2.6-alt1: build start
2026-Oct-03 15:56:17 :: [i586] #1300 kernel-modules-ipt-ratelimit-un-def.git sisyphus/kernel-modules-ipt-ratelimit-un-def-0.3.3-alt1: build OK (cached)
2026-Oct-03 15:56:17 :: [i586] #1400 kernel-modules-ipt_netflow-un-def.git sisyphus/kernel-modules-ipt_netflow-un-def-2.6-alt1: build start
2026-Oct-03 15:56:22 :: [aarch64] #700 kernel-modules-drbd9-un-def.git sisyphus/kernel-modules-drbd9-un-def-9.2.12-alt1: build OK (cached)
2026-Oct-03 15:56:22 :: [aarch64] #1000 kernel-modules-evdi-un-def.git sisyphus/kernel-modules-evdi-un-def-1.14.1-alt1: build start
2026-Oct-03 15:56:24 :: [x86_64] #1400 kernel-modules-ipt_netflow-un-def.git sisyphus/kernel-modules-ipt_netflow-un-def-2.6-alt1: build OK (cached)
2026-Oct-03 15:56:24 :: [x86_64] #1500 kernel-modules-ixgbe-un-def.git sisyphus/kernel-modules-ixgbe-un-def-5.20.10-alt1: build start
2026-Oct-03 15:56:29 :: [i586] #1400 kernel-modules-ipt_netflow-un-def.git sisyphus/kernel-modules-ipt_netflow-un-def-2.6-alt1: build OK (cached)
2026-Oct-03 15:56:29 :: [i586] #1500 kernel-modules-ixgbe-un-def.git sisyphus/kernel-modules-ixgbe-un-def-5.20.10-alt1: build start
2026-Oct-03 15:56:36 :: [x86_64] #1500 kernel-modules-ixgbe-un-def.git sisyphus/kernel-modules-ixgbe-un-def-5.20.10-alt1: build OK (cached)
2026-Oct-03 15:56:36 :: [x86_64] #1600 kernel-modules-lkrg-un-def.git sisyphus/kernel-modules-lkrg-un-def-0.9.8-alt3: build start
2026-Oct-03 15:56:39 :: [armh] #500 kernel-modules-bcmwl-un-def.git sisyphus/kernel-modules-bcmwl-un-def-6.30.223.271-alt15: build SKIPPED
2026-Oct-03 15:56:40 :: [armh] #600 kernel-modules-dm-secdel-un-def.git sisyphus/kernel-modules-dm-secdel-un-def-1.0.9-alt1: build start
2026-Oct-03 15:56:42 :: [aarch64] #1000 kernel-modules-evdi-un-def.git sisyphus/kernel-modules-evdi-un-def-1.14.1-alt1: build OK (cached)
2026-Oct-03 15:56:42 :: [aarch64] #1100 kernel-modules-i40e-un-def.git sisyphus/kernel-modules-i40e-un-def-2.22.20-alt1: build start
2026-Oct-03 15:56:43 :: [i586] #1500 kernel-modules-ixgbe-un-def.git sisyphus/kernel-modules-ixgbe-un-def-5.20.10-alt1: build SKIPPED
2026-Oct-03 15:56:43 :: [i586] #1600 kernel-modules-lkrg-un-def.git sisyphus/kernel-modules-lkrg-un-def-0.9.8-alt3: build start
2026-Oct-03 15:56:48 :: [x86_64] #1600 kernel-modules-lkrg-un-def.git sisyphus/kernel-modules-lkrg-un-def-0.9.8-alt3: build OK (cached)
2026-Oct-03 15:56:48 :: [x86_64] #1700 kernel-modules-nvidia-un-def.git sisyphus/kernel-modules-nvidia-un-def-550.144.03-alt1: build start
2026-Oct-03 15:56:55 :: [i586] #1600 kernel-modules-lkrg-un-def.git sisyphus/kernel-modules-lkrg-un-def-0.9.8-alt3: build OK (cached)
2026-Oct-03 15:56:55 :: [i586] #1700 kernel-modules-nvidia-un-def.git sisyphus/kernel-modules-nvidia-un-def-550.144.03-alt1: build start
2026-Oct-03 15:57:01 :: [x86_64] #1700 kernel-modules-nvidia-un-def.git sisyphus/kernel-modules-nvidia-un-def-550.144.03-alt1: build OK (cached)
2026-Oct-03 15:57:01 :: [aarch64] #1100 kernel-modules-i40e-un-def.git sisyphus/kernel-modules-i40e-un-def-2.22.20-alt1: build OK (cached)
2026-Oct-03 15:57:02 :: [aarch64] #1200 kernel-modules-iavf-un-def.git sisyphus/kernel-modules-iavf-un-def-4.8.3-alt1: build start
2026-Oct-03 15:57:02 :: [x86_64] #2000 kernel-modules-r8125-un-def.git sisyphus/kernel-modules-r8125-un-def-9.011.01-alt1: build start
2026-Oct-03 15:57:07 :: [i586] #1700 kernel-modules-nvidia-un-def.git sisyphus/kernel-modules-nvidia-un-def-550.144.03-alt1: build OK (cached)
2026-Oct-03 15:57:07 :: [i586] #2000 kernel-modules-r8125-un-def.git sisyphus/kernel-modules-r8125-un-def-9.011.01-alt1: build start
2026-Oct-03 15:57:09 :: [armh] #600 kernel-modules-dm-secdel-un-def.git sisyphus/kernel-modules-dm-secdel-un-def-1.0.9-alt1: build OK (cached)
2026-Oct-03 15:57:10 :: [armh] #700 kernel-modules-drbd9-un-def.git sisyphus/kernel-modules-drbd9-un-def-9.2.12-alt1: build start
2026-Oct-03 15:57:14 :: [x86_64] #2000 kernel-modules-r8125-un-def.git sisyphus/kernel-modules-r8125-un-def-9.011.01-alt1: build OK (cached)
2026-Oct-03 15:57:14 :: [x86_64] #2100 kernel-modules-r8168-un-def.git sisyphus/kernel-modules-r8168-un-def-8.053.01-alt1.k: build start
2026-Oct-03 15:57:19 :: [i586] #2000 kernel-modules-r8125-un-def.git sisyphus/kernel-modules-r8125-un-def-9.011.01-alt1: build OK (cached)
2026-Oct-03 15:57:19 :: [i586] #2100 kernel-modules-r8168-un-def.git sisyphus/kernel-modules-r8168-un-def-8.053.01-alt1.k: build start
2026-Oct-03 15:57:21 :: [aarch64] #1200 kernel-modules-iavf-un-def.git sisyphus/kernel-modules-iavf-un-def-4.8.3-alt1: build OK (cached)
2026-Oct-03 15:57:21 :: [aarch64] #1300 kernel-modules-ipt-ratelimit-un-def.git sisyphus/kernel-modules-ipt-ratelimit-un-def-0.3.3-alt1: build start
2026-Oct-03 15:57:26 :: [x86_64] #2100 kernel-modules-r8168-un-def.git sisyphus/kernel-modules-r8168-un-def-8.053.01-alt1.k: build OK (cached)
2026-Oct-03 15:57:26 :: [x86_64] #2500 kernel-modules-rtl8812au-un-def.git sisyphus/kernel-modules-rtl8812au-un-def-5.6.4.2-alt1: build start
2026-Oct-03 15:57:30 :: [i586] #2100 kernel-modules-r8168-un-def.git sisyphus/kernel-modules-r8168-un-def-8.053.01-alt1.k: build OK (cached)
2026-Oct-03 15:57:30 :: [i586] #2500 kernel-modules-rtl8812au-un-def.git sisyphus/kernel-modules-rtl8812au-un-def-5.6.4.2-alt1: build start
2026-Oct-03 15:57:41 :: [aarch64] #1300 kernel-modules-ipt-ratelimit-un-def.git sisyphus/kernel-modules-ipt-ratelimit-un-def-0.3.3-alt1: build OK (cached)
2026-Oct-03 15:57:41 :: [aarch64] #1400 kernel-modules-ipt_netflow-un-def.git sisyphus/kernel-modules-ipt_netflow-un-def-2.6-alt1: build start
2026-Oct-03 15:57:45 :: [armh] #700 kernel-modules-drbd9-un-def.git sisyphus/kernel-modules-drbd9-un-def-9.2.12-alt1: build SKIPPED
2026-Oct-03 15:57:45 :: [armh] #1000 kernel-modules-evdi-un-def.git sisyphus/kernel-modules-evdi-un-def-1.14.1-alt1: build start
[x86_64]    gcc-10 -Wp,-MMD,/usr/src/RPM/BUILD/kernel-source-rtl8812au-5.6.4.2/os_dep/linux/.usb_intf.o.d -nostdinc -I./arch/x86/include -I./arch/x86/include/generated  -I./include -I./arch/x86/include/uapi -I./arch/x86/include/generated/uapi -I./include/uapi -I./include/generated/uapi -include ./include/linux/compiler-version.h -include ./include/linux/kconfig.h -include ./include/linux/compiler_types.h -D__KERNEL__ -fmacro-prefix-map=./= -Wall -Wundef -Werror=strict-prototypes -Wno-trigraphs -fno-strict-aliasing -fno-common -fshort-wchar -fno-PIE -Werror=implicit-function-declaration -Werror=implicit-int -Werror=return-type -Wno-format-security -std=gnu11 -mno-sse -mno-mmx -mno-sse2 -mno-3dnow -mno-avx -fcf-protection=none -m64 -falign-jumps=1 -falign-loops=1 -mno-80387 -mno-fp-ret-in-387 -mpreferred-stack-boundary=3 -mskip-rax-setup -mtune=generic -mno-red-zone -mcmodel=kernel -Wno-sign-compare -fno-asynchronous-unwind-tables -mindirect-branch=thunk-extern -mindirect-branch-register -mfunction-return=thunk-extern -fno-jump-tables -fno-delete-null-pointer-checks -Wno-frame-address -Wno-format-truncation -Wno-format-overflow -Wno-address-of-packed-member -O2 -fno-allow-store-data-races -Wframe-larger-than=2048 -fstack-protector-strong -Wno-main -Wno-unused-but-set-variable -Wno-unused-const-variable -fno-stack-clash-protection -pg -mrecord-mcount -mfentry -DCC_USING_FENTRY -Wvla -Wno-pointer-sign -Wcast-function-type -Wno-stringop-truncation -Wno-stringop-overflow -Wno-restrict -Wno-maybe-uninitialized -Wno-alloc-size-larger-than -Wimplicit-fallthrough=5 -fno-strict-overflow -fno-stack-check -fconserve-stack -Werror=date-time -Werror=incompatible-pointer-types -Werror=designated-init -fno-builtin-wcslen -Wno-packed-not-aligned -g -Wno-error=date-time -Wno-error=incompatible-pointer-types -fno-pie -O3 -Wno-unused-variable -Wno-unused-label -Wno-unused-function -Wno-implicit-fallthrough -Wno-cast-function-type -Wno-unknown-pragmas -Wno-address -Wno-vla -g -I/usr/src/RPM/BUILD/kernel-source-rtl8812au-5.6.4.2/include -I.//usr/src/RPM/BUILD/kernel-source-rtl8812au-5.6.4.2/include -I/usr/src/RPM/BUILD/kernel-source-rtl8812au-5.6.4.2/hal/phydm -I.//usr/src/RPM/BUILD/kernel-source-rtl8812au-5.6.4.2/hal/phydm -DDRV_NAME=\"rtl88XXau\" -I/usr/src/RPM/BUILD/kernel-source-rtl8812au-5.6.4.2/platform -I.//usr/src/RPM/BUILD/kernel-source-rtl8812au-5.6.4.2/platform -I/usr/src/RPM/BUILD/kernel-source-rtl8812au-5.6.4.2/hal/btc -I.//usr/src/RPM/BUILD/kernel-source-rtl8812au-5.6.4.2/hal/btc -DCONFIG_RTL8812A -DCONFIG_RTL8821A -DCONFIG_RTL8814A -DCONFIG_MP_INCLUDED -DCONFIG_EFUSE_CONFIG_FILE -DEFUSE_MAP_PATH=\"/system/etc/wifi/wifi_efuse_8814au.map\" -DWIFIMAC_PATH=\"/data/wifimac.txt\" -DCONFIG_LOAD_PHY_PARA_FROM_FILE -DREALTEK_CONFIG_PATH=\"/lib/firmware/\" -DCONFIG_TXPWR_BY_RATE=1 -DCONFIG_TXPWR_BY_RATE_EN=0 -DCONFIG_TXPWR_LIMIT=1 -DCONFIG_TXPWR_LIMIT_EN=0 -DCONFIG_RTW_ADAPTIVITY_EN=0 -DCONFIG_RTW_ADAPTIVITY_MODE=0 -DCONFIG_IEEE80211W -DHIGH_ACTIVE_HST2DEV=0 -DCONFIG_BR_EXT '-DCONFIG_BR_EXT_BRNAME="'br0'"' -DCONFIG_WIFI_MONITOR -DCONFIG_RTW_NAPI -DCONFIG_RTW_GRO -DCONFIG_RTW_NETIF_SG -DDM_ODM_SUPPORT_TYPE=0x04 -DCONFIG_LITTLE_ENDIAN -DCONFIG_IOCTL_CFG80211 -DRTW_USE_CFG80211_STA_EVENT -mhard-float -DMARK_KERNEL_PFU -I/usr/src/RPM/BUILD/kernel-source-rtl8812au-5.6.4.2/hal/phydm  -DMODULE  -DKBUILD_BASENAME='"usb_intf"' -DKBUILD_MODNAME='"88XXau"' -D__KBUILD_MODNAME=kmod_88XXau -c -o /usr/src/RPM/BUILD/kernel-source-rtl8812au-5.6.4.2/os_dep/linux/usb_intf.o /usr/src/RPM/BUILD/kernel-source-rtl8812au-5.6.4.2/os_dep/linux/usb_intf.c   ; ./tools/objtool/objtool --hacks=jump_label --hacks=noinstr --orc --retpoline --rethunk --static-call --uaccess   --module /usr/src/RPM/BUILD/kernel-source-rtl8812au-5.6.4.2/os_dep/linux/usb_intf.o
[x86_64] /usr/src/RPM/BUILD/kernel-source-rtl8812au-5.6.4.2/os_dep/linux/usb_intf.c:273:10: error: 'struct usb_driver' has no member named 'drvwrap'
[x86_64]   273 |  .usbdrv.drvwrap.driver.shutdown = rtw_dev_shutdown,
2026-Oct-03 15:57:55 :: [x86_64] kernel-modules-rtl8812au-un-def.git sisyphus/kernel-modules-rtl8812au-un-def-5.6.4.2-alt1: remote: build failed
2026-Oct-03 15:57:55 :: [x86_64] #2500 kernel-modules-rtl8812au-un-def.git sisyphus/kernel-modules-rtl8812au-un-def-5.6.4.2-alt1: build FAILED
[i586]    gcc-10 -Wp,-MMD,/usr/src/RPM/BUILD/kernel-source-rtl8812au-5.6.4.2/os_dep/linux/.usb_intf.o.d -nostdinc -I./arch/x86/include -I./arch/x86/include/generated  -I./include -I./arch/x86/include/uapi -I./arch/x86/include/generated/uapi -I./include/uapi -I./include/generated/uapi -include ./include/linux/compiler-version.h -include ./include/linux/kconfig.h -include ./include/linux/compiler_types.h -D__KERNEL__ -fmacro-prefix-map=./= -Wall -Wundef -Werror=strict-prototypes -Wno-trigraphs -fno-strict-aliasing -fno-common -fshort-wchar -fno-PIE -Werror=implicit-function-declaration -Werror=implicit-int -Werror=return-type -Wno-format-security -std=gnu11 -mno-sse -mno-mmx -mno-sse2 -mno-3dnow -mno-avx -fcf-protection=none -m32 -msoft-float -mregparm=3 -freg-struct-return -fno-pic -mpreferred-stack-boundary=2 -march=i686 -Wa,-mtune=generic32 -ffreestanding -mstack-protector-guard-reg=fs -mstack-protector-guard-symbol=__stack_chk_guard -Wno-sign-compare -fno-asynchronous-unwind-tables -mindirect-branch=thunk-extern -mindirect-branch-register -fno-jump-tables -fno-delete-null-pointer-checks -Wno-frame-address -Wno-format-truncation -Wno-format-overflow -Wno-address-of-packed-member -O2 -fno-allow-store-data-races -Wframe-larger-than=2048 -fstack-protector-strong -Wno-main -Wno-unused-but-set-variable -Wno-unused-const-variable -fno-omit-frame-pointer -fno-optimize-sibling-calls -fno-stack-clash-protection -pg -mrecord-mcount -mfentry -DCC_USING_FENTRY -Wvla -Wno-pointer-sign -Wcast-function-type -Wno-stringop-truncation -Wno-stringop-overflow -Wno-restrict -Wno-maybe-uninitialized -Wno-alloc-size-larger-than -Wimplicit-fallthrough=5 -fno-strict-overflow -fno-stack-check -fconserve-stack -Werror=date-time -Werror=incompatible-pointer-types -Werror=designated-init -fno-builtin-wcslen -Wno-packed-not-aligned -g -Wno-error=date-time -Wno-error=incompatible-pointer-types -fno-pie -O3 -Wno-unused-variable -Wno-unused-label -Wno-unused-function -Wno-implicit-fallthrough -Wno-cast-function-type -Wno-unknown-pragmas -Wno-address -Wno-vla -g -I/usr/src/RPM/BUILD/kernel-source-rtl8812au-5.6.4.2/include -I.//usr/src/RPM/BUILD/kernel-source-rtl8812au-5.6.4.2/include -I/usr/src/RPM/BUILD/kernel-source-rtl8812au-5.6.4.2/hal/phydm -I.//usr/src/RPM/BUILD/kernel-source-rtl8812au-5.6.4.2/hal/phydm -DDRV_NAME=\"rtl88XXau\" -I/usr/src/RPM/BUILD/kernel-source-rtl8812au-5.6.4.2/platform -I.//usr/src/RPM/BUILD/kernel-source-rtl8812au-5.6.4.2/platform -I/usr/src/RPM/BUILD/kernel-source-rtl8812au-5.6.4.2/hal/btc -I.//usr/src/RPM/BUILD/kernel-source-rtl8812au-5.6.4.2/hal/btc -DCONFIG_RTL8812A -DCONFIG_RTL8821A -DCONFIG_RTL8814A -DCONFIG_MP_INCLUDED -DCONFIG_EFUSE_CONFIG_FILE -DEFUSE_MAP_PATH=\"/system/etc/wifi/wifi_efuse_8814au.map\" -DWIFIMAC_PATH=\"/data/wifimac.txt\" -DCONFIG_LOAD_PHY_PARA_FROM_FILE -DREALTEK_CONFIG_PATH=\"/lib/firmware/\" -DCONFIG_TXPWR_BY_RATE=1 -DCONFIG_TXPWR_BY_RATE_EN=0 -DCONFIG_TXPWR_LIMIT=1 -DCONFIG_TXPWR_LIMIT_EN=0 -DCONFIG_RTW_ADAPTIVITY_EN=0 -DCONFIG_RTW_ADAPTIVITY_MODE=0 -DCONFIG_IEEE80211W -DHIGH_ACTIVE_HST2DEV=0 -DCONFIG_BR_EXT '-DCONFIG_BR_EXT_BRNAME="'br0'"' -DCONFIG_WIFI_MONITOR -DCONFIG_RTW_NAPI -DCONFIG_RTW_GRO -DCONFIG_RTW_NETIF_SG -DDM_ODM_SUPPORT_TYPE=0x04 -DCONFIG_LITTLE_ENDIAN -DCONFIG_IOCTL_CFG80211 -DRTW_USE_CFG80211_STA_EVENT -mhard-float -DMARK_KERNEL_PFU -I/usr/src/RPM/BUILD/kernel-source-rtl8812au-5.6.4.2/hal/phydm  -DMODULE  -DKBUILD_BASENAME='"usb_intf"' -DKBUILD_MODNAME='"88XXau"' -D__KBUILD_MODNAME=kmod_88XXau -c -o /usr/src/RPM/BUILD/kernel-source-rtl8812au-5.6.4.2/os_dep/linux/usb_intf.o /usr/src/RPM/BUILD/kernel-source-rtl8812au-5.6.4.2/os_dep/linux/usb_intf.c  
[i586] /usr/src/RPM/BUILD/kernel-source-rtl8812au-5.6.4.2/os_dep/linux/usb_intf.c:273:10: error: 'struct usb_driver' has no member named 'drvwrap'
[i586]   273 |  .usbdrv.drvwrap.driver.shutdown = rtw_dev_shutdown,
2026-Oct-03 15:58:01 :: [i586] kernel-modules-rtl8812au-un-def.git sisyphus/kernel-modules-rtl8812au-un-def-5.6.4.2-alt1: remote: build failed
2026-Oct-03 15:58:01 :: [i586] #2500 kernel-modules-rtl8812au-un-def.git sisyphus/kernel-modules-rtl8812au-un-def-5.6.4.2-alt1: build FAILED
2026-Oct-03 15:58:01 :: [aarch64] #1400 kernel-modules-ipt_netflow-un-def.git sisyphus/kernel-modules-ipt_netflow-un-def-2.6-alt1: build OK (cached)
2026-Oct-03 15:58:01 :: [aarch64] #1500 kernel-modules-ixgbe-un-def.git sisyphus/kernel-modules-ixgbe-un-def-5.20.10-alt1: build start
2026-Oct-03 15:58:14 :: [armh] #1000 kernel-modules-evdi-un-def.git sisyphus/kernel-modules-evdi-un-def-1.14.1-alt1: build OK (cached)
2026-Oct-03 15:58:14 :: [armh] #1100 kernel-modules-i40e-un-def.git sisyphus/kernel-modules-i40e-un-def-2.22.20-alt1: build start
2026-Oct-03 15:58:21 :: [aarch64] #1500 kernel-modules-ixgbe-un-def.git sisyphus/kernel-modules-ixgbe-un-def-5.20.10-alt1: build OK (cached)
2026-Oct-03 15:58:21 :: [aarch64] #1600 kernel-modules-lkrg-un-def.git sisyphus/kernel-modules-lkrg-un-def-0.9.8-alt3: build start
2026-Oct-03 15:58:45 :: [aarch64] #1600 kernel-modules-lkrg-un-def.git sisyphus/kernel-modules-lkrg-un-def-0.9.8-alt3: build SKIPPED
2026-Oct-03 15:58:45 :: [aarch64] #1700 kernel-modules-nvidia-un-def.git sisyphus/kernel-modules-nvidia-un-def-550.144.03-alt1: build start
2026-Oct-03 15:58:50 :: [armh] #1100 kernel-modules-i40e-un-def.git sisyphus/kernel-modules-i40e-un-def-2.22.20-alt1: build SKIPPED
2026-Oct-03 15:58:50 :: [armh] #1200 kernel-modules-iavf-un-def.git sisyphus/kernel-modules-iavf-un-def-4.8.3-alt1: build start
2026-Oct-03 15:59:06 :: [aarch64] #1700 kernel-modules-nvidia-un-def.git sisyphus/kernel-modules-nvidia-un-def-550.144.03-alt1: build OK (cached)
2026-Oct-03 15:59:06 :: [aarch64] #2000 kernel-modules-r8125-un-def.git sisyphus/kernel-modules-r8125-un-def-9.011.01-alt1: build start
2026-Oct-03 15:59:25 :: [armh] #1200 kernel-modules-iavf-un-def.git sisyphus/kernel-modules-iavf-un-def-4.8.3-alt1: build SKIPPED
2026-Oct-03 15:59:26 :: [armh] #1300 kernel-modules-ipt-ratelimit-un-def.git sisyphus/kernel-modules-ipt-ratelimit-un-def-0.3.3-alt1: build start
2026-Oct-03 15:59:30 :: [aarch64] #2000 kernel-modules-r8125-un-def.git sisyphus/kernel-modules-r8125-un-def-9.011.01-alt1: build SKIPPED
2026-Oct-03 15:59:30 :: [aarch64] #2100 kernel-modules-r8168-un-def.git sisyphus/kernel-modules-r8168-un-def-8.053.01-alt1.k: build start
2026-Oct-03 15:59:50 :: [aarch64] #2100 kernel-modules-r8168-un-def.git sisyphus/kernel-modules-r8168-un-def-8.053.01-alt1.k: build OK (cached)
2026-Oct-03 15:59:50 :: [aarch64] #2500 kernel-modules-rtl8812au-un-def.git sisyphus/kernel-modules-rtl8812au-un-def-5.6.4.2-alt1: build start
2026-Oct-03 15:59:55 :: [armh] #1300 kernel-modules-ipt-ratelimit-un-def.git sisyphus/kernel-modules-ipt-ratelimit-un-def-0.3.3-alt1: build OK (cached)
2026-Oct-03 15:59:55 :: [armh] #1400 kernel-modules-ipt_netflow-un-def.git sisyphus/kernel-modules-ipt_netflow-un-def-2.6-alt1: build start
2026-Oct-03 16:00:14 :: [aarch64] #2500 kernel-modules-rtl8812au-un-def.git sisyphus/kernel-modules-rtl8812au-un-def-5.6.4.2-alt1: build SKIPPED
2026-Oct-03 16:00:14 :: [aarch64] #2600 kernel-modules-rtl8821cu-un-def.git sisyphus/kernel-modules-rtl8821cu-un-def-5.12.0.4-alt1: build start
2026-Oct-03 16:00:30 :: [armh] #1400 kernel-modules-ipt_netflow-un-def.git sisyphus/kernel-modules-ipt_netflow-un-def-2.6-alt1: build SKIPPED
2026-Oct-03 16:00:31 :: [armh] #1500 kernel-modules-ixgbe-un-def.git sisyphus/kernel-modules-ixgbe-un-def-5.20.10-alt1: build start
2026-Oct-03 16:00:38 :: [aarch64] #2600 kernel-modules-rtl8821cu-un-def.git sisyphus/kernel-modules-rtl8821cu-un-def-5.12.0.4-alt1: build SKIPPED
2026-Oct-03 16:00:38 :: [aarch64] #3000 kernel-modules-rtw89-un-def.git sisyphus/kernel-modules-rtw89-un-def-0.0-alt4.git.4f3464d: build start
2026-Oct-03 16:01:07 :: [armh] #1500 kernel-modules-ixgbe-un-def.git sisyphus/kernel-modules-ixgbe-un-def-5.20.10-alt1: build SKIPPED
2026-Oct-03 16:01:07 :: [armh] #1600 kernel-modules-lkrg-un-def.git sisyphus/kernel-modules-lkrg-un-def-0.9.8-alt3: build start
2026-Oct-03 16:01:30 :: [aarch64] #3000 kernel-modules-rtw89-un-def.git sisyphus/kernel-modules-rtw89-un-def-0.0-alt4.git.4f3464d: build OK
2026-Oct-03 16:01:31 :: [aarch64] #3100 kernel-modules-sysdig-un-def.git sisyphus/kernel-modules-sysdig-un-def-7.3.0-alt1: build start
2026-Oct-03 16:01:42 :: [armh] #1600 kernel-modules-lkrg-un-def.git sisyphus/kernel-modules-lkrg-un-def-0.9.8-alt3: build SKIPPED
2026-Oct-03 16:01:42 :: [armh] #1700 kernel-modules-nvidia-un-def.git sisyphus/kernel-modules-nvidia-un-def-550.144.03-alt1: build start
2026-Oct-03 16:02:18 :: [aarch64] #3100 kernel-modules-sysdig-un-def.git sisyphus/kernel-modules-sysdig-un-def-7.3.0-alt1: build OK
2026-Oct-03 16:02:19 :: [aarch64] #3200 kernel-modules-v4l2loopback-un-def.git sisyphus/kernel-modules-v4l2loopback-un-def-0.12.7-alt1.g5e9dd41: build start
2026-Oct-03 16:02:26 :: [armh] #1700 kernel-modules-nvidia-un-def.git sisyphus/kernel-modules-nvidia-un-def-550.144.03-alt1: build SKIPPED
2026-Oct-03 16:02:27 :: [armh] #2000 kernel-modules-r8125-un-def.git sisyphus/kernel-modules-r8125-un-def-9.011.01-alt1: build start
2026-Oct-03 16:03:00 :: [aarch64] #3200 kernel-modules-v4l2loopback-un-def.git sisyphus/kernel-modules-v4l2loopback-un-def-0.12.7-alt1.g5e9dd41: build OK
2026-Oct-03 16:03:00 :: [aarch64] #3300 kernel-modules-vhba-un-def.git sisyphus/kernel-modules-vhba-un-def-20211218-alt1.k: build start
2026-Oct-03 16:03:03 :: [armh] #2000 kernel-modules-r8125-un-def.git sisyphus/kernel-modules-r8125-un-def-9.011.01-alt1: build SKIPPED
2026-Oct-03 16:03:03 :: [armh] #2100 kernel-modules-r8168-un-def.git sisyphus/kernel-modules-r8168-un-def-8.053.01-alt1.k: build start
2026-Oct-03 16:03:32 :: [armh] #2100 kernel-modules-r8168-un-def.git sisyphus/kernel-modules-r8168-un-def-8.053.01-alt1.k: build OK (cached)
2026-Oct-03 16:03:32 :: [armh] #2500 kernel-modules-rtl8812au-un-def.git sisyphus/kernel-modules-rtl8812au-un-def-5.6.4.2-alt1: build start
2026-Oct-03 16:03:42 :: [aarch64] #3300 kernel-modules-vhba-un-def.git sisyphus/kernel-modules-vhba-un-def-20211218-alt1.k: build OK
2026-Oct-03 16:03:42 :: [aarch64] #3400 kernel-modules-virtualbox-addition-un-def.git sisyphus/kernel-modules-virtualbox-addition-p10-un-def-7.1.16-alt1: build start
2026-Oct-03 16:04:05 :: [aarch64] #3400 kernel-modules-virtualbox-addition-un-def.git sisyphus/kernel-modules-virtualbox-addition-p10-un-def-7.1.16-alt1: build SKIPPED
2026-Oct-03 16:04:05 :: [aarch64] #3500 kernel-modules-virtualbox-un-def.git sisyphus/kernel-modules-virtualbox-p10-un-def-7.1.16-alt1: build start
2026-Oct-03 16:04:08 :: [armh] #2500 kernel-modules-rtl8812au-un-def.git sisyphus/kernel-modules-rtl8812au-un-def-5.6.4.2-alt1: build SKIPPED
2026-Oct-03 16:04:08 :: [armh] #2600 kernel-modules-rtl8821cu-un-def.git sisyphus/kernel-modules-rtl8821cu-un-def-5.12.0.4-alt1: build start
2026-Oct-03 16:04:29 :: [aarch64] #3500 kernel-modules-virtualbox-un-def.git sisyphus/kernel-modules-virtualbox-p10-un-def-7.1.16-alt1: build SKIPPED
2026-Oct-03 16:04:29 :: [aarch64] #3600 kernel-modules-xtables-addons-un-def.git sisyphus/kernel-modules-xtables-addons-un-def-3.23-alt1: build start
2026-Oct-03 16:04:44 :: [armh] #2600 kernel-modules-rtl8821cu-un-def.git sisyphus/kernel-modules-rtl8821cu-un-def-5.12.0.4-alt1: build SKIPPED
2026-Oct-03 16:04:44 :: [armh] #3000 kernel-modules-rtw89-un-def.git sisyphus/kernel-modules-rtw89-un-def-0.0-alt4.git.4f3464d: build start
2026-Oct-03 16:05:45 :: [aarch64] #3600 kernel-modules-xtables-addons-un-def.git sisyphus/kernel-modules-xtables-addons-un-def-3.23-alt1: build OK
2026-Oct-03 16:05:45 :: [aarch64] #3700 kernel-modules-zfs-un-def.git p10/kernel-modules-zfs-un-def-2.1.16-alt1: build start
2026-Oct-03 16:05:59 :: [armh] #3000 kernel-modules-rtw89-un-def.git sisyphus/kernel-modules-rtw89-un-def-0.0-alt4.git.4f3464d: build OK
2026-Oct-03 16:05:59 :: [armh] #3100 kernel-modules-sysdig-un-def.git sisyphus/kernel-modules-sysdig-un-def-7.3.0-alt1: build start
2026-Oct-03 16:06:33 :: [armh] #3100 kernel-modules-sysdig-un-def.git sisyphus/kernel-modules-sysdig-un-def-7.3.0-alt1: build SKIPPED
2026-Oct-03 16:06:33 :: [armh] #3200 kernel-modules-v4l2loopback-un-def.git sisyphus/kernel-modules-v4l2loopback-un-def-0.12.7-alt1.g5e9dd41: build start
2026-Oct-03 16:07:32 :: [armh] #3200 kernel-modules-v4l2loopback-un-def.git sisyphus/kernel-modules-v4l2loopback-un-def-0.12.7-alt1.g5e9dd41: build OK
2026-Oct-03 16:07:32 :: [armh] #3300 kernel-modules-vhba-un-def.git sisyphus/kernel-modules-vhba-un-def-20211218-alt1.k: build start
2026-Oct-03 16:08:29 :: [armh] #3300 kernel-modules-vhba-un-def.git sisyphus/kernel-modules-vhba-un-def-20211218-alt1.k: build OK
2026-Oct-03 16:08:30 :: [armh] #3400 kernel-modules-virtualbox-addition-un-def.git sisyphus/kernel-modules-virtualbox-addition-p10-un-def-7.1.16-alt1: build start
2026-Oct-03 16:09:04 :: [armh] #3400 kernel-modules-virtualbox-addition-un-def.git sisyphus/kernel-modules-virtualbox-addition-p10-un-def-7.1.16-alt1: build SKIPPED
2026-Oct-03 16:09:04 :: [armh] #3500 kernel-modules-virtualbox-un-def.git sisyphus/kernel-modules-virtualbox-p10-un-def-7.1.16-alt1: build start
2026-Oct-03 16:09:39 :: [armh] #3500 kernel-modules-virtualbox-un-def.git sisyphus/kernel-modules-virtualbox-p10-un-def-7.1.16-alt1: build SKIPPED
2026-Oct-03 16:09:40 :: [armh] #3600 kernel-modules-xtables-addons-un-def.git sisyphus/kernel-modules-xtables-addons-un-def-3.23-alt1: build start
2026-Oct-03 16:11:22 :: [armh] #3600 kernel-modules-xtables-addons-un-def.git sisyphus/kernel-modules-xtables-addons-un-def-3.23-alt1: build OK
2026-Oct-03 16:11:23 :: [armh] #3700 kernel-modules-zfs-un-def.git p10/kernel-modules-zfs-un-def-2.1.16-alt1: build start
2026-Oct-03 16:11:52 :: [aarch64] #3700 kernel-modules-zfs-un-def.git p10/kernel-modules-zfs-un-def-2.1.16-alt1: build OK
2026-Oct-03 16:19:09 :: [armh] #3700 kernel-modules-zfs-un-def.git p10/kernel-modules-zfs-un-def-2.1.16-alt1: build OK
2026-Oct-03 15:57:55 :: [x86_64] build FAILED
2026-Oct-03 15:58:01 :: [i586] build FAILED
2026-Oct-03 16:19:09 :: task #435322 for p10 FAILED


^ permalink raw reply	[flat|nested] 6+ messages in thread

* [#435322] p10 FAILED (try 5) kernel-image.git=kernel-image-un-def-6.1.189-alt1 ...
  2026-10-03 13:40 [#435322] p10 FAILED kernel-image.git=kernel-image-un-def-6.1.189-alt1 Girar awaiter (kernelbot)
                   ` (2 preceding siblings ...)
  2026-10-03 16:19 ` [#435322] p10 FAILED (try 4) kernel-image.git=kernel-image-un-def-6.1.189-alt1 Girar awaiter (kernelbot)
@ 2026-10-04  5:40 ` Girar awaiter (kernelbot)
  2026-10-04  8:23 ` [#435322] p10 FAILED (try 6) kernel-image.git=kernel-image-un-def-6.1.189-alt1 Girar awaiter (kernelbot)
  4 siblings, 0 replies; 6+ messages in thread
From: Girar awaiter (kernelbot) @ 2026-10-04  5:40 UTC (permalink / raw)
  To: Kernel Bot; +Cc: girar-builder-p10, sisyphus-incominger, girar-builder-p10

https://git.altlinux.org/tasks/435322/logs/events.5.1.log
https://packages.altlinux.org/tasks/435322

subtask  name                                  aarch64  armh    i586  x86_64
  #2600  kernel-modules-rtl8821cu-un-def             -     -  failed  failed
  #3000  kernel-modules-rtw89-un-def                52  1:15       ?       ?
  #3100  kernel-modules-sysdig-un-def               48     -       ?       ?
  #3200  kernel-modules-v4l2loopback-un-def         41    58       ?       ?
  #3300  kernel-modules-vhba-un-def                 41    57       ?       ?
  #3600  kernel-modules-xtables-addons-un-def     1:16  1:43       ?       ?
  #3700  kernel-modules-zfs-un-def                6:06  7:49       ?       ?

2026-Oct-04 05:15:36 :: task #435322 for p10 resumed by kernelbot:
2026-Oct-04 05:15:36 :: message: v6.1.189
#100 build kernel-image-un-def-6.1.189-alt1 from /people/kernelbot/packages/kernel-image.git fetched at 2026-Oct-03 12:07:12
#200 build sisyphus/kernel-modules-LiME-un-def-1.9.1-alt1 from /gears/k/kernel-modules-LiME-un-def.git fetched at 2026-Oct-03 12:07:17 from p10
#300 build sisyphus/kernel-modules-accel-ppp-un-def-1.12.0-alt3 from /gears/k/kernel-modules-accel-ppp-un-def.git fetched at 2026-Oct-03 12:07:22 from p10
#400 build sisyphus/kernel-modules-anbox-un-def-14-alt2.gae26ba2 from /gears/k/kernel-modules-anbox-un-def.git fetched at 2026-Oct-03 12:07:23 from p10
#500 build sisyphus/kernel-modules-bcmwl-un-def-6.30.223.271-alt15 from /gears/k/kernel-modules-bcmwl-un-def.git fetched at 2026-Oct-03 12:07:32 from p10
#600 build sisyphus/kernel-modules-dm-secdel-un-def-1.0.9-alt1 from /gears/k/kernel-modules-dm-secdel-un-def.git fetched at 2026-Oct-03 12:07:33 from p10
#700 build sisyphus/kernel-modules-drbd9-un-def-9.2.12-alt1 from /gears/k/kernel-modules-drbd9-un-def.git fetched at 2026-Oct-03 12:07:37 from p10
#1000 build sisyphus/kernel-modules-evdi-un-def-1.14.1-alt1 from /gears/k/kernel-modules-evdi-un-def.git fetched at 2026-Oct-03 12:07:39 from p10
#1100 build sisyphus/kernel-modules-i40e-un-def-2.22.20-alt1 from /gears/k/kernel-modules-i40e-un-def.git fetched at 2026-Oct-03 12:07:40 from p10
#1200 build sisyphus/kernel-modules-iavf-un-def-4.8.3-alt1 from /gears/k/kernel-modules-iavf-un-def.git fetched at 2026-Oct-03 12:07:41 from p10
#1300 build sisyphus/kernel-modules-ipt-ratelimit-un-def-0.3.3-alt1 from /gears/k/kernel-modules-ipt-ratelimit-un-def.git fetched at 2026-Oct-03 12:07:48 from p10
#1400 build sisyphus/kernel-modules-ipt_netflow-un-def-2.6-alt1 from /gears/k/kernel-modules-ipt_netflow-un-def.git fetched at 2026-Oct-03 12:07:54 from p10
#1500 build sisyphus/kernel-modules-ixgbe-un-def-5.20.10-alt1 from /gears/k/kernel-modules-ixgbe-un-def.git fetched at 2026-Oct-03 12:07:57 from p10
#1600 build sisyphus/kernel-modules-lkrg-un-def-0.9.8-alt3 from /gears/k/kernel-modules-lkrg-un-def.git fetched at 2026-Oct-03 12:08:01 from p10
#1700 build sisyphus/kernel-modules-nvidia-un-def-550.144.03-alt1 from /gears/k/kernel-modules-nvidia-un-def.git fetched at 2026-Oct-03 12:08:15 from p10
#2000 build sisyphus/kernel-modules-r8125-un-def-9.011.01-alt1 from /gears/k/kernel-modules-r8125-un-def.git fetched at 2026-Oct-03 12:08:18 from p10
#2100 build sisyphus/kernel-modules-r8168-un-def-8.053.01-alt1.k from /gears/k/kernel-modules-r8168-un-def.git fetched at 2026-Oct-03 12:08:26 from p10
#2200 removed
#2300 removed
#2400 removed
#2500 removed
#2600 build sisyphus/kernel-modules-rtl8821cu-un-def-5.12.0.4-alt1 from /gears/k/kernel-modules-rtl8821cu-un-def.git fetched at 2026-Oct-03 12:08:36 from p10
#2700 removed
#3000 build sisyphus/kernel-modules-rtw89-un-def-0.0-alt4.git.4f3464d from /gears/k/kernel-modules-rtw89-un-def.git fetched at 2026-Oct-03 12:08:40 from p10
#3100 build sisyphus/kernel-modules-sysdig-un-def-7.3.0-alt1 from /gears/k/kernel-modules-sysdig-un-def.git fetched at 2026-Oct-03 12:08:41 from p10
#3200 build sisyphus/kernel-modules-v4l2loopback-un-def-0.12.7-alt1.g5e9dd41 from /gears/k/kernel-modules-v4l2loopback-un-def.git fetched at 2026-Oct-03 12:08:44 from p10
#3300 build sisyphus/kernel-modules-vhba-un-def-20211218-alt1.k from /gears/k/kernel-modules-vhba-un-def.git fetched at 2026-Oct-03 12:08:51 from p10
#3400 build sisyphus/kernel-modules-virtualbox-addition-p10-un-def-7.1.16-alt1 from /gears/k/kernel-modules-virtualbox-addition-un-def.git fetched at 2026-Oct-03 12:09:02 from p10
#3500 build sisyphus/kernel-modules-virtualbox-p10-un-def-7.1.16-alt1 from /gears/k/kernel-modules-virtualbox-un-def.git fetched at 2026-Oct-03 12:09:13 from p10
#3600 build sisyphus/kernel-modules-xtables-addons-un-def-3.23-alt1 from /gears/k/kernel-modules-xtables-addons-un-def.git fetched at 2026-Oct-03 12:09:21 from p10
#3700 build p10/kernel-modules-zfs-un-def-2.1.16-alt1 from /gears/k/kernel-modules-zfs-un-def.git fetched at 2026-Oct-03 12:09:27 from p10
2026-Oct-04 05:15:36 :: created build repo
2026-Oct-04 05:15:38 :: #3000: force rebuild
2026-Oct-04 05:15:38 :: #3100: force rebuild
2026-Oct-04 05:15:38 :: #3200: force rebuild
2026-Oct-04 05:15:38 :: #3300: force rebuild
2026-Oct-04 05:15:38 :: #3600: force rebuild
2026-Oct-04 05:15:38 :: #3700: force rebuild
2026-Oct-04 05:15:38 :: [armh] #100 kernel-image.git kernel-image-un-def-6.1.189-alt1: build start
2026-Oct-04 05:15:38 :: [i586] #100 kernel-image.git kernel-image-un-def-6.1.189-alt1: build start
2026-Oct-04 05:15:38 :: [x86_64] #100 kernel-image.git kernel-image-un-def-6.1.189-alt1: build start
2026-Oct-04 05:15:38 :: [aarch64] #100 kernel-image.git kernel-image-un-def-6.1.189-alt1: build start
2026-Oct-04 05:15:57 :: [i586] #100 kernel-image.git kernel-image-un-def-6.1.189-alt1: build OK (cached)
2026-Oct-04 05:15:57 :: [i586] #200 kernel-modules-LiME-un-def.git sisyphus/kernel-modules-LiME-un-def-1.9.1-alt1: build start
2026-Oct-04 05:15:58 :: [x86_64] #100 kernel-image.git kernel-image-un-def-6.1.189-alt1: build OK (cached)
2026-Oct-04 05:15:59 :: [x86_64] #200 kernel-modules-LiME-un-def.git sisyphus/kernel-modules-LiME-un-def-1.9.1-alt1: build start
2026-Oct-04 05:16:07 :: [aarch64] #100 kernel-image.git kernel-image-un-def-6.1.189-alt1: build OK (cached)
2026-Oct-04 05:16:07 :: [aarch64] #200 kernel-modules-LiME-un-def.git sisyphus/kernel-modules-LiME-un-def-1.9.1-alt1: build start
2026-Oct-04 05:16:08 :: [i586] #200 kernel-modules-LiME-un-def.git sisyphus/kernel-modules-LiME-un-def-1.9.1-alt1: build OK (cached)
2026-Oct-04 05:16:09 :: [i586] #300 kernel-modules-accel-ppp-un-def.git sisyphus/kernel-modules-accel-ppp-un-def-1.12.0-alt3: build start
2026-Oct-04 05:16:11 :: [x86_64] #200 kernel-modules-LiME-un-def.git sisyphus/kernel-modules-LiME-un-def-1.9.1-alt1: build OK (cached)
2026-Oct-04 05:16:11 :: [x86_64] #300 kernel-modules-accel-ppp-un-def.git sisyphus/kernel-modules-accel-ppp-un-def-1.12.0-alt3: build start
2026-Oct-04 05:16:18 :: [armh] #100 kernel-image.git kernel-image-un-def-6.1.189-alt1: build OK (cached)
2026-Oct-04 05:16:18 :: [armh] #200 kernel-modules-LiME-un-def.git sisyphus/kernel-modules-LiME-un-def-1.9.1-alt1: build start
2026-Oct-04 05:16:20 :: [i586] #300 kernel-modules-accel-ppp-un-def.git sisyphus/kernel-modules-accel-ppp-un-def-1.12.0-alt3: build OK (cached)
2026-Oct-04 05:16:20 :: [i586] #400 kernel-modules-anbox-un-def.git sisyphus/kernel-modules-anbox-un-def-14-alt2.gae26ba2: build start
2026-Oct-04 05:16:23 :: [x86_64] #300 kernel-modules-accel-ppp-un-def.git sisyphus/kernel-modules-accel-ppp-un-def-1.12.0-alt3: build OK (cached)
2026-Oct-04 05:16:23 :: [x86_64] #400 kernel-modules-anbox-un-def.git sisyphus/kernel-modules-anbox-un-def-14-alt2.gae26ba2: build start
2026-Oct-04 05:16:27 :: [aarch64] #200 kernel-modules-LiME-un-def.git sisyphus/kernel-modules-LiME-un-def-1.9.1-alt1: build OK (cached)
2026-Oct-04 05:16:27 :: [aarch64] #300 kernel-modules-accel-ppp-un-def.git sisyphus/kernel-modules-accel-ppp-un-def-1.12.0-alt3: build start
2026-Oct-04 05:16:31 :: [i586] #400 kernel-modules-anbox-un-def.git sisyphus/kernel-modules-anbox-un-def-14-alt2.gae26ba2: build OK (cached)
2026-Oct-04 05:16:32 :: [i586] #500 kernel-modules-bcmwl-un-def.git sisyphus/kernel-modules-bcmwl-un-def-6.30.223.271-alt15: build start
2026-Oct-04 05:16:35 :: [x86_64] #400 kernel-modules-anbox-un-def.git sisyphus/kernel-modules-anbox-un-def-14-alt2.gae26ba2: build OK (cached)
2026-Oct-04 05:16:35 :: [x86_64] #500 kernel-modules-bcmwl-un-def.git sisyphus/kernel-modules-bcmwl-un-def-6.30.223.271-alt15: build start
2026-Oct-04 05:16:46 :: [i586] #500 kernel-modules-bcmwl-un-def.git sisyphus/kernel-modules-bcmwl-un-def-6.30.223.271-alt15: build SKIPPED
2026-Oct-04 05:16:46 :: [i586] #600 kernel-modules-dm-secdel-un-def.git sisyphus/kernel-modules-dm-secdel-un-def-1.0.9-alt1: build start
2026-Oct-04 05:16:47 :: [aarch64] #300 kernel-modules-accel-ppp-un-def.git sisyphus/kernel-modules-accel-ppp-un-def-1.12.0-alt3: build OK (cached)
2026-Oct-04 05:16:47 :: [aarch64] #400 kernel-modules-anbox-un-def.git sisyphus/kernel-modules-anbox-un-def-14-alt2.gae26ba2: build start
2026-Oct-04 05:16:47 :: [x86_64] #500 kernel-modules-bcmwl-un-def.git sisyphus/kernel-modules-bcmwl-un-def-6.30.223.271-alt15: build OK (cached)
2026-Oct-04 05:16:47 :: [x86_64] #600 kernel-modules-dm-secdel-un-def.git sisyphus/kernel-modules-dm-secdel-un-def-1.0.9-alt1: build start
2026-Oct-04 05:16:47 :: [armh] #200 kernel-modules-LiME-un-def.git sisyphus/kernel-modules-LiME-un-def-1.9.1-alt1: build OK (cached)
2026-Oct-04 05:16:48 :: [armh] #300 kernel-modules-accel-ppp-un-def.git sisyphus/kernel-modules-accel-ppp-un-def-1.12.0-alt3: build start
2026-Oct-04 05:16:58 :: [i586] #600 kernel-modules-dm-secdel-un-def.git sisyphus/kernel-modules-dm-secdel-un-def-1.0.9-alt1: build OK (cached)
2026-Oct-04 05:16:58 :: [i586] #700 kernel-modules-drbd9-un-def.git sisyphus/kernel-modules-drbd9-un-def-9.2.12-alt1: build start
2026-Oct-04 05:16:59 :: [x86_64] #600 kernel-modules-dm-secdel-un-def.git sisyphus/kernel-modules-dm-secdel-un-def-1.0.9-alt1: build OK (cached)
2026-Oct-04 05:16:59 :: [x86_64] #700 kernel-modules-drbd9-un-def.git sisyphus/kernel-modules-drbd9-un-def-9.2.12-alt1: build start
2026-Oct-04 05:17:06 :: [aarch64] #400 kernel-modules-anbox-un-def.git sisyphus/kernel-modules-anbox-un-def-14-alt2.gae26ba2: build OK (cached)
2026-Oct-04 05:17:07 :: [aarch64] #500 kernel-modules-bcmwl-un-def.git sisyphus/kernel-modules-bcmwl-un-def-6.30.223.271-alt15: build start
2026-Oct-04 05:17:11 :: [x86_64] #700 kernel-modules-drbd9-un-def.git sisyphus/kernel-modules-drbd9-un-def-9.2.12-alt1: build OK (cached)
2026-Oct-04 05:17:12 :: [x86_64] #1000 kernel-modules-evdi-un-def.git sisyphus/kernel-modules-evdi-un-def-1.14.1-alt1: build start
2026-Oct-04 05:17:13 :: [i586] #700 kernel-modules-drbd9-un-def.git sisyphus/kernel-modules-drbd9-un-def-9.2.12-alt1: build SKIPPED
2026-Oct-04 05:17:13 :: [i586] #1000 kernel-modules-evdi-un-def.git sisyphus/kernel-modules-evdi-un-def-1.14.1-alt1: build start
2026-Oct-04 05:17:23 :: [x86_64] #1000 kernel-modules-evdi-un-def.git sisyphus/kernel-modules-evdi-un-def-1.14.1-alt1: build OK (cached)
2026-Oct-04 05:17:24 :: [x86_64] #1100 kernel-modules-i40e-un-def.git sisyphus/kernel-modules-i40e-un-def-2.22.20-alt1: build start
2026-Oct-04 05:17:24 :: [i586] #1000 kernel-modules-evdi-un-def.git sisyphus/kernel-modules-evdi-un-def-1.14.1-alt1: build OK (cached)
2026-Oct-04 05:17:24 :: [i586] #1100 kernel-modules-i40e-un-def.git sisyphus/kernel-modules-i40e-un-def-2.22.20-alt1: build start
2026-Oct-04 05:17:25 :: [armh] #300 kernel-modules-accel-ppp-un-def.git sisyphus/kernel-modules-accel-ppp-un-def-1.12.0-alt3: build SKIPPED
2026-Oct-04 05:17:25 :: [armh] #400 kernel-modules-anbox-un-def.git sisyphus/kernel-modules-anbox-un-def-14-alt2.gae26ba2: build start
2026-Oct-04 05:17:30 :: [aarch64] #500 kernel-modules-bcmwl-un-def.git sisyphus/kernel-modules-bcmwl-un-def-6.30.223.271-alt15: build SKIPPED
2026-Oct-04 05:17:30 :: [aarch64] #600 kernel-modules-dm-secdel-un-def.git sisyphus/kernel-modules-dm-secdel-un-def-1.0.9-alt1: build start
2026-Oct-04 05:17:36 :: [x86_64] #1100 kernel-modules-i40e-un-def.git sisyphus/kernel-modules-i40e-un-def-2.22.20-alt1: build OK (cached)
2026-Oct-04 05:17:36 :: [x86_64] #1200 kernel-modules-iavf-un-def.git sisyphus/kernel-modules-iavf-un-def-4.8.3-alt1: build start
2026-Oct-04 05:17:39 :: [i586] #1100 kernel-modules-i40e-un-def.git sisyphus/kernel-modules-i40e-un-def-2.22.20-alt1: build SKIPPED
2026-Oct-04 05:17:39 :: [i586] #1200 kernel-modules-iavf-un-def.git sisyphus/kernel-modules-iavf-un-def-4.8.3-alt1: build start
2026-Oct-04 05:17:48 :: [x86_64] #1200 kernel-modules-iavf-un-def.git sisyphus/kernel-modules-iavf-un-def-4.8.3-alt1: build OK (cached)
2026-Oct-04 05:17:48 :: [x86_64] #1300 kernel-modules-ipt-ratelimit-un-def.git sisyphus/kernel-modules-ipt-ratelimit-un-def-0.3.3-alt1: build start
2026-Oct-04 05:17:51 :: [aarch64] #600 kernel-modules-dm-secdel-un-def.git sisyphus/kernel-modules-dm-secdel-un-def-1.0.9-alt1: build OK (cached)
2026-Oct-04 05:17:51 :: [aarch64] #700 kernel-modules-drbd9-un-def.git sisyphus/kernel-modules-drbd9-un-def-9.2.12-alt1: build start
2026-Oct-04 05:17:54 :: [i586] #1200 kernel-modules-iavf-un-def.git sisyphus/kernel-modules-iavf-un-def-4.8.3-alt1: build SKIPPED
2026-Oct-04 05:17:54 :: [i586] #1300 kernel-modules-ipt-ratelimit-un-def.git sisyphus/kernel-modules-ipt-ratelimit-un-def-0.3.3-alt1: build start
2026-Oct-04 05:17:54 :: [armh] #400 kernel-modules-anbox-un-def.git sisyphus/kernel-modules-anbox-un-def-14-alt2.gae26ba2: build OK (cached)
2026-Oct-04 05:17:54 :: [armh] #500 kernel-modules-bcmwl-un-def.git sisyphus/kernel-modules-bcmwl-un-def-6.30.223.271-alt15: build start
2026-Oct-04 05:18:00 :: [x86_64] #1300 kernel-modules-ipt-ratelimit-un-def.git sisyphus/kernel-modules-ipt-ratelimit-un-def-0.3.3-alt1: build OK (cached)
2026-Oct-04 05:18:00 :: [x86_64] #1400 kernel-modules-ipt_netflow-un-def.git sisyphus/kernel-modules-ipt_netflow-un-def-2.6-alt1: build start
2026-Oct-04 05:18:06 :: [i586] #1300 kernel-modules-ipt-ratelimit-un-def.git sisyphus/kernel-modules-ipt-ratelimit-un-def-0.3.3-alt1: build OK (cached)
2026-Oct-04 05:18:06 :: [i586] #1400 kernel-modules-ipt_netflow-un-def.git sisyphus/kernel-modules-ipt_netflow-un-def-2.6-alt1: build start
2026-Oct-04 05:18:11 :: [aarch64] #700 kernel-modules-drbd9-un-def.git sisyphus/kernel-modules-drbd9-un-def-9.2.12-alt1: build OK (cached)
2026-Oct-04 05:18:11 :: [aarch64] #1000 kernel-modules-evdi-un-def.git sisyphus/kernel-modules-evdi-un-def-1.14.1-alt1: build start
2026-Oct-04 05:18:12 :: [x86_64] #1400 kernel-modules-ipt_netflow-un-def.git sisyphus/kernel-modules-ipt_netflow-un-def-2.6-alt1: build OK (cached)
2026-Oct-04 05:18:12 :: [x86_64] #1500 kernel-modules-ixgbe-un-def.git sisyphus/kernel-modules-ixgbe-un-def-5.20.10-alt1: build start
2026-Oct-04 05:18:17 :: [i586] #1400 kernel-modules-ipt_netflow-un-def.git sisyphus/kernel-modules-ipt_netflow-un-def-2.6-alt1: build OK (cached)
2026-Oct-04 05:18:17 :: [i586] #1500 kernel-modules-ixgbe-un-def.git sisyphus/kernel-modules-ixgbe-un-def-5.20.10-alt1: build start
2026-Oct-04 05:18:24 :: [x86_64] #1500 kernel-modules-ixgbe-un-def.git sisyphus/kernel-modules-ixgbe-un-def-5.20.10-alt1: build OK (cached)
2026-Oct-04 05:18:24 :: [x86_64] #1600 kernel-modules-lkrg-un-def.git sisyphus/kernel-modules-lkrg-un-def-0.9.8-alt3: build start
2026-Oct-04 05:18:30 :: [armh] #500 kernel-modules-bcmwl-un-def.git sisyphus/kernel-modules-bcmwl-un-def-6.30.223.271-alt15: build SKIPPED
2026-Oct-04 05:18:30 :: [aarch64] #1000 kernel-modules-evdi-un-def.git sisyphus/kernel-modules-evdi-un-def-1.14.1-alt1: build OK (cached)
2026-Oct-04 05:18:30 :: [armh] #600 kernel-modules-dm-secdel-un-def.git sisyphus/kernel-modules-dm-secdel-un-def-1.0.9-alt1: build start
2026-Oct-04 05:18:30 :: [aarch64] #1100 kernel-modules-i40e-un-def.git sisyphus/kernel-modules-i40e-un-def-2.22.20-alt1: build start
2026-Oct-04 05:18:32 :: [i586] #1500 kernel-modules-ixgbe-un-def.git sisyphus/kernel-modules-ixgbe-un-def-5.20.10-alt1: build SKIPPED
2026-Oct-04 05:18:32 :: [i586] #1600 kernel-modules-lkrg-un-def.git sisyphus/kernel-modules-lkrg-un-def-0.9.8-alt3: build start
2026-Oct-04 05:18:36 :: [x86_64] #1600 kernel-modules-lkrg-un-def.git sisyphus/kernel-modules-lkrg-un-def-0.9.8-alt3: build OK (cached)
2026-Oct-04 05:18:36 :: [x86_64] #1700 kernel-modules-nvidia-un-def.git sisyphus/kernel-modules-nvidia-un-def-550.144.03-alt1: build start
2026-Oct-04 05:18:44 :: [i586] #1600 kernel-modules-lkrg-un-def.git sisyphus/kernel-modules-lkrg-un-def-0.9.8-alt3: build OK (cached)
2026-Oct-04 05:18:44 :: [i586] #1700 kernel-modules-nvidia-un-def.git sisyphus/kernel-modules-nvidia-un-def-550.144.03-alt1: build start
2026-Oct-04 05:18:49 :: [x86_64] #1700 kernel-modules-nvidia-un-def.git sisyphus/kernel-modules-nvidia-un-def-550.144.03-alt1: build OK (cached)
2026-Oct-04 05:18:50 :: [x86_64] #2000 kernel-modules-r8125-un-def.git sisyphus/kernel-modules-r8125-un-def-9.011.01-alt1: build start
2026-Oct-04 05:18:50 :: [aarch64] #1100 kernel-modules-i40e-un-def.git sisyphus/kernel-modules-i40e-un-def-2.22.20-alt1: build OK (cached)
2026-Oct-04 05:18:50 :: [aarch64] #1200 kernel-modules-iavf-un-def.git sisyphus/kernel-modules-iavf-un-def-4.8.3-alt1: build start
2026-Oct-04 05:18:56 :: [i586] #1700 kernel-modules-nvidia-un-def.git sisyphus/kernel-modules-nvidia-un-def-550.144.03-alt1: build OK (cached)
2026-Oct-04 05:18:56 :: [i586] #2000 kernel-modules-r8125-un-def.git sisyphus/kernel-modules-r8125-un-def-9.011.01-alt1: build start
2026-Oct-04 05:19:01 :: [armh] #600 kernel-modules-dm-secdel-un-def.git sisyphus/kernel-modules-dm-secdel-un-def-1.0.9-alt1: build OK (cached)
2026-Oct-04 05:19:01 :: [armh] #700 kernel-modules-drbd9-un-def.git sisyphus/kernel-modules-drbd9-un-def-9.2.12-alt1: build start
2026-Oct-04 05:19:02 :: [x86_64] #2000 kernel-modules-r8125-un-def.git sisyphus/kernel-modules-r8125-un-def-9.011.01-alt1: build OK (cached)
2026-Oct-04 05:19:02 :: [x86_64] #2100 kernel-modules-r8168-un-def.git sisyphus/kernel-modules-r8168-un-def-8.053.01-alt1.k: build start
2026-Oct-04 05:19:07 :: [i586] #2000 kernel-modules-r8125-un-def.git sisyphus/kernel-modules-r8125-un-def-9.011.01-alt1: build OK (cached)
2026-Oct-04 05:19:07 :: [i586] #2100 kernel-modules-r8168-un-def.git sisyphus/kernel-modules-r8168-un-def-8.053.01-alt1.k: build start
2026-Oct-04 05:19:10 :: [aarch64] #1200 kernel-modules-iavf-un-def.git sisyphus/kernel-modules-iavf-un-def-4.8.3-alt1: build OK (cached)
2026-Oct-04 05:19:10 :: [aarch64] #1300 kernel-modules-ipt-ratelimit-un-def.git sisyphus/kernel-modules-ipt-ratelimit-un-def-0.3.3-alt1: build start
2026-Oct-04 05:19:14 :: [x86_64] #2100 kernel-modules-r8168-un-def.git sisyphus/kernel-modules-r8168-un-def-8.053.01-alt1.k: build OK (cached)
2026-Oct-04 05:19:14 :: [x86_64] #2600 kernel-modules-rtl8821cu-un-def.git sisyphus/kernel-modules-rtl8821cu-un-def-5.12.0.4-alt1: build start
2026-Oct-04 05:19:19 :: [i586] #2100 kernel-modules-r8168-un-def.git sisyphus/kernel-modules-r8168-un-def-8.053.01-alt1.k: build OK (cached)
2026-Oct-04 05:19:19 :: [i586] #2600 kernel-modules-rtl8821cu-un-def.git sisyphus/kernel-modules-rtl8821cu-un-def-5.12.0.4-alt1: build start
2026-Oct-04 05:19:30 :: [aarch64] #1300 kernel-modules-ipt-ratelimit-un-def.git sisyphus/kernel-modules-ipt-ratelimit-un-def-0.3.3-alt1: build OK (cached)
2026-Oct-04 05:19:30 :: [aarch64] #1400 kernel-modules-ipt_netflow-un-def.git sisyphus/kernel-modules-ipt_netflow-un-def-2.6-alt1: build start
2026-Oct-04 05:19:36 :: [armh] #700 kernel-modules-drbd9-un-def.git sisyphus/kernel-modules-drbd9-un-def-9.2.12-alt1: build SKIPPED
2026-Oct-04 05:19:36 :: [armh] #1000 kernel-modules-evdi-un-def.git sisyphus/kernel-modules-evdi-un-def-1.14.1-alt1: build start
[x86_64]   CC [M]  /usr/src/RPM/BUILD/kernel-source-rtl8821cu-5.12.0.4/os_dep/linux/usb_intf.o
[x86_64] /usr/src/RPM/BUILD/kernel-source-rtl8821cu-5.12.0.4/os_dep/linux/usb_intf.c:341:10: error: 'struct usb_driver' has no member named 'drvwrap'
[x86_64]   341 |  .usbdrv.drvwrap.driver.shutdown = rtw_dev_shutdown,
2026-Oct-04 05:19:41 :: [x86_64] kernel-modules-rtl8821cu-un-def.git sisyphus/kernel-modules-rtl8821cu-un-def-5.12.0.4-alt1: remote: build failed
2026-Oct-04 05:19:41 :: [x86_64] #2600 kernel-modules-rtl8821cu-un-def.git sisyphus/kernel-modules-rtl8821cu-un-def-5.12.0.4-alt1: build FAILED
[i586]   CC [M]  /usr/src/RPM/BUILD/kernel-source-rtl8821cu-5.12.0.4/os_dep/linux/usb_intf.o
[i586] /usr/src/RPM/BUILD/kernel-source-rtl8821cu-5.12.0.4/os_dep/linux/usb_intf.c:341:10: error: 'struct usb_driver' has no member named 'drvwrap'
[i586]   341 |  .usbdrv.drvwrap.driver.shutdown = rtw_dev_shutdown,
2026-Oct-04 05:19:47 :: [i586] kernel-modules-rtl8821cu-un-def.git sisyphus/kernel-modules-rtl8821cu-un-def-5.12.0.4-alt1: remote: build failed
2026-Oct-04 05:19:47 :: [i586] #2600 kernel-modules-rtl8821cu-un-def.git sisyphus/kernel-modules-rtl8821cu-un-def-5.12.0.4-alt1: build FAILED
2026-Oct-04 05:19:49 :: [aarch64] #1400 kernel-modules-ipt_netflow-un-def.git sisyphus/kernel-modules-ipt_netflow-un-def-2.6-alt1: build OK (cached)
2026-Oct-04 05:19:50 :: [aarch64] #1500 kernel-modules-ixgbe-un-def.git sisyphus/kernel-modules-ixgbe-un-def-5.20.10-alt1: build start
2026-Oct-04 05:20:06 :: [armh] #1000 kernel-modules-evdi-un-def.git sisyphus/kernel-modules-evdi-un-def-1.14.1-alt1: build OK (cached)
2026-Oct-04 05:20:06 :: [armh] #1100 kernel-modules-i40e-un-def.git sisyphus/kernel-modules-i40e-un-def-2.22.20-alt1: build start
2026-Oct-04 05:20:09 :: [aarch64] #1500 kernel-modules-ixgbe-un-def.git sisyphus/kernel-modules-ixgbe-un-def-5.20.10-alt1: build OK (cached)
2026-Oct-04 05:20:10 :: [aarch64] #1600 kernel-modules-lkrg-un-def.git sisyphus/kernel-modules-lkrg-un-def-0.9.8-alt3: build start
2026-Oct-04 05:20:33 :: [aarch64] #1600 kernel-modules-lkrg-un-def.git sisyphus/kernel-modules-lkrg-un-def-0.9.8-alt3: build SKIPPED
2026-Oct-04 05:20:34 :: [aarch64] #1700 kernel-modules-nvidia-un-def.git sisyphus/kernel-modules-nvidia-un-def-550.144.03-alt1: build start
2026-Oct-04 05:20:42 :: [armh] #1100 kernel-modules-i40e-un-def.git sisyphus/kernel-modules-i40e-un-def-2.22.20-alt1: build SKIPPED
2026-Oct-04 05:20:42 :: [armh] #1200 kernel-modules-iavf-un-def.git sisyphus/kernel-modules-iavf-un-def-4.8.3-alt1: build start
2026-Oct-04 05:20:55 :: [aarch64] #1700 kernel-modules-nvidia-un-def.git sisyphus/kernel-modules-nvidia-un-def-550.144.03-alt1: build OK (cached)
2026-Oct-04 05:20:55 :: [aarch64] #2000 kernel-modules-r8125-un-def.git sisyphus/kernel-modules-r8125-un-def-9.011.01-alt1: build start
2026-Oct-04 05:21:18 :: [armh] #1200 kernel-modules-iavf-un-def.git sisyphus/kernel-modules-iavf-un-def-4.8.3-alt1: build SKIPPED
2026-Oct-04 05:21:18 :: [armh] #1300 kernel-modules-ipt-ratelimit-un-def.git sisyphus/kernel-modules-ipt-ratelimit-un-def-0.3.3-alt1: build start
2026-Oct-04 05:21:18 :: [aarch64] #2000 kernel-modules-r8125-un-def.git sisyphus/kernel-modules-r8125-un-def-9.011.01-alt1: build SKIPPED
2026-Oct-04 05:21:19 :: [aarch64] #2100 kernel-modules-r8168-un-def.git sisyphus/kernel-modules-r8168-un-def-8.053.01-alt1.k: build start
2026-Oct-04 05:21:38 :: [aarch64] #2100 kernel-modules-r8168-un-def.git sisyphus/kernel-modules-r8168-un-def-8.053.01-alt1.k: build OK (cached)
2026-Oct-04 05:21:39 :: [aarch64] #2600 kernel-modules-rtl8821cu-un-def.git sisyphus/kernel-modules-rtl8821cu-un-def-5.12.0.4-alt1: build start
2026-Oct-04 05:21:47 :: [armh] #1300 kernel-modules-ipt-ratelimit-un-def.git sisyphus/kernel-modules-ipt-ratelimit-un-def-0.3.3-alt1: build OK (cached)
2026-Oct-04 05:21:47 :: [armh] #1400 kernel-modules-ipt_netflow-un-def.git sisyphus/kernel-modules-ipt_netflow-un-def-2.6-alt1: build start
2026-Oct-04 05:22:02 :: [aarch64] #2600 kernel-modules-rtl8821cu-un-def.git sisyphus/kernel-modules-rtl8821cu-un-def-5.12.0.4-alt1: build SKIPPED
2026-Oct-04 05:22:03 :: [aarch64] #3000 kernel-modules-rtw89-un-def.git sisyphus/kernel-modules-rtw89-un-def-0.0-alt4.git.4f3464d: build start
2026-Oct-04 05:22:23 :: [armh] #1400 kernel-modules-ipt_netflow-un-def.git sisyphus/kernel-modules-ipt_netflow-un-def-2.6-alt1: build SKIPPED
2026-Oct-04 05:22:23 :: [armh] #1500 kernel-modules-ixgbe-un-def.git sisyphus/kernel-modules-ixgbe-un-def-5.20.10-alt1: build start
2026-Oct-04 05:22:55 :: [aarch64] #3000 kernel-modules-rtw89-un-def.git sisyphus/kernel-modules-rtw89-un-def-0.0-alt4.git.4f3464d: build OK
2026-Oct-04 05:22:55 :: [aarch64] #3100 kernel-modules-sysdig-un-def.git sisyphus/kernel-modules-sysdig-un-def-7.3.0-alt1: build start
2026-Oct-04 05:22:58 :: [armh] #1500 kernel-modules-ixgbe-un-def.git sisyphus/kernel-modules-ixgbe-un-def-5.20.10-alt1: build SKIPPED
2026-Oct-04 05:22:59 :: [armh] #1600 kernel-modules-lkrg-un-def.git sisyphus/kernel-modules-lkrg-un-def-0.9.8-alt3: build start
2026-Oct-04 05:23:34 :: [armh] #1600 kernel-modules-lkrg-un-def.git sisyphus/kernel-modules-lkrg-un-def-0.9.8-alt3: build SKIPPED
2026-Oct-04 05:23:34 :: [armh] #1700 kernel-modules-nvidia-un-def.git sisyphus/kernel-modules-nvidia-un-def-550.144.03-alt1: build start
2026-Oct-04 05:23:43 :: [aarch64] #3100 kernel-modules-sysdig-un-def.git sisyphus/kernel-modules-sysdig-un-def-7.3.0-alt1: build OK
2026-Oct-04 05:23:43 :: [aarch64] #3200 kernel-modules-v4l2loopback-un-def.git sisyphus/kernel-modules-v4l2loopback-un-def-0.12.7-alt1.g5e9dd41: build start
2026-Oct-04 05:24:20 :: [armh] #1700 kernel-modules-nvidia-un-def.git sisyphus/kernel-modules-nvidia-un-def-550.144.03-alt1: build SKIPPED
2026-Oct-04 05:24:20 :: [armh] #2000 kernel-modules-r8125-un-def.git sisyphus/kernel-modules-r8125-un-def-9.011.01-alt1: build start
2026-Oct-04 05:24:24 :: [aarch64] #3200 kernel-modules-v4l2loopback-un-def.git sisyphus/kernel-modules-v4l2loopback-un-def-0.12.7-alt1.g5e9dd41: build OK
2026-Oct-04 05:24:25 :: [aarch64] #3300 kernel-modules-vhba-un-def.git sisyphus/kernel-modules-vhba-un-def-20211218-alt1.k: build start
2026-Oct-04 05:24:56 :: [armh] #2000 kernel-modules-r8125-un-def.git sisyphus/kernel-modules-r8125-un-def-9.011.01-alt1: build SKIPPED
2026-Oct-04 05:24:56 :: [armh] #2100 kernel-modules-r8168-un-def.git sisyphus/kernel-modules-r8168-un-def-8.053.01-alt1.k: build start
2026-Oct-04 05:25:06 :: [aarch64] #3300 kernel-modules-vhba-un-def.git sisyphus/kernel-modules-vhba-un-def-20211218-alt1.k: build OK
2026-Oct-04 05:25:06 :: [aarch64] #3400 kernel-modules-virtualbox-addition-un-def.git sisyphus/kernel-modules-virtualbox-addition-p10-un-def-7.1.16-alt1: build start
2026-Oct-04 05:25:26 :: [armh] #2100 kernel-modules-r8168-un-def.git sisyphus/kernel-modules-r8168-un-def-8.053.01-alt1.k: build OK (cached)
2026-Oct-04 05:25:26 :: [armh] #2600 kernel-modules-rtl8821cu-un-def.git sisyphus/kernel-modules-rtl8821cu-un-def-5.12.0.4-alt1: build start
2026-Oct-04 05:25:29 :: [aarch64] #3400 kernel-modules-virtualbox-addition-un-def.git sisyphus/kernel-modules-virtualbox-addition-p10-un-def-7.1.16-alt1: build SKIPPED
2026-Oct-04 05:25:29 :: [aarch64] #3500 kernel-modules-virtualbox-un-def.git sisyphus/kernel-modules-virtualbox-p10-un-def-7.1.16-alt1: build start
2026-Oct-04 05:25:53 :: [aarch64] #3500 kernel-modules-virtualbox-un-def.git sisyphus/kernel-modules-virtualbox-p10-un-def-7.1.16-alt1: build SKIPPED
2026-Oct-04 05:25:53 :: [aarch64] #3600 kernel-modules-xtables-addons-un-def.git sisyphus/kernel-modules-xtables-addons-un-def-3.23-alt1: build start
2026-Oct-04 05:26:02 :: [armh] #2600 kernel-modules-rtl8821cu-un-def.git sisyphus/kernel-modules-rtl8821cu-un-def-5.12.0.4-alt1: build SKIPPED
2026-Oct-04 05:26:02 :: [armh] #3000 kernel-modules-rtw89-un-def.git sisyphus/kernel-modules-rtw89-un-def-0.0-alt4.git.4f3464d: build start
2026-Oct-04 05:27:09 :: [aarch64] #3600 kernel-modules-xtables-addons-un-def.git sisyphus/kernel-modules-xtables-addons-un-def-3.23-alt1: build OK
2026-Oct-04 05:27:09 :: [aarch64] #3700 kernel-modules-zfs-un-def.git p10/kernel-modules-zfs-un-def-2.1.16-alt1: build start
2026-Oct-04 05:27:17 :: [armh] #3000 kernel-modules-rtw89-un-def.git sisyphus/kernel-modules-rtw89-un-def-0.0-alt4.git.4f3464d: build OK
2026-Oct-04 05:27:17 :: [armh] #3100 kernel-modules-sysdig-un-def.git sisyphus/kernel-modules-sysdig-un-def-7.3.0-alt1: build start
2026-Oct-04 05:27:52 :: [armh] #3100 kernel-modules-sysdig-un-def.git sisyphus/kernel-modules-sysdig-un-def-7.3.0-alt1: build SKIPPED
2026-Oct-04 05:27:52 :: [armh] #3200 kernel-modules-v4l2loopback-un-def.git sisyphus/kernel-modules-v4l2loopback-un-def-0.12.7-alt1.g5e9dd41: build start
2026-Oct-04 05:28:50 :: [armh] #3200 kernel-modules-v4l2loopback-un-def.git sisyphus/kernel-modules-v4l2loopback-un-def-0.12.7-alt1.g5e9dd41: build OK
2026-Oct-04 05:28:51 :: [armh] #3300 kernel-modules-vhba-un-def.git sisyphus/kernel-modules-vhba-un-def-20211218-alt1.k: build start
2026-Oct-04 05:29:48 :: [armh] #3300 kernel-modules-vhba-un-def.git sisyphus/kernel-modules-vhba-un-def-20211218-alt1.k: build OK
2026-Oct-04 05:29:48 :: [armh] #3400 kernel-modules-virtualbox-addition-un-def.git sisyphus/kernel-modules-virtualbox-addition-p10-un-def-7.1.16-alt1: build start
2026-Oct-04 05:30:23 :: [armh] #3400 kernel-modules-virtualbox-addition-un-def.git sisyphus/kernel-modules-virtualbox-addition-p10-un-def-7.1.16-alt1: build SKIPPED
2026-Oct-04 05:30:23 :: [armh] #3500 kernel-modules-virtualbox-un-def.git sisyphus/kernel-modules-virtualbox-p10-un-def-7.1.16-alt1: build start
2026-Oct-04 05:30:59 :: [armh] #3500 kernel-modules-virtualbox-un-def.git sisyphus/kernel-modules-virtualbox-p10-un-def-7.1.16-alt1: build SKIPPED
2026-Oct-04 05:30:59 :: [armh] #3600 kernel-modules-xtables-addons-un-def.git sisyphus/kernel-modules-xtables-addons-un-def-3.23-alt1: build start
2026-Oct-04 05:32:42 :: [armh] #3600 kernel-modules-xtables-addons-un-def.git sisyphus/kernel-modules-xtables-addons-un-def-3.23-alt1: build OK
2026-Oct-04 05:32:42 :: [armh] #3700 kernel-modules-zfs-un-def.git p10/kernel-modules-zfs-un-def-2.1.16-alt1: build start
2026-Oct-04 05:33:15 :: [aarch64] #3700 kernel-modules-zfs-un-def.git p10/kernel-modules-zfs-un-def-2.1.16-alt1: build OK
2026-Oct-04 05:40:31 :: [armh] #3700 kernel-modules-zfs-un-def.git p10/kernel-modules-zfs-un-def-2.1.16-alt1: build OK
2026-Oct-04 05:19:42 :: [x86_64] build FAILED
2026-Oct-04 05:19:47 :: [i586] build FAILED
2026-Oct-04 05:40:32 :: task #435322 for p10 FAILED


^ permalink raw reply	[flat|nested] 6+ messages in thread

* [#435322] p10 FAILED (try 6) kernel-image.git=kernel-image-un-def-6.1.189-alt1 ...
  2026-10-03 13:40 [#435322] p10 FAILED kernel-image.git=kernel-image-un-def-6.1.189-alt1 Girar awaiter (kernelbot)
                   ` (3 preceding siblings ...)
  2026-10-04  5:40 ` [#435322] p10 FAILED (try 5) kernel-image.git=kernel-image-un-def-6.1.189-alt1 Girar awaiter (kernelbot)
@ 2026-10-04  8:23 ` Girar awaiter (kernelbot)
  4 siblings, 0 replies; 6+ messages in thread
From: Girar awaiter (kernelbot) @ 2026-10-04  8:23 UTC (permalink / raw)
  To: Kernel Bot; +Cc: girar-builder-p10, sisyphus-incominger, girar-builder-p10

https://git.altlinux.org/tasks/435322/logs/events.6.1.log
https://packages.altlinux.org/tasks/435322

subtask  name                                       aarch64  armh  i586  x86_64
  #3000  kernel-modules-rtw89-un-def                     52  1:15    40      40
  #3100  kernel-modules-sysdig-un-def                    48     -     -      33
  #3200  kernel-modules-v4l2loopback-un-def              42    58    28      29
  #3300  kernel-modules-vhba-un-def                      41    58    30      29
  #3400  kernel-modules-virtualbox-addition-un-def        -     -    51      49
  #3500  kernel-modules-virtualbox-un-def                 -     -     -      45
  #3600  kernel-modules-xtables-addons-un-def          1:15  1:44    50      48
  #3700  kernel-modules-zfs-un-def                     6:05  7:49     -    3:39

2026-Oct-04 07:43:53 :: task #435322 for p10 resumed by kernelbot:
2026-Oct-04 07:43:53 :: message: v6.1.189
#100 build kernel-image-un-def-6.1.189-alt1 from /people/kernelbot/packages/kernel-image.git fetched at 2026-Oct-03 12:07:12
#200 build sisyphus/kernel-modules-LiME-un-def-1.9.1-alt1 from /gears/k/kernel-modules-LiME-un-def.git fetched at 2026-Oct-03 12:07:17 from p10
#300 build sisyphus/kernel-modules-accel-ppp-un-def-1.12.0-alt3 from /gears/k/kernel-modules-accel-ppp-un-def.git fetched at 2026-Oct-03 12:07:22 from p10
#400 build sisyphus/kernel-modules-anbox-un-def-14-alt2.gae26ba2 from /gears/k/kernel-modules-anbox-un-def.git fetched at 2026-Oct-03 12:07:23 from p10
#500 build sisyphus/kernel-modules-bcmwl-un-def-6.30.223.271-alt15 from /gears/k/kernel-modules-bcmwl-un-def.git fetched at 2026-Oct-03 12:07:32 from p10
#600 build sisyphus/kernel-modules-dm-secdel-un-def-1.0.9-alt1 from /gears/k/kernel-modules-dm-secdel-un-def.git fetched at 2026-Oct-03 12:07:33 from p10
#700 build sisyphus/kernel-modules-drbd9-un-def-9.2.12-alt1 from /gears/k/kernel-modules-drbd9-un-def.git fetched at 2026-Oct-03 12:07:37 from p10
#1000 build sisyphus/kernel-modules-evdi-un-def-1.14.1-alt1 from /gears/k/kernel-modules-evdi-un-def.git fetched at 2026-Oct-03 12:07:39 from p10
#1100 build sisyphus/kernel-modules-i40e-un-def-2.22.20-alt1 from /gears/k/kernel-modules-i40e-un-def.git fetched at 2026-Oct-03 12:07:40 from p10
#1200 build sisyphus/kernel-modules-iavf-un-def-4.8.3-alt1 from /gears/k/kernel-modules-iavf-un-def.git fetched at 2026-Oct-03 12:07:41 from p10
#1300 build sisyphus/kernel-modules-ipt-ratelimit-un-def-0.3.3-alt1 from /gears/k/kernel-modules-ipt-ratelimit-un-def.git fetched at 2026-Oct-03 12:07:48 from p10
#1400 build sisyphus/kernel-modules-ipt_netflow-un-def-2.6-alt1 from /gears/k/kernel-modules-ipt_netflow-un-def.git fetched at 2026-Oct-03 12:07:54 from p10
#1500 build sisyphus/kernel-modules-ixgbe-un-def-5.20.10-alt1 from /gears/k/kernel-modules-ixgbe-un-def.git fetched at 2026-Oct-03 12:07:57 from p10
#1600 build sisyphus/kernel-modules-lkrg-un-def-0.9.8-alt3 from /gears/k/kernel-modules-lkrg-un-def.git fetched at 2026-Oct-03 12:08:01 from p10
#1700 build sisyphus/kernel-modules-nvidia-un-def-550.144.03-alt1 from /gears/k/kernel-modules-nvidia-un-def.git fetched at 2026-Oct-03 12:08:15 from p10
#2000 build sisyphus/kernel-modules-r8125-un-def-9.011.01-alt1 from /gears/k/kernel-modules-r8125-un-def.git fetched at 2026-Oct-03 12:08:18 from p10
#2100 build sisyphus/kernel-modules-r8168-un-def-8.053.01-alt1.k from /gears/k/kernel-modules-r8168-un-def.git fetched at 2026-Oct-03 12:08:26 from p10
#2200 removed
#2300 removed
#2400 removed
#2500 removed
#2600 removed
#2700 removed
#3000 build sisyphus/kernel-modules-rtw89-un-def-0.0-alt4.git.4f3464d from /gears/k/kernel-modules-rtw89-un-def.git fetched at 2026-Oct-03 12:08:40 from p10
#3100 build sisyphus/kernel-modules-sysdig-un-def-7.3.0-alt1 from /gears/k/kernel-modules-sysdig-un-def.git fetched at 2026-Oct-03 12:08:41 from p10
#3200 build sisyphus/kernel-modules-v4l2loopback-un-def-0.12.7-alt1.g5e9dd41 from /gears/k/kernel-modules-v4l2loopback-un-def.git fetched at 2026-Oct-03 12:08:44 from p10
#3300 build sisyphus/kernel-modules-vhba-un-def-20211218-alt1.k from /gears/k/kernel-modules-vhba-un-def.git fetched at 2026-Oct-03 12:08:51 from p10
#3400 build sisyphus/kernel-modules-virtualbox-addition-p10-un-def-7.1.16-alt1 from /gears/k/kernel-modules-virtualbox-addition-un-def.git fetched at 2026-Oct-03 12:09:02 from p10
#3500 build sisyphus/kernel-modules-virtualbox-p10-un-def-7.1.16-alt1 from /gears/k/kernel-modules-virtualbox-un-def.git fetched at 2026-Oct-03 12:09:13 from p10
#3600 build sisyphus/kernel-modules-xtables-addons-un-def-3.23-alt1 from /gears/k/kernel-modules-xtables-addons-un-def.git fetched at 2026-Oct-03 12:09:21 from p10
#3700 build p10/kernel-modules-zfs-un-def-2.1.16-alt1 from /gears/k/kernel-modules-zfs-un-def.git fetched at 2026-Oct-03 12:09:27 from p10
2026-Oct-04 07:43:54 :: created build repo
2026-Oct-04 07:43:55 :: #3000: force rebuild
2026-Oct-04 07:43:55 :: #3100: force rebuild
2026-Oct-04 07:43:55 :: #3200: force rebuild
2026-Oct-04 07:43:55 :: #3300: force rebuild
2026-Oct-04 07:43:55 :: #3600: force rebuild
2026-Oct-04 07:43:55 :: #3700: force rebuild
2026-Oct-04 07:43:56 :: [x86_64] #100 kernel-image.git kernel-image-un-def-6.1.189-alt1: build start
2026-Oct-04 07:43:56 :: [armh] #100 kernel-image.git kernel-image-un-def-6.1.189-alt1: build start
2026-Oct-04 07:43:56 :: [aarch64] #100 kernel-image.git kernel-image-un-def-6.1.189-alt1: build start
2026-Oct-04 07:43:56 :: [i586] #100 kernel-image.git kernel-image-un-def-6.1.189-alt1: build start
2026-Oct-04 07:44:27 :: [i586] #100 kernel-image.git kernel-image-un-def-6.1.189-alt1: build OK (cached)
2026-Oct-04 07:44:27 :: [i586] #200 kernel-modules-LiME-un-def.git sisyphus/kernel-modules-LiME-un-def-1.9.1-alt1: build start
2026-Oct-04 07:44:31 :: [aarch64] #100 kernel-image.git kernel-image-un-def-6.1.189-alt1: build OK (cached)
2026-Oct-04 07:44:31 :: [aarch64] #200 kernel-modules-LiME-un-def.git sisyphus/kernel-modules-LiME-un-def-1.9.1-alt1: build start
2026-Oct-04 07:44:32 :: [x86_64] #100 kernel-image.git kernel-image-un-def-6.1.189-alt1: build OK (cached)
2026-Oct-04 07:44:32 :: [x86_64] #200 kernel-modules-LiME-un-def.git sisyphus/kernel-modules-LiME-un-def-1.9.1-alt1: build start
2026-Oct-04 07:44:41 :: [i586] #200 kernel-modules-LiME-un-def.git sisyphus/kernel-modules-LiME-un-def-1.9.1-alt1: build OK (cached)
2026-Oct-04 07:44:42 :: [i586] #300 kernel-modules-accel-ppp-un-def.git sisyphus/kernel-modules-accel-ppp-un-def-1.12.0-alt3: build start
2026-Oct-04 07:44:46 :: [armh] #100 kernel-image.git kernel-image-un-def-6.1.189-alt1: build OK (cached)
2026-Oct-04 07:44:46 :: [armh] #200 kernel-modules-LiME-un-def.git sisyphus/kernel-modules-LiME-un-def-1.9.1-alt1: build start
2026-Oct-04 07:44:51 :: [aarch64] #200 kernel-modules-LiME-un-def.git sisyphus/kernel-modules-LiME-un-def-1.9.1-alt1: build OK (cached)
2026-Oct-04 07:44:51 :: [aarch64] #300 kernel-modules-accel-ppp-un-def.git sisyphus/kernel-modules-accel-ppp-un-def-1.12.0-alt3: build start
2026-Oct-04 07:44:53 :: [x86_64] #200 kernel-modules-LiME-un-def.git sisyphus/kernel-modules-LiME-un-def-1.9.1-alt1: build OK (cached)
2026-Oct-04 07:44:54 :: [x86_64] #300 kernel-modules-accel-ppp-un-def.git sisyphus/kernel-modules-accel-ppp-un-def-1.12.0-alt3: build start
2026-Oct-04 07:44:56 :: [i586] #300 kernel-modules-accel-ppp-un-def.git sisyphus/kernel-modules-accel-ppp-un-def-1.12.0-alt3: build OK (cached)
2026-Oct-04 07:44:56 :: [i586] #400 kernel-modules-anbox-un-def.git sisyphus/kernel-modules-anbox-un-def-14-alt2.gae26ba2: build start
2026-Oct-04 07:45:10 :: [i586] #400 kernel-modules-anbox-un-def.git sisyphus/kernel-modules-anbox-un-def-14-alt2.gae26ba2: build OK (cached)
2026-Oct-04 07:45:10 :: [i586] #500 kernel-modules-bcmwl-un-def.git sisyphus/kernel-modules-bcmwl-un-def-6.30.223.271-alt15: build start
2026-Oct-04 07:45:11 :: [aarch64] #300 kernel-modules-accel-ppp-un-def.git sisyphus/kernel-modules-accel-ppp-un-def-1.12.0-alt3: build OK (cached)
2026-Oct-04 07:45:11 :: [aarch64] #400 kernel-modules-anbox-un-def.git sisyphus/kernel-modules-anbox-un-def-14-alt2.gae26ba2: build start
2026-Oct-04 07:45:15 :: [x86_64] #300 kernel-modules-accel-ppp-un-def.git sisyphus/kernel-modules-accel-ppp-un-def-1.12.0-alt3: build OK (cached)
2026-Oct-04 07:45:15 :: [x86_64] #400 kernel-modules-anbox-un-def.git sisyphus/kernel-modules-anbox-un-def-14-alt2.gae26ba2: build start
2026-Oct-04 07:45:16 :: [armh] #200 kernel-modules-LiME-un-def.git sisyphus/kernel-modules-LiME-un-def-1.9.1-alt1: build OK (cached)
2026-Oct-04 07:45:16 :: [armh] #300 kernel-modules-accel-ppp-un-def.git sisyphus/kernel-modules-accel-ppp-un-def-1.12.0-alt3: build start
2026-Oct-04 07:45:27 :: [i586] #500 kernel-modules-bcmwl-un-def.git sisyphus/kernel-modules-bcmwl-un-def-6.30.223.271-alt15: build SKIPPED
2026-Oct-04 07:45:27 :: [i586] #600 kernel-modules-dm-secdel-un-def.git sisyphus/kernel-modules-dm-secdel-un-def-1.0.9-alt1: build start
2026-Oct-04 07:45:31 :: [aarch64] #400 kernel-modules-anbox-un-def.git sisyphus/kernel-modules-anbox-un-def-14-alt2.gae26ba2: build OK (cached)
2026-Oct-04 07:45:31 :: [aarch64] #500 kernel-modules-bcmwl-un-def.git sisyphus/kernel-modules-bcmwl-un-def-6.30.223.271-alt15: build start
2026-Oct-04 07:45:36 :: [x86_64] #400 kernel-modules-anbox-un-def.git sisyphus/kernel-modules-anbox-un-def-14-alt2.gae26ba2: build OK (cached)
2026-Oct-04 07:45:36 :: [x86_64] #500 kernel-modules-bcmwl-un-def.git sisyphus/kernel-modules-bcmwl-un-def-6.30.223.271-alt15: build start
2026-Oct-04 07:45:40 :: [i586] #600 kernel-modules-dm-secdel-un-def.git sisyphus/kernel-modules-dm-secdel-un-def-1.0.9-alt1: build OK (cached)
2026-Oct-04 07:45:40 :: [i586] #700 kernel-modules-drbd9-un-def.git sisyphus/kernel-modules-drbd9-un-def-9.2.12-alt1: build start
2026-Oct-04 07:45:54 :: [armh] #300 kernel-modules-accel-ppp-un-def.git sisyphus/kernel-modules-accel-ppp-un-def-1.12.0-alt3: build SKIPPED
2026-Oct-04 07:45:54 :: [armh] #400 kernel-modules-anbox-un-def.git sisyphus/kernel-modules-anbox-un-def-14-alt2.gae26ba2: build start
2026-Oct-04 07:45:55 :: [aarch64] #500 kernel-modules-bcmwl-un-def.git sisyphus/kernel-modules-bcmwl-un-def-6.30.223.271-alt15: build SKIPPED
2026-Oct-04 07:45:55 :: [aarch64] #600 kernel-modules-dm-secdel-un-def.git sisyphus/kernel-modules-dm-secdel-un-def-1.0.9-alt1: build start
2026-Oct-04 07:45:57 :: [x86_64] #500 kernel-modules-bcmwl-un-def.git sisyphus/kernel-modules-bcmwl-un-def-6.30.223.271-alt15: build OK (cached)
2026-Oct-04 07:45:58 :: [x86_64] #600 kernel-modules-dm-secdel-un-def.git sisyphus/kernel-modules-dm-secdel-un-def-1.0.9-alt1: build start
2026-Oct-04 07:46:02 :: [i586] #700 kernel-modules-drbd9-un-def.git sisyphus/kernel-modules-drbd9-un-def-9.2.12-alt1: build SKIPPED
2026-Oct-04 07:46:02 :: [i586] #1000 kernel-modules-evdi-un-def.git sisyphus/kernel-modules-evdi-un-def-1.14.1-alt1: build start
2026-Oct-04 07:46:15 :: [aarch64] #600 kernel-modules-dm-secdel-un-def.git sisyphus/kernel-modules-dm-secdel-un-def-1.0.9-alt1: build OK (cached)
2026-Oct-04 07:46:15 :: [aarch64] #700 kernel-modules-drbd9-un-def.git sisyphus/kernel-modules-drbd9-un-def-9.2.12-alt1: build start
2026-Oct-04 07:46:19 :: [x86_64] #600 kernel-modules-dm-secdel-un-def.git sisyphus/kernel-modules-dm-secdel-un-def-1.0.9-alt1: build OK (cached)
2026-Oct-04 07:46:19 :: [x86_64] #700 kernel-modules-drbd9-un-def.git sisyphus/kernel-modules-drbd9-un-def-9.2.12-alt1: build start
2026-Oct-04 07:46:23 :: [armh] #400 kernel-modules-anbox-un-def.git sisyphus/kernel-modules-anbox-un-def-14-alt2.gae26ba2: build OK (cached)
2026-Oct-04 07:46:24 :: [armh] #500 kernel-modules-bcmwl-un-def.git sisyphus/kernel-modules-bcmwl-un-def-6.30.223.271-alt15: build start
2026-Oct-04 07:46:27 :: [i586] #1000 kernel-modules-evdi-un-def.git sisyphus/kernel-modules-evdi-un-def-1.14.1-alt1: build OK (cached)
2026-Oct-04 07:46:27 :: [i586] #1100 kernel-modules-i40e-un-def.git sisyphus/kernel-modules-i40e-un-def-2.22.20-alt1: build start
2026-Oct-04 07:46:35 :: [aarch64] #700 kernel-modules-drbd9-un-def.git sisyphus/kernel-modules-drbd9-un-def-9.2.12-alt1: build OK (cached)
2026-Oct-04 07:46:35 :: [aarch64] #1000 kernel-modules-evdi-un-def.git sisyphus/kernel-modules-evdi-un-def-1.14.1-alt1: build start
2026-Oct-04 07:46:40 :: [x86_64] #700 kernel-modules-drbd9-un-def.git sisyphus/kernel-modules-drbd9-un-def-9.2.12-alt1: build OK (cached)
2026-Oct-04 07:46:41 :: [x86_64] #1000 kernel-modules-evdi-un-def.git sisyphus/kernel-modules-evdi-un-def-1.14.1-alt1: build start
2026-Oct-04 07:46:55 :: [aarch64] #1000 kernel-modules-evdi-un-def.git sisyphus/kernel-modules-evdi-un-def-1.14.1-alt1: build OK (cached)
2026-Oct-04 07:46:55 :: [aarch64] #1100 kernel-modules-i40e-un-def.git sisyphus/kernel-modules-i40e-un-def-2.22.20-alt1: build start
2026-Oct-04 07:46:57 :: [i586] #1100 kernel-modules-i40e-un-def.git sisyphus/kernel-modules-i40e-un-def-2.22.20-alt1: build SKIPPED
2026-Oct-04 07:46:57 :: [i586] #1200 kernel-modules-iavf-un-def.git sisyphus/kernel-modules-iavf-un-def-4.8.3-alt1: build start
2026-Oct-04 07:47:00 :: [armh] #500 kernel-modules-bcmwl-un-def.git sisyphus/kernel-modules-bcmwl-un-def-6.30.223.271-alt15: build SKIPPED
2026-Oct-04 07:47:00 :: [armh] #600 kernel-modules-dm-secdel-un-def.git sisyphus/kernel-modules-dm-secdel-un-def-1.0.9-alt1: build start
2026-Oct-04 07:47:02 :: [x86_64] #1000 kernel-modules-evdi-un-def.git sisyphus/kernel-modules-evdi-un-def-1.14.1-alt1: build OK (cached)
2026-Oct-04 07:47:02 :: [x86_64] #1100 kernel-modules-i40e-un-def.git sisyphus/kernel-modules-i40e-un-def-2.22.20-alt1: build start
2026-Oct-04 07:47:15 :: [aarch64] #1100 kernel-modules-i40e-un-def.git sisyphus/kernel-modules-i40e-un-def-2.22.20-alt1: build OK (cached)
2026-Oct-04 07:47:15 :: [aarch64] #1200 kernel-modules-iavf-un-def.git sisyphus/kernel-modules-iavf-un-def-4.8.3-alt1: build start
2026-Oct-04 07:47:16 :: [i586] #1200 kernel-modules-iavf-un-def.git sisyphus/kernel-modules-iavf-un-def-4.8.3-alt1: build SKIPPED
2026-Oct-04 07:47:16 :: [i586] #1300 kernel-modules-ipt-ratelimit-un-def.git sisyphus/kernel-modules-ipt-ratelimit-un-def-0.3.3-alt1: build start
2026-Oct-04 07:47:23 :: [x86_64] #1100 kernel-modules-i40e-un-def.git sisyphus/kernel-modules-i40e-un-def-2.22.20-alt1: build OK (cached)
2026-Oct-04 07:47:23 :: [x86_64] #1200 kernel-modules-iavf-un-def.git sisyphus/kernel-modules-iavf-un-def-4.8.3-alt1: build start
2026-Oct-04 07:47:27 :: [i586] #1300 kernel-modules-ipt-ratelimit-un-def.git sisyphus/kernel-modules-ipt-ratelimit-un-def-0.3.3-alt1: build OK (cached)
2026-Oct-04 07:47:27 :: [i586] #1400 kernel-modules-ipt_netflow-un-def.git sisyphus/kernel-modules-ipt_netflow-un-def-2.6-alt1: build start
2026-Oct-04 07:47:30 :: [armh] #600 kernel-modules-dm-secdel-un-def.git sisyphus/kernel-modules-dm-secdel-un-def-1.0.9-alt1: build OK (cached)
2026-Oct-04 07:47:30 :: [armh] #700 kernel-modules-drbd9-un-def.git sisyphus/kernel-modules-drbd9-un-def-9.2.12-alt1: build start
2026-Oct-04 07:47:34 :: [aarch64] #1200 kernel-modules-iavf-un-def.git sisyphus/kernel-modules-iavf-un-def-4.8.3-alt1: build OK (cached)
2026-Oct-04 07:47:35 :: [aarch64] #1300 kernel-modules-ipt-ratelimit-un-def.git sisyphus/kernel-modules-ipt-ratelimit-un-def-0.3.3-alt1: build start
2026-Oct-04 07:47:39 :: [i586] #1400 kernel-modules-ipt_netflow-un-def.git sisyphus/kernel-modules-ipt_netflow-un-def-2.6-alt1: build OK (cached)
2026-Oct-04 07:47:39 :: [i586] #1500 kernel-modules-ixgbe-un-def.git sisyphus/kernel-modules-ixgbe-un-def-5.20.10-alt1: build start
2026-Oct-04 07:47:44 :: [x86_64] #1200 kernel-modules-iavf-un-def.git sisyphus/kernel-modules-iavf-un-def-4.8.3-alt1: build OK (cached)
2026-Oct-04 07:47:44 :: [x86_64] #1300 kernel-modules-ipt-ratelimit-un-def.git sisyphus/kernel-modules-ipt-ratelimit-un-def-0.3.3-alt1: build start
2026-Oct-04 07:47:53 :: [i586] #1500 kernel-modules-ixgbe-un-def.git sisyphus/kernel-modules-ixgbe-un-def-5.20.10-alt1: build SKIPPED
2026-Oct-04 07:47:54 :: [i586] #1600 kernel-modules-lkrg-un-def.git sisyphus/kernel-modules-lkrg-un-def-0.9.8-alt3: build start
2026-Oct-04 07:47:54 :: [aarch64] #1300 kernel-modules-ipt-ratelimit-un-def.git sisyphus/kernel-modules-ipt-ratelimit-un-def-0.3.3-alt1: build OK (cached)
2026-Oct-04 07:47:54 :: [aarch64] #1400 kernel-modules-ipt_netflow-un-def.git sisyphus/kernel-modules-ipt_netflow-un-def-2.6-alt1: build start
2026-Oct-04 07:48:05 :: [x86_64] #1300 kernel-modules-ipt-ratelimit-un-def.git sisyphus/kernel-modules-ipt-ratelimit-un-def-0.3.3-alt1: build OK (cached)
2026-Oct-04 07:48:05 :: [x86_64] #1400 kernel-modules-ipt_netflow-un-def.git sisyphus/kernel-modules-ipt_netflow-un-def-2.6-alt1: build start
2026-Oct-04 07:48:06 :: [i586] #1600 kernel-modules-lkrg-un-def.git sisyphus/kernel-modules-lkrg-un-def-0.9.8-alt3: build OK (cached)
2026-Oct-04 07:48:06 :: [i586] #1700 kernel-modules-nvidia-un-def.git sisyphus/kernel-modules-nvidia-un-def-550.144.03-alt1: build start
2026-Oct-04 07:48:06 :: [armh] #700 kernel-modules-drbd9-un-def.git sisyphus/kernel-modules-drbd9-un-def-9.2.12-alt1: build SKIPPED
2026-Oct-04 07:48:06 :: [armh] #1000 kernel-modules-evdi-un-def.git sisyphus/kernel-modules-evdi-un-def-1.14.1-alt1: build start
2026-Oct-04 07:48:14 :: [aarch64] #1400 kernel-modules-ipt_netflow-un-def.git sisyphus/kernel-modules-ipt_netflow-un-def-2.6-alt1: build OK (cached)
2026-Oct-04 07:48:14 :: [aarch64] #1500 kernel-modules-ixgbe-un-def.git sisyphus/kernel-modules-ixgbe-un-def-5.20.10-alt1: build start
2026-Oct-04 07:48:18 :: [i586] #1700 kernel-modules-nvidia-un-def.git sisyphus/kernel-modules-nvidia-un-def-550.144.03-alt1: build OK (cached)
2026-Oct-04 07:48:18 :: [i586] #2000 kernel-modules-r8125-un-def.git sisyphus/kernel-modules-r8125-un-def-9.011.01-alt1: build start
2026-Oct-04 07:48:26 :: [x86_64] #1400 kernel-modules-ipt_netflow-un-def.git sisyphus/kernel-modules-ipt_netflow-un-def-2.6-alt1: build OK (cached)
2026-Oct-04 07:48:26 :: [x86_64] #1500 kernel-modules-ixgbe-un-def.git sisyphus/kernel-modules-ixgbe-un-def-5.20.10-alt1: build start
2026-Oct-04 07:48:30 :: [i586] #2000 kernel-modules-r8125-un-def.git sisyphus/kernel-modules-r8125-un-def-9.011.01-alt1: build OK (cached)
2026-Oct-04 07:48:30 :: [i586] #2100 kernel-modules-r8168-un-def.git sisyphus/kernel-modules-r8168-un-def-8.053.01-alt1.k: build start
2026-Oct-04 07:48:34 :: [aarch64] #1500 kernel-modules-ixgbe-un-def.git sisyphus/kernel-modules-ixgbe-un-def-5.20.10-alt1: build OK (cached)
2026-Oct-04 07:48:34 :: [aarch64] #1600 kernel-modules-lkrg-un-def.git sisyphus/kernel-modules-lkrg-un-def-0.9.8-alt3: build start
2026-Oct-04 07:48:36 :: [armh] #1000 kernel-modules-evdi-un-def.git sisyphus/kernel-modules-evdi-un-def-1.14.1-alt1: build OK (cached)
2026-Oct-04 07:48:36 :: [armh] #1100 kernel-modules-i40e-un-def.git sisyphus/kernel-modules-i40e-un-def-2.22.20-alt1: build start
2026-Oct-04 07:48:42 :: [i586] #2100 kernel-modules-r8168-un-def.git sisyphus/kernel-modules-r8168-un-def-8.053.01-alt1.k: build OK (cached)
2026-Oct-04 07:48:42 :: [i586] #3000 kernel-modules-rtw89-un-def.git sisyphus/kernel-modules-rtw89-un-def-0.0-alt4.git.4f3464d: build start
2026-Oct-04 07:48:48 :: [x86_64] #1500 kernel-modules-ixgbe-un-def.git sisyphus/kernel-modules-ixgbe-un-def-5.20.10-alt1: build OK (cached)
2026-Oct-04 07:48:48 :: [x86_64] #1600 kernel-modules-lkrg-un-def.git sisyphus/kernel-modules-lkrg-un-def-0.9.8-alt3: build start
2026-Oct-04 07:48:58 :: [aarch64] #1600 kernel-modules-lkrg-un-def.git sisyphus/kernel-modules-lkrg-un-def-0.9.8-alt3: build SKIPPED
2026-Oct-04 07:48:58 :: [aarch64] #1700 kernel-modules-nvidia-un-def.git sisyphus/kernel-modules-nvidia-un-def-550.144.03-alt1: build start
2026-Oct-04 07:49:09 :: [x86_64] #1600 kernel-modules-lkrg-un-def.git sisyphus/kernel-modules-lkrg-un-def-0.9.8-alt3: build OK (cached)
2026-Oct-04 07:49:09 :: [x86_64] #1700 kernel-modules-nvidia-un-def.git sisyphus/kernel-modules-nvidia-un-def-550.144.03-alt1: build start
2026-Oct-04 07:49:12 :: [armh] #1100 kernel-modules-i40e-un-def.git sisyphus/kernel-modules-i40e-un-def-2.22.20-alt1: build SKIPPED
2026-Oct-04 07:49:12 :: [armh] #1200 kernel-modules-iavf-un-def.git sisyphus/kernel-modules-iavf-un-def-4.8.3-alt1: build start
2026-Oct-04 07:49:19 :: [aarch64] #1700 kernel-modules-nvidia-un-def.git sisyphus/kernel-modules-nvidia-un-def-550.144.03-alt1: build OK (cached)
2026-Oct-04 07:49:20 :: [aarch64] #2000 kernel-modules-r8125-un-def.git sisyphus/kernel-modules-r8125-un-def-9.011.01-alt1: build start
2026-Oct-04 07:49:22 :: [i586] #3000 kernel-modules-rtw89-un-def.git sisyphus/kernel-modules-rtw89-un-def-0.0-alt4.git.4f3464d: build OK
2026-Oct-04 07:49:22 :: [i586] #3100 kernel-modules-sysdig-un-def.git sisyphus/kernel-modules-sysdig-un-def-7.3.0-alt1: build start
2026-Oct-04 07:49:32 :: [x86_64] #1700 kernel-modules-nvidia-un-def.git sisyphus/kernel-modules-nvidia-un-def-550.144.03-alt1: build OK (cached)
2026-Oct-04 07:49:32 :: [x86_64] #2000 kernel-modules-r8125-un-def.git sisyphus/kernel-modules-r8125-un-def-9.011.01-alt1: build start
2026-Oct-04 07:49:36 :: [i586] #3100 kernel-modules-sysdig-un-def.git sisyphus/kernel-modules-sysdig-un-def-7.3.0-alt1: build SKIPPED
2026-Oct-04 07:49:37 :: [i586] #3200 kernel-modules-v4l2loopback-un-def.git sisyphus/kernel-modules-v4l2loopback-un-def-0.12.7-alt1.g5e9dd41: build start
2026-Oct-04 07:49:43 :: [aarch64] #2000 kernel-modules-r8125-un-def.git sisyphus/kernel-modules-r8125-un-def-9.011.01-alt1: build SKIPPED
2026-Oct-04 07:49:44 :: [aarch64] #2100 kernel-modules-r8168-un-def.git sisyphus/kernel-modules-r8168-un-def-8.053.01-alt1.k: build start
2026-Oct-04 07:49:45 :: [x86_64] #2000 kernel-modules-r8125-un-def.git sisyphus/kernel-modules-r8125-un-def-9.011.01-alt1: build OK (cached)
2026-Oct-04 07:49:45 :: [x86_64] #2100 kernel-modules-r8168-un-def.git sisyphus/kernel-modules-r8168-un-def-8.053.01-alt1.k: build start
2026-Oct-04 07:49:48 :: [armh] #1200 kernel-modules-iavf-un-def.git sisyphus/kernel-modules-iavf-un-def-4.8.3-alt1: build SKIPPED
2026-Oct-04 07:49:48 :: [armh] #1300 kernel-modules-ipt-ratelimit-un-def.git sisyphus/kernel-modules-ipt-ratelimit-un-def-0.3.3-alt1: build start
2026-Oct-04 07:49:58 :: [x86_64] #2100 kernel-modules-r8168-un-def.git sisyphus/kernel-modules-r8168-un-def-8.053.01-alt1.k: build OK (cached)
2026-Oct-04 07:49:58 :: [x86_64] #3000 kernel-modules-rtw89-un-def.git sisyphus/kernel-modules-rtw89-un-def-0.0-alt4.git.4f3464d: build start
2026-Oct-04 07:50:03 :: [aarch64] #2100 kernel-modules-r8168-un-def.git sisyphus/kernel-modules-r8168-un-def-8.053.01-alt1.k: build OK (cached)
2026-Oct-04 07:50:04 :: [aarch64] #3000 kernel-modules-rtw89-un-def.git sisyphus/kernel-modules-rtw89-un-def-0.0-alt4.git.4f3464d: build start
2026-Oct-04 07:50:05 :: [i586] #3200 kernel-modules-v4l2loopback-un-def.git sisyphus/kernel-modules-v4l2loopback-un-def-0.12.7-alt1.g5e9dd41: build OK
2026-Oct-04 07:50:05 :: [i586] #3300 kernel-modules-vhba-un-def.git sisyphus/kernel-modules-vhba-un-def-20211218-alt1.k: build start
2026-Oct-04 07:50:18 :: [armh] #1300 kernel-modules-ipt-ratelimit-un-def.git sisyphus/kernel-modules-ipt-ratelimit-un-def-0.3.3-alt1: build OK (cached)
2026-Oct-04 07:50:18 :: [armh] #1400 kernel-modules-ipt_netflow-un-def.git sisyphus/kernel-modules-ipt_netflow-un-def-2.6-alt1: build start
2026-Oct-04 07:50:35 :: [i586] #3300 kernel-modules-vhba-un-def.git sisyphus/kernel-modules-vhba-un-def-20211218-alt1.k: build OK
2026-Oct-04 07:50:35 :: [i586] #3400 kernel-modules-virtualbox-addition-un-def.git sisyphus/kernel-modules-virtualbox-addition-p10-un-def-7.1.16-alt1: build start
2026-Oct-04 07:50:38 :: [x86_64] #3000 kernel-modules-rtw89-un-def.git sisyphus/kernel-modules-rtw89-un-def-0.0-alt4.git.4f3464d: build OK
2026-Oct-04 07:50:39 :: [x86_64] #3100 kernel-modules-sysdig-un-def.git sisyphus/kernel-modules-sysdig-un-def-7.3.0-alt1: build start
2026-Oct-04 07:50:54 :: [armh] #1400 kernel-modules-ipt_netflow-un-def.git sisyphus/kernel-modules-ipt_netflow-un-def-2.6-alt1: build SKIPPED
2026-Oct-04 07:50:54 :: [armh] #1500 kernel-modules-ixgbe-un-def.git sisyphus/kernel-modules-ixgbe-un-def-5.20.10-alt1: build start
2026-Oct-04 07:50:56 :: [aarch64] #3000 kernel-modules-rtw89-un-def.git sisyphus/kernel-modules-rtw89-un-def-0.0-alt4.git.4f3464d: build OK
2026-Oct-04 07:50:56 :: [aarch64] #3100 kernel-modules-sysdig-un-def.git sisyphus/kernel-modules-sysdig-un-def-7.3.0-alt1: build start
2026-Oct-04 07:51:12 :: [x86_64] #3100 kernel-modules-sysdig-un-def.git sisyphus/kernel-modules-sysdig-un-def-7.3.0-alt1: build OK
2026-Oct-04 07:51:12 :: [x86_64] #3200 kernel-modules-v4l2loopback-un-def.git sisyphus/kernel-modules-v4l2loopback-un-def-0.12.7-alt1.g5e9dd41: build start
2026-Oct-04 07:51:26 :: [i586] #3400 kernel-modules-virtualbox-addition-un-def.git sisyphus/kernel-modules-virtualbox-addition-p10-un-def-7.1.16-alt1: build OK
2026-Oct-04 07:51:26 :: [i586] #3500 kernel-modules-virtualbox-un-def.git sisyphus/kernel-modules-virtualbox-p10-un-def-7.1.16-alt1: build start
2026-Oct-04 07:51:30 :: [armh] #1500 kernel-modules-ixgbe-un-def.git sisyphus/kernel-modules-ixgbe-un-def-5.20.10-alt1: build SKIPPED
2026-Oct-04 07:51:30 :: [armh] #1600 kernel-modules-lkrg-un-def.git sisyphus/kernel-modules-lkrg-un-def-0.9.8-alt3: build start
2026-Oct-04 07:51:41 :: [x86_64] #3200 kernel-modules-v4l2loopback-un-def.git sisyphus/kernel-modules-v4l2loopback-un-def-0.12.7-alt1.g5e9dd41: build OK
2026-Oct-04 07:51:41 :: [x86_64] #3300 kernel-modules-vhba-un-def.git sisyphus/kernel-modules-vhba-un-def-20211218-alt1.k: build start
2026-Oct-04 07:51:42 :: [i586] #3500 kernel-modules-virtualbox-un-def.git sisyphus/kernel-modules-virtualbox-p10-un-def-7.1.16-alt1: build SKIPPED
2026-Oct-04 07:51:42 :: [i586] #3600 kernel-modules-xtables-addons-un-def.git sisyphus/kernel-modules-xtables-addons-un-def-3.23-alt1: build start
2026-Oct-04 07:51:44 :: [aarch64] #3100 kernel-modules-sysdig-un-def.git sisyphus/kernel-modules-sysdig-un-def-7.3.0-alt1: build OK
2026-Oct-04 07:51:44 :: [aarch64] #3200 kernel-modules-v4l2loopback-un-def.git sisyphus/kernel-modules-v4l2loopback-un-def-0.12.7-alt1.g5e9dd41: build start
2026-Oct-04 07:52:06 :: [armh] #1600 kernel-modules-lkrg-un-def.git sisyphus/kernel-modules-lkrg-un-def-0.9.8-alt3: build SKIPPED
2026-Oct-04 07:52:06 :: [armh] #1700 kernel-modules-nvidia-un-def.git sisyphus/kernel-modules-nvidia-un-def-550.144.03-alt1: build start
2026-Oct-04 07:52:10 :: [x86_64] #3300 kernel-modules-vhba-un-def.git sisyphus/kernel-modules-vhba-un-def-20211218-alt1.k: build OK
2026-Oct-04 07:52:10 :: [x86_64] #3400 kernel-modules-virtualbox-addition-un-def.git sisyphus/kernel-modules-virtualbox-addition-p10-un-def-7.1.16-alt1: build start
2026-Oct-04 07:52:26 :: [aarch64] #3200 kernel-modules-v4l2loopback-un-def.git sisyphus/kernel-modules-v4l2loopback-un-def-0.12.7-alt1.g5e9dd41: build OK
2026-Oct-04 07:52:26 :: [aarch64] #3300 kernel-modules-vhba-un-def.git sisyphus/kernel-modules-vhba-un-def-20211218-alt1.k: build start
2026-Oct-04 07:52:32 :: [i586] #3600 kernel-modules-xtables-addons-un-def.git sisyphus/kernel-modules-xtables-addons-un-def-3.23-alt1: build OK
2026-Oct-04 07:52:32 :: [i586] #3700 kernel-modules-zfs-un-def.git p10/kernel-modules-zfs-un-def-2.1.16-alt1: build start
2026-Oct-04 07:52:47 :: [i586] #3700 kernel-modules-zfs-un-def.git p10/kernel-modules-zfs-un-def-2.1.16-alt1: build SKIPPED
2026-Oct-04 07:52:51 :: [armh] #1700 kernel-modules-nvidia-un-def.git sisyphus/kernel-modules-nvidia-un-def-550.144.03-alt1: build SKIPPED
2026-Oct-04 07:52:51 :: [armh] #2000 kernel-modules-r8125-un-def.git sisyphus/kernel-modules-r8125-un-def-9.011.01-alt1: build start
2026-Oct-04 07:52:59 :: [x86_64] #3400 kernel-modules-virtualbox-addition-un-def.git sisyphus/kernel-modules-virtualbox-addition-p10-un-def-7.1.16-alt1: build OK
2026-Oct-04 07:52:59 :: [x86_64] #3500 kernel-modules-virtualbox-un-def.git sisyphus/kernel-modules-virtualbox-p10-un-def-7.1.16-alt1: build start
2026-Oct-04 07:53:07 :: [aarch64] #3300 kernel-modules-vhba-un-def.git sisyphus/kernel-modules-vhba-un-def-20211218-alt1.k: build OK
2026-Oct-04 07:53:07 :: [aarch64] #3400 kernel-modules-virtualbox-addition-un-def.git sisyphus/kernel-modules-virtualbox-addition-p10-un-def-7.1.16-alt1: build start
2026-Oct-04 07:53:27 :: [armh] #2000 kernel-modules-r8125-un-def.git sisyphus/kernel-modules-r8125-un-def-9.011.01-alt1: build SKIPPED
2026-Oct-04 07:53:27 :: [armh] #2100 kernel-modules-r8168-un-def.git sisyphus/kernel-modules-r8168-un-def-8.053.01-alt1.k: build start
2026-Oct-04 07:53:30 :: [aarch64] #3400 kernel-modules-virtualbox-addition-un-def.git sisyphus/kernel-modules-virtualbox-addition-p10-un-def-7.1.16-alt1: build SKIPPED
2026-Oct-04 07:53:31 :: [aarch64] #3500 kernel-modules-virtualbox-un-def.git sisyphus/kernel-modules-virtualbox-p10-un-def-7.1.16-alt1: build start
2026-Oct-04 07:53:44 :: [x86_64] #3500 kernel-modules-virtualbox-un-def.git sisyphus/kernel-modules-virtualbox-p10-un-def-7.1.16-alt1: build OK
2026-Oct-04 07:53:44 :: [x86_64] #3600 kernel-modules-xtables-addons-un-def.git sisyphus/kernel-modules-xtables-addons-un-def-3.23-alt1: build start
2026-Oct-04 07:53:54 :: [aarch64] #3500 kernel-modules-virtualbox-un-def.git sisyphus/kernel-modules-virtualbox-p10-un-def-7.1.16-alt1: build SKIPPED
2026-Oct-04 07:53:55 :: [aarch64] #3600 kernel-modules-xtables-addons-un-def.git sisyphus/kernel-modules-xtables-addons-un-def-3.23-alt1: build start
2026-Oct-04 07:53:57 :: [armh] #2100 kernel-modules-r8168-un-def.git sisyphus/kernel-modules-r8168-un-def-8.053.01-alt1.k: build OK (cached)
2026-Oct-04 07:53:57 :: [armh] #3000 kernel-modules-rtw89-un-def.git sisyphus/kernel-modules-rtw89-un-def-0.0-alt4.git.4f3464d: build start
2026-Oct-04 07:54:32 :: [x86_64] #3600 kernel-modules-xtables-addons-un-def.git sisyphus/kernel-modules-xtables-addons-un-def-3.23-alt1: build OK
2026-Oct-04 07:54:32 :: [x86_64] #3700 kernel-modules-zfs-un-def.git p10/kernel-modules-zfs-un-def-2.1.16-alt1: build start
2026-Oct-04 07:55:10 :: [aarch64] #3600 kernel-modules-xtables-addons-un-def.git sisyphus/kernel-modules-xtables-addons-un-def-3.23-alt1: build OK
2026-Oct-04 07:55:11 :: [aarch64] #3700 kernel-modules-zfs-un-def.git p10/kernel-modules-zfs-un-def-2.1.16-alt1: build start
2026-Oct-04 07:55:12 :: [armh] #3000 kernel-modules-rtw89-un-def.git sisyphus/kernel-modules-rtw89-un-def-0.0-alt4.git.4f3464d: build OK
2026-Oct-04 07:55:12 :: [armh] #3100 kernel-modules-sysdig-un-def.git sisyphus/kernel-modules-sysdig-un-def-7.3.0-alt1: build start
2026-Oct-04 07:55:46 :: [armh] #3100 kernel-modules-sysdig-un-def.git sisyphus/kernel-modules-sysdig-un-def-7.3.0-alt1: build SKIPPED
2026-Oct-04 07:55:47 :: [armh] #3200 kernel-modules-v4l2loopback-un-def.git sisyphus/kernel-modules-v4l2loopback-un-def-0.12.7-alt1.g5e9dd41: build start
2026-Oct-04 07:56:45 :: [armh] #3200 kernel-modules-v4l2loopback-un-def.git sisyphus/kernel-modules-v4l2loopback-un-def-0.12.7-alt1.g5e9dd41: build OK
2026-Oct-04 07:56:45 :: [armh] #3300 kernel-modules-vhba-un-def.git sisyphus/kernel-modules-vhba-un-def-20211218-alt1.k: build start
2026-Oct-04 07:57:43 :: [armh] #3300 kernel-modules-vhba-un-def.git sisyphus/kernel-modules-vhba-un-def-20211218-alt1.k: build OK
2026-Oct-04 07:57:43 :: [armh] #3400 kernel-modules-virtualbox-addition-un-def.git sisyphus/kernel-modules-virtualbox-addition-p10-un-def-7.1.16-alt1: build start
2026-Oct-04 07:58:11 :: [x86_64] #3700 kernel-modules-zfs-un-def.git p10/kernel-modules-zfs-un-def-2.1.16-alt1: build OK
2026-Oct-04 07:58:18 :: [armh] #3400 kernel-modules-virtualbox-addition-un-def.git sisyphus/kernel-modules-virtualbox-addition-p10-un-def-7.1.16-alt1: build SKIPPED
2026-Oct-04 07:58:18 :: [armh] #3500 kernel-modules-virtualbox-un-def.git sisyphus/kernel-modules-virtualbox-p10-un-def-7.1.16-alt1: build start
2026-Oct-04 07:58:53 :: [armh] #3500 kernel-modules-virtualbox-un-def.git sisyphus/kernel-modules-virtualbox-p10-un-def-7.1.16-alt1: build SKIPPED
2026-Oct-04 07:58:53 :: [armh] #3600 kernel-modules-xtables-addons-un-def.git sisyphus/kernel-modules-xtables-addons-un-def-3.23-alt1: build start
2026-Oct-04 08:00:37 :: [armh] #3600 kernel-modules-xtables-addons-un-def.git sisyphus/kernel-modules-xtables-addons-un-def-3.23-alt1: build OK
2026-Oct-04 08:00:37 :: [armh] #3700 kernel-modules-zfs-un-def.git p10/kernel-modules-zfs-un-def-2.1.16-alt1: build start
2026-Oct-04 08:01:16 :: [aarch64] #3700 kernel-modules-zfs-un-def.git p10/kernel-modules-zfs-un-def-2.1.16-alt1: build OK
2026-Oct-04 08:08:26 :: [armh] #3700 kernel-modules-zfs-un-def.git p10/kernel-modules-zfs-un-def-2.1.16-alt1: build OK
2026-Oct-04 08:10:21 :: 100: build check OK
x86_64/srpm/kernel-modules-LiME-un-def-1.9.1-alt1.393661.1.src.rpm: license not found in '/usr/share/license' directory: 3-clause
x86_64/rpms/kernel-modules-LiME-un-def-1.9.1-alt1.393661.1.x86_64.rpm: license not found in '/usr/share/license' directory: 3-clause
x86_64/rpms/kernel-modules-LiME-un-def-debuginfo-1.9.1-alt1.393661.1.x86_64.rpm: license not found in '/usr/share/license' directory: 3-clause
i586/srpm/kernel-modules-LiME-un-def-1.9.1-alt1.393661.1.src.rpm: license not found in '/usr/share/license' directory: 3-clause
i586/rpms/kernel-modules-LiME-un-def-debuginfo-1.9.1-alt1.393661.1.i586.rpm: license not found in '/usr/share/license' directory: 3-clause
i586/rpms/kernel-modules-LiME-un-def-1.9.1-alt1.393661.1.i586.rpm: license not found in '/usr/share/license' directory: 3-clause
aarch64/srpm/kernel-modules-LiME-un-def-1.9.1-alt1.393661.1.src.rpm: license not found in '/usr/share/license' directory: 3-clause
aarch64/rpms/kernel-modules-LiME-un-def-debuginfo-1.9.1-alt1.393661.1.aarch64.rpm: license not found in '/usr/share/license' directory: 3-clause
aarch64/rpms/kernel-modules-LiME-un-def-1.9.1-alt1.393661.1.aarch64.rpm: license not found in '/usr/share/license' directory: 3-clause
armh/srpm/kernel-modules-LiME-un-def-1.9.1-alt1.393661.1.src.rpm: license not found in '/usr/share/license' directory: 3-clause
armh/rpms/kernel-modules-LiME-un-def-debuginfo-1.9.1-alt1.393661.1.armh.rpm: license not found in '/usr/share/license' directory: 3-clause
armh/rpms/kernel-modules-LiME-un-def-1.9.1-alt1.393661.1.armh.rpm: license not found in '/usr/share/license' directory: 3-clause
2026-Oct-04 08:10:26 :: 200: build check OK
2026-Oct-04 08:10:30 :: 300: build check OK
x86_64/srpm/kernel-modules-anbox-un-def-14-alt2.gae26ba2.393661.1.src.rpm: bad symbols in the license tag: /
x86_64/rpms/kernel-modules-anbox-un-def-14-alt2.gae26ba2.393661.1.x86_64.rpm: bad symbols in the license tag: /
x86_64/rpms/kernel-modules-anbox-un-def-debuginfo-14-alt2.gae26ba2.393661.1.x86_64.rpm: bad symbols in the license tag: /
i586/srpm/kernel-modules-anbox-un-def-14-alt2.gae26ba2.393661.1.src.rpm: bad symbols in the license tag: /
i586/rpms/kernel-modules-anbox-un-def-debuginfo-14-alt2.gae26ba2.393661.1.i586.rpm: bad symbols in the license tag: /
i586/rpms/kernel-modules-anbox-un-def-14-alt2.gae26ba2.393661.1.i586.rpm: bad symbols in the license tag: /
aarch64/srpm/kernel-modules-anbox-un-def-14-alt2.gae26ba2.393661.1.src.rpm: bad symbols in the license tag: /
aarch64/rpms/kernel-modules-anbox-un-def-14-alt2.gae26ba2.393661.1.aarch64.rpm: bad symbols in the license tag: /
aarch64/rpms/kernel-modules-anbox-un-def-debuginfo-14-alt2.gae26ba2.393661.1.aarch64.rpm: bad symbols in the license tag: /
armh/srpm/kernel-modules-anbox-un-def-14-alt2.gae26ba2.393661.1.src.rpm: bad symbols in the license tag: /
armh/rpms/kernel-modules-anbox-un-def-14-alt2.gae26ba2.393661.1.armh.rpm: bad symbols in the license tag: /
armh/rpms/kernel-modules-anbox-un-def-debuginfo-14-alt2.gae26ba2.393661.1.armh.rpm: bad symbols in the license tag: /
2026-Oct-04 08:10:35 :: 400: build check OK
x86_64/srpm/kernel-modules-bcmwl-un-def-6.30.223.271-alt15.393661.1.src.rpm: license not found in '/usr/share/license' directory: Proprietary
x86_64/rpms/kernel-modules-bcmwl-un-def-debuginfo-6.30.223.271-alt15.393661.1.x86_64.rpm: license not found in '/usr/share/license' directory: Proprietary
x86_64/rpms/kernel-modules-bcmwl-un-def-6.30.223.271-alt15.393661.1.x86_64.rpm: license not found in '/usr/share/license' directory: Proprietary
2026-Oct-04 08:10:36 :: 500: build check OK
2026-Oct-04 08:10:41 :: 600: build check OK
2026-Oct-04 08:10:44 :: 700: build check OK
2026-Oct-04 08:10:49 :: 1000: build check OK
2026-Oct-04 08:10:51 :: 1100: build check OK
2026-Oct-04 08:10:54 :: 1200: build check OK
2026-Oct-04 08:10:59 :: 1300: build check OK
x86_64/srpm/kernel-modules-ipt_netflow-un-def-2.6-alt1.393661.1.src.rpm: The use of such a license name is ambiguous: GPL
x86_64/rpms/kernel-modules-ipt_netflow-un-def-2.6-alt1.393661.1.x86_64.rpm: The use of such a license name is ambiguous: GPL
x86_64/rpms/kernel-modules-ipt_netflow-un-def-debuginfo-2.6-alt1.393661.1.x86_64.rpm: The use of such a license name is ambiguous: GPL
i586/srpm/kernel-modules-ipt_netflow-un-def-2.6-alt1.393661.1.src.rpm: The use of such a license name is ambiguous: GPL
i586/rpms/kernel-modules-ipt_netflow-un-def-2.6-alt1.393661.1.i586.rpm: The use of such a license name is ambiguous: GPL
i586/rpms/kernel-modules-ipt_netflow-un-def-debuginfo-2.6-alt1.393661.1.i586.rpm: The use of such a license name is ambiguous: GPL
aarch64/srpm/kernel-modules-ipt_netflow-un-def-2.6-alt1.393661.1.src.rpm: The use of such a license name is ambiguous: GPL
aarch64/rpms/kernel-modules-ipt_netflow-un-def-debuginfo-2.6-alt1.393661.1.aarch64.rpm: The use of such a license name is ambiguous: GPL
aarch64/rpms/kernel-modules-ipt_netflow-un-def-2.6-alt1.393661.1.aarch64.rpm: The use of such a license name is ambiguous: GPL
2026-Oct-04 08:11:02 :: 1400: build check OK
2026-Oct-04 08:11:05 :: 1500: build check OK
2026-Oct-04 08:11:08 :: 1600: build check OK
x86_64/srpm/kernel-modules-nvidia-un-def-550.144.03-alt1.393661.1.src.rpm: license not found in '/usr/share/license' directory: Proprietary
x86_64/rpms/kernel-modules-nvidia-un-def-550.144.03-alt1.393661.1.x86_64.rpm: license not found in '/usr/share/license' directory: Proprietary
i586/srpm/kernel-modules-nvidia-un-def-550.144.03-alt1.393661.1.src.rpm: license not found in '/usr/share/license' directory: Proprietary
i586/rpms/kernel-modules-nvidia-un-def-550.144.03-alt1.393661.1.i586.rpm: license not found in '/usr/share/license' directory: Proprietary
aarch64/srpm/kernel-modules-nvidia-un-def-550.144.03-alt1.393661.1.src.rpm: license not found in '/usr/share/license' directory: Proprietary
aarch64/rpms/kernel-modules-nvidia-un-def-550.144.03-alt1.393661.1.aarch64.rpm: license not found in '/usr/share/license' directory: Proprietary
2026-Oct-04 08:11:12 :: 1700: build check OK
x86_64/srpm/kernel-modules-r8125-un-def-9.011.01-alt1.393661.1.src.rpm: The use of such a license name is ambiguous: GPL
x86_64/rpms/kernel-modules-r8125-un-def-debuginfo-9.011.01-alt1.393661.1.x86_64.rpm: The use of such a license name is ambiguous: GPL
x86_64/rpms/kernel-modules-r8125-un-def-9.011.01-alt1.393661.1.x86_64.rpm: The use of such a license name is ambiguous: GPL
i586/srpm/kernel-modules-r8125-un-def-9.011.01-alt1.393661.1.src.rpm: The use of such a license name is ambiguous: GPL
i586/rpms/kernel-modules-r8125-un-def-debuginfo-9.011.01-alt1.393661.1.i586.rpm: The use of such a license name is ambiguous: GPL
i586/rpms/kernel-modules-r8125-un-def-9.011.01-alt1.393661.1.i586.rpm: The use of such a license name is ambiguous: GPL
2026-Oct-04 08:11:14 :: 2000: build check OK
2026-Oct-04 08:11:19 :: 2100: build check OK
2026-Oct-04 08:11:24 :: 3000: build check OK
2026-Oct-04 08:11:27 :: 3100: build check OK
2026-Oct-04 08:11:32 :: 3200: build check OK
2026-Oct-04 08:11:37 :: 3300: build check OK
2026-Oct-04 08:11:40 :: 3400: build check OK
2026-Oct-04 08:11:41 :: 3500: build check OK
2026-Oct-04 08:11:46 :: 3600: build check OK
2026-Oct-04 08:11:49 :: 3700: build check OK
2026-Oct-04 08:11:52 :: build check OK
2026-Oct-04 08:12:27 :: #100: kernel-image.git kernel-image-un-def-6.1.189-alt1: version check OK
2026-Oct-04 08:12:32 :: #200: kernel-modules-LiME-un-def.git sisyphus/kernel-modules-LiME-un-def-1.9.1-alt1: version check OK
2026-Oct-04 08:12:36 :: #300: kernel-modules-accel-ppp-un-def.git sisyphus/kernel-modules-accel-ppp-un-def-1.12.0-alt3: version check OK
2026-Oct-04 08:12:40 :: #400: kernel-modules-anbox-un-def.git sisyphus/kernel-modules-anbox-un-def-14-alt2.gae26ba2: version check OK
2026-Oct-04 08:12:43 :: #500: kernel-modules-bcmwl-un-def.git sisyphus/kernel-modules-bcmwl-un-def-6.30.223.271-alt15: version check OK
2026-Oct-04 08:12:47 :: #600: kernel-modules-dm-secdel-un-def.git sisyphus/kernel-modules-dm-secdel-un-def-1.0.9-alt1: version check OK
2026-Oct-04 08:12:50 :: #700: kernel-modules-drbd9-un-def.git sisyphus/kernel-modules-drbd9-un-def-9.2.12-alt1: version check OK
2026-Oct-04 08:12:55 :: #1000: kernel-modules-evdi-un-def.git sisyphus/kernel-modules-evdi-un-def-1.14.1-alt1: version check OK
2026-Oct-04 08:12:58 :: #1100: kernel-modules-i40e-un-def.git sisyphus/kernel-modules-i40e-un-def-2.22.20-alt1: version check OK
2026-Oct-04 08:13:00 :: #1200: kernel-modules-iavf-un-def.git sisyphus/kernel-modules-iavf-un-def-4.8.3-alt1: version check OK
2026-Oct-04 08:13:05 :: #1300: kernel-modules-ipt-ratelimit-un-def.git sisyphus/kernel-modules-ipt-ratelimit-un-def-0.3.3-alt1: version check OK
2026-Oct-04 08:13:09 :: #1400: kernel-modules-ipt_netflow-un-def.git sisyphus/kernel-modules-ipt_netflow-un-def-2.6-alt1: version check OK
2026-Oct-04 08:13:12 :: #1500: kernel-modules-ixgbe-un-def.git sisyphus/kernel-modules-ixgbe-un-def-5.20.10-alt1: version check OK
2026-Oct-04 08:13:15 :: #1600: kernel-modules-lkrg-un-def.git sisyphus/kernel-modules-lkrg-un-def-0.9.8-alt3: version check OK
2026-Oct-04 08:13:18 :: #1700: kernel-modules-nvidia-un-def.git sisyphus/kernel-modules-nvidia-un-def-550.144.03-alt1: version check OK
2026-Oct-04 08:13:20 :: #2000: kernel-modules-r8125-un-def.git sisyphus/kernel-modules-r8125-un-def-9.011.01-alt1: version check OK
2026-Oct-04 08:13:25 :: #2100: kernel-modules-r8168-un-def.git sisyphus/kernel-modules-r8168-un-def-8.053.01-alt1.k: version check OK
2026-Oct-04 08:13:30 :: #3000: kernel-modules-rtw89-un-def.git sisyphus/kernel-modules-rtw89-un-def-0.0-alt4.git.4f3464d: version check OK
2026-Oct-04 08:13:33 :: #3100: kernel-modules-sysdig-un-def.git sisyphus/kernel-modules-sysdig-un-def-7.3.0-alt1: version check OK
2026-Oct-04 08:13:38 :: #3200: kernel-modules-v4l2loopback-un-def.git sisyphus/kernel-modules-v4l2loopback-un-def-0.12.7-alt1.g5e9dd41: version check OK
2026-Oct-04 08:13:43 :: #3300: kernel-modules-vhba-un-def.git sisyphus/kernel-modules-vhba-un-def-20211218-alt1.k: version check OK
2026-Oct-04 08:13:46 :: #3400: kernel-modules-virtualbox-addition-un-def.git sisyphus/kernel-modules-virtualbox-addition-p10-un-def-7.1.16-alt1: version check OK
2026-Oct-04 08:13:48 :: #3500: kernel-modules-virtualbox-un-def.git sisyphus/kernel-modules-virtualbox-p10-un-def-7.1.16-alt1: version check OK
2026-Oct-04 08:13:53 :: #3600: kernel-modules-xtables-addons-un-def.git sisyphus/kernel-modules-xtables-addons-un-def-3.23-alt1: version check OK
2026-Oct-04 08:13:57 :: #3700: kernel-modules-zfs-un-def.git p10/kernel-modules-zfs-un-def-2.1.16-alt1: version check OK
2026-Oct-04 08:13:57 :: build version check OK
warning (#100): kernel-image-un-def-checkinstall-6.1.189-alt1.x86_64.rpm should be .noarch.rpm
2026-Oct-04 08:21:41 :: noarch check OK
2026-Oct-04 08:21:44 :: plan: src +25 -25 =19176, aarch64 +50 -50 =32051, armh +35 -35 =29777, i586 +46 -46 =32343, noarch +1 -1 =20375, x86_64 +62 -62 =33392
#100 kernel-image-un-def 6.1.186-alt1 -> 1:6.1.189-alt1
 Sat Oct 03 2026 Kernel Bot <kernelbot@altlinux> 1:6.1.189-alt1
 - v6.1.189 (2026-10-03).
 Mon Sep 14 2026 Kernel Bot <kernelbot@altlinux> 1:6.1.188-alt1
 - v6.1.188 (2026-09-14).
 Wed Sep 02 2026 Kernel Bot <kernelbot@altlinux> 1:6.1.187-alt1
 - v6.1.187 (2026-09-02).
#200 kernel-modules-LiME-un-def 1.9.1-alt1.393658.1 -> 1.9.1-alt1.393661.1
 Sat Oct 03 2026 Anton V. Boyarshinov <boyarsh@altlinux> 1.9.1-alt1.393661.1
 - Build for kernel-image-un-def-6.1.189-alt1.
#300 kernel-modules-accel-ppp-un-def 1.12.0-alt3.393658.1 -> 1.12.0-alt3.393661.1
 Sat Oct 03 2026 Andrew A. Vasilyev (Andrew A. Vasilyev) <andy@altlinux> 1.12.0-alt3.393661.1
 - Build for kernel-image-un-def-6.1.189-alt1.
#400 kernel-modules-anbox-un-def 14-alt2.gae26ba2.393658.1 -> 14-alt2.gae26ba2.393661.1
 Sat Oct 03 2026 Konstantin Lepikhov (For packages) <lakostis@altlinux> 14-alt2.gae26ba2.393661.1
 - Build for kernel-image-un-def-6.1.189-alt1.
#500 kernel-modules-bcmwl-un-def 6.30.223.271-alt15.393658.1 -> 6.30.223.271-alt15.393661.1
 Sat Oct 03 2026 Anton Farygin <rider@altlinux> 6.30.223.271-alt15.393661.1
 - Build for kernel-image-un-def-6.1.189-alt1.
#600 kernel-modules-dm-secdel-un-def 1.0.9-alt1.393658.1 -> 2:1.0.9-alt1.393661.1
 Sat Oct 03 2026 Vitaly Chikunov <vt@altlinux> 2:1.0.9-alt1.393661.1
 - Build for kernel-image-un-def-6.1.189-alt1.
#700 kernel-modules-drbd9-un-def 9.2.12-alt1.393658.1 -> 1:9.2.12-alt1.393661.1
 Sat Oct 03 2026 Andrew A. Vasilyev (Andrew A. Vasilyev) <andy@altlinux> 1:9.2.12-alt1.393661.1
 - Build for kernel-image-un-def-6.1.189-alt1.
#1000 kernel-modules-evdi-un-def 1.14.1-alt1.393658.1 -> 1.14.1-alt1.393661.1
 Sat Oct 03 2026 Konstantin Lepikhov (For packages) <lakostis@altlinux> 1.14.1-alt1.393661.1
 - Build for kernel-image-un-def-6.1.189-alt1.
#1100 kernel-modules-i40e-un-def 2.22.20-alt1.393658.1 -> 2.22.20-alt1.393661.1
 Sat Oct 03 2026 Anton Farygin <rider@altlinux> 2.22.20-alt1.393661.1
 - Build for kernel-image-un-def-6.1.189-alt1.
#1200 kernel-modules-iavf-un-def 4.8.3-alt1.393658.1 -> 4.8.3-alt1.393661.1
 Sat Oct 03 2026 Anton Farygin <rider@altlinux> 4.8.3-alt1.393661.1
 - Build for kernel-image-un-def-6.1.189-alt1.
#1300 kernel-modules-ipt-ratelimit-un-def 0.3.3-alt1.393658.1 -> 0.3.3-alt1.393661.1
 Sat Oct 03 2026 Alexei Takaseev <taf@altlinux> 0.3.3-alt1.393661.1
 - Build for kernel-image-un-def-6.1.189-alt1.
#1400 kernel-modules-ipt_netflow-un-def 2.6-alt1.393658.1 -> 2.6-alt1.393661.1
 Sat Oct 03 2026 Anton V. Boyarshinov <boyarsh@altlinux> 2.6-alt1.393661.1
 - Build for kernel-image-un-def-6.1.189-alt1.
#1500 kernel-modules-ixgbe-un-def 5.20.10-alt1.393658.1 -> 5.20.10-alt1.393661.1
 Sat Oct 03 2026 Alexei Takaseev <taf@altlinux> 5.20.10-alt1.393661.1
 - Build for kernel-image-un-def-6.1.189-alt1.
#1600 kernel-modules-lkrg-un-def 0.9.8-alt3.393658.1 -> 0.9.8-alt3.393661.1
 Sat Oct 03 2026 Vitaly Chikunov <vt@altlinux> 0.9.8-alt3.393661.1
 - Build for kernel-image-un-def-1:6.1.189-alt1.
#1700 kernel-modules-nvidia-un-def 550.144.03-alt1.393658.1 -> 550.144.03-alt1.393661.1
 Sat Oct 03 2026 Sergey V Turchin (zerg) <zerg@altlinux> 550.144.03-alt1.393661.1
 - Build for kernel-image-un-def-6.1.189-alt1.
#2000 kernel-modules-r8125-un-def 9.011.01-alt1.393658.1 -> 9.011.01-alt1.393661.1
 Sat Oct 03 2026 shrek@altlinux.ru (Valery Inozemtsev) <shrek@altlinux> 9.011.01-alt1.393661.1
 - Build for kernel-image-un-def-6.1.189-alt1.
#2100 kernel-modules-r8168-un-def 8.053.01-alt1.k.393658.1 -> 8.053.01-alt1.k.393661.1
 Sat Oct 03 2026 Nazarov Denis (nenderus) <nenderus@altlinux> 8.053.01-alt1.k.393661.1
 - Build for kernel-image-un-def-6.1.189-alt1.
#3000 kernel-modules-rtw89-un-def 0.0-alt4.git.4f3464d.393658.1 -> 0.0-alt4.git.4f3464d.393661.1
 Sun Oct 04 2026 Anton Farygin <rider@altlinux> 0.0-alt4.git.4f3464d.393661.1
 - Build for kernel-image-un-def-6.1.189-alt1.
#3100 kernel-modules-sysdig-un-def 7.3.0-alt1.393658.1 -> 7.3.0-alt1.393661.1
 Sun Oct 04 2026 Andrey Cherepanov <cas@altlinux> 7.3.0-alt1.393661.1
 - Build for kernel-image-un-def-6.1.189-alt1.
#3200 kernel-modules-v4l2loopback-un-def 0.12.7-alt1.g5e9dd41.393658.1 -> 0.12.7-alt1.g5e9dd41.393661.1
 Sun Oct 04 2026 Konstantin Lepikhov (For packages) <lakostis@altlinux> 0.12.7-alt1.g5e9dd41.393661.1
 - Build for kernel-image-un-def-6.1.189-alt1.
#3300 kernel-modules-vhba-un-def 20211218-alt1.k.393658.1 -> 20211218-alt1.k.393661.1
 Sun Oct 04 2026 Nazarov Denis (nenderus) <nenderus@altlinux> 20211218-alt1.k.393661.1
 - Build for kernel-image-un-def-6.1.189-alt1.
#3400 kernel-modules-virtualbox-addition-un-def 7.1.16-alt1.393658.1 -> 7.1.16-alt1.393661.1
 Sun Oct 04 2026 Valery Sinelnikov (ALT) <greh@altlinux> 7.1.16-alt1.393661.1
 - Build for kernel-image-un-def-6.1.189-alt1.
#3500 kernel-modules-virtualbox-un-def 7.1.16-alt1.393658.1 -> 7.1.16-alt1.393661.1
 Sun Oct 04 2026 Valery Sinelnikov (ALT) <greh@altlinux> 7.1.16-alt1.393661.1
 - Build for kernel-image-un-def-6.1.189-alt1.
#3600 kernel-modules-xtables-addons-un-def 3.23-alt1.393658.1 -> 3.23-alt1.393661.1
 Sun Oct 04 2026 Anton Farygin <rider@altlinux> 3.23-alt1.393661.1
 - Build for kernel-image-un-def-6.1.189-alt1.
#3700 kernel-modules-zfs-un-def 2.1.16-alt1.393658.1 -> 2.1.16-alt1.393661.1
 Sun Oct 04 2026 Anton Farygin <rider@altlinux> 2.1.16-alt1.393661.1
 - Build for kernel-image-un-def-6.1.189-alt1.
2026-Oct-04 08:22:49 :: patched apt indices
2026-Oct-04 08:23:02 :: created next repo
2026-Oct-04 08:23:09 :: duplicate provides check OK
	x86_64: NEW unmet dependencies detected:
 kernel-modules-rtl8188eu-un-def#5.13.3-alt2.393658.1:p10+431055.2200.2.1@1788553711     kernel-image-un-def = 1:6.1.186-alt1:p10+431055.100.2.1
 kernel-modules-rtl8192eu-un-def#5.11.2.1-alt1.393658.1:p10+431055.2300.2.1@1788553750   kernel-image-un-def = 1:6.1.186-alt1:p10+431055.100.2.1
 kernel-modules-rtl8723du-un-def#5.13.4-alt1.393658.1:p10+431055.2400.2.1@1788553792     kernel-image-un-def = 1:6.1.186-alt1:p10+431055.100.2.1
 kernel-modules-rtl8812au-un-def#1:5.6.4.2-alt1.393658.1:p10+431055.2500.2.1@1788553840  kernel-image-un-def = 1:6.1.186-alt1:p10+431055.100.2.1
 kernel-modules-rtl8821cu-un-def#5.12.0.4-alt1.393658.1:p10+431055.2600.2.1@1788553883   kernel-image-un-def = 1:6.1.186-alt1:p10+431055.100.2.1
 kernel-modules-rtl88x2bu-un-def#5.8.7.1-alt5.393658.1:p10+431055.2700.2.1@1788553924    kernel-image-un-def = 1:6.1.186-alt1:p10+431055.100.2.1
	i586: NEW unmet dependencies detected:
 kernel-modules-rtl8188eu-un-def#5.13.3-alt2.393658.1:p10+431055.2200.2.1@1788553562     kernel-image-un-def = 1:6.1.186-alt1:p10+431055.100.2.1
 kernel-modules-rtl8192eu-un-def#5.11.2.1-alt1.393658.1:p10+431055.2300.2.1@1788553600   kernel-image-un-def = 1:6.1.186-alt1:p10+431055.100.2.1
 kernel-modules-rtl8723du-un-def#5.13.4-alt1.393658.1:p10+431055.2400.2.1@1788553642     kernel-image-un-def = 1:6.1.186-alt1:p10+431055.100.2.1
 kernel-modules-rtl8812au-un-def#1:5.6.4.2-alt1.393658.1:p10+431055.2500.2.1@1788553691  kernel-image-un-def = 1:6.1.186-alt1:p10+431055.100.2.1
 kernel-modules-rtl8821cu-un-def#5.12.0.4-alt1.393658.1:p10+431055.2600.2.1@1788553734   kernel-image-un-def = 1:6.1.186-alt1:p10+431055.100.2.1
 kernel-modules-rtl88x2bu-un-def#5.8.7.1-alt5.393658.1:p10+431055.2700.2.1@1788553775    kernel-image-un-def = 1:6.1.186-alt1:p10+431055.100.2.1
	aarch64: NEW unmet dependencies detected:
 kernel-modules-rtl88x2bu-un-def#5.8.7.1-alt5.393658.1:p10+431055.2700.2.1@1788553951  kernel-image-un-def = 1:6.1.186-alt1:p10+431055.100.2.1
	ACLs of affected packages (6):
 kernel-modules-rtl8188eu-un-def
 kernel-modules-rtl8192eu-un-def
 kernel-modules-rtl8723du-un-def
 kernel-modules-rtl8812au-un-def
 kernel-modules-rtl8821cu-un-def
 kernel-modules-rtl88x2bu-un-def
2026-Oct-04 08:23:58 :: unmets: x86_64 +6 -0 =6, i586 +6 -0 =6, aarch64 +1 -0 =5
2026-Oct-04 08:23:58 :: dependencies check FAILED
2026-Oct-04 08:23:58 :: task #435322 for p10 FAILED


^ permalink raw reply	[flat|nested] 6+ messages in thread

end of thread, other threads:[~2026-10-04  8:23 UTC | newest]

Thread overview: 6+ messages (download: mbox.gz / follow: Atom feed)
-- links below jump to the message on this page --
2026-10-03 13:40 [#435322] p10 FAILED kernel-image.git=kernel-image-un-def-6.1.189-alt1 Girar awaiter (kernelbot)
2026-10-03 15:16 ` [#435322] p10 FAILED (try 2) kernel-image.git=kernel-image-un-def-6.1.189-alt1 Girar awaiter (kernelbot)
2026-10-03 15:47 ` [#435322] p10 FAILED (try 3) kernel-image.git=kernel-image-un-def-6.1.189-alt1 Girar awaiter (kernelbot)
2026-10-03 16:19 ` [#435322] p10 FAILED (try 4) kernel-image.git=kernel-image-un-def-6.1.189-alt1 Girar awaiter (kernelbot)
2026-10-04  5:40 ` [#435322] p10 FAILED (try 5) kernel-image.git=kernel-image-un-def-6.1.189-alt1 Girar awaiter (kernelbot)
2026-10-04  8:23 ` [#435322] p10 FAILED (try 6) kernel-image.git=kernel-image-un-def-6.1.189-alt1 Girar awaiter (kernelbot)

ALT Linux Girar Builder robot reports

This inbox may be cloned and mirrored by anyone:

	# this inbox consists of 2 epochs:
	git clone --mirror http://lore.altlinux.org/sisyphus-incominger/0 sisyphus-incominger/git/0.git	# oldest
	git clone --mirror http://lore.altlinux.org/sisyphus-incominger/1 sisyphus-incominger/git/1.git	# newest

	# If you have public-inbox 1.1+ installed, you may
	# initialize and index your mirror using the following commands:
	public-inbox-init -V2 sisyphus-incominger sisyphus-incominger/ http://lore.altlinux.org/sisyphus-incominger \
		sisyphus-incominger@lists.altlinux.org sisyphus-incominger@lists.altlinux.ru sisyphus-incominger@lists.altlinux.com
	public-inbox-index sisyphus-incominger

Example config snippet for mirrors.
Newsgroup available over NNTP:
	nntp://lore.altlinux.org/org.altlinux.lists.sisyphus-incominger


AGPL code for this site: git clone https://public-inbox.org/public-inbox.git