ALT Linux Girar Builder robot reports
 help / color / mirror / Atom feed
From: "Girar awaiter (thatman)" <girar-builder@altlinux.org>
To: Alexander Burmatov <thatman@altlinux.org>
Cc: sisyphus-incominger@lists.altlinux.org,
	girar-builder-p11@altlinux.org,
	girar-builder-p11@lists.altlinux.org
Subject: [#383988] [test-only] p11 FAILED (try 29) python3-module-django.git=5.2.1-alt1 ...
Date: Thu, 15 May 2025 13:42:24 +0000
Message-ID: <girar.task.383988.29.1@gyle.mskdc.altlinux.org> (raw)
In-Reply-To: <girar.task.383988.1.1@gyle.mskdc.altlinux.org>

https://git.altlinux.org/tasks/383988/logs/events.29.1.log
https://packages.altlinux.org/tasks/383988

subtask  name                                aarch64    i586  x86_64
  #3500  python3-module-social-core             2:37    2:31    2:09
  #3510  python3-module-typing-inspection         47      28      56
  #3514  python3-module-pytest-run-parallel       50      32      51
  #3520  python3-module-sentinels                 46      28      42
  #3524  python3-module-pytest-asyncio          2:00    1:07    1:09
  #3525  python3-module-pydantic-core           6:10    6:26    5:55
  #3526  python3-module-pydantic                1:54    1:24    1:33
  #3541  python3-module-mongomock                 51      49      57
  #3544  python3-module-inline-snapshot         5:44    4:42    6:36
  #3546  python3-module-umongo                     ?      31       ?
  #3547  python3-module-mongo-thingy               ?      26       ?
  #3550  python3-module-msgspec                    ?      53       ?
  #3551  python3-module-txmongo                    ?      26       ?
  #3552  python3-module-mongomock-motor            ?      35       ?
  #3554  python3-module-picologging                ?      47       ?
  #3556  python3-module-polyfactory                ?      47       ?
  #3557  python3-module-sanic-routing              ?      28       ?
  #3560  python3-module-litestar                   ?      38       ?
  #3600  python3-module-strawberry-graphql         ?  failed       ?

2025-May-15 13:04:36 :: test-only task #383988 for p11 resumed by thatman:
#100 build 5.2.1-alt1 from /gears/p/python3-module-django.git fetched at 2025-May-13 10:33:09 from sisyphus
#200 build 4.7.0-alt1 from /gears/p/python3-module-django-cors-headers.git fetched at 2025-May-13 10:39:41 from sisyphus
#240 removed
#260 build 2025.4.11.15-alt1 from /gears/p/python3-module-trove-classifiers.git fetched at 2025-May-13 11:55:24 from sisyphus
#300 build 5.2.0-alt1 from /gears/p/python3-module-django-debug-toolbar.git fetched at 2025-May-13 10:41:00 from sisyphus
#400 build 25.1-alt1 from /gears/p/python3-module-django-filter.git fetched at 2025-May-13 10:42:31 from sisyphus
#500 build 1.23.0-alt1 from /gears/p/python3-module-django-htmx.git fetched at 2025-May-13 10:43:05 from sisyphus
#540 build 0.2.0-alt4 from /people/thatman/packages/python3-module-django-graphiql-debug-toolbar.git fetched at 2025-May-13 13:02:46
#600 removed
#700 build 0.17-alt1 from /gears/p/python3-module-django-mptt.git fetched at 2025-May-13 10:46:26 from sisyphus
#740 build 2.0.0-alt1 from /people/thatman/packages/python3-module-django-rich.git fetched at 2025-May-13 13:33:38
#1000 removed
#1100 build 3.0.1-alt1 from /gears/p/python3-module-django-rq.git fetched at 2025-May-13 10:53:57 from sisyphus
#1200 build 1.14.6-alt1 from /gears/p/python3-module-django-storages.git fetched at 2025-May-13 10:54:25 from sisyphus
#1300 build 6.1.0-alt1 from /gears/p/python3-module-django-taggit.git fetched at 2025-May-13 10:55:23 from sisyphus
#1400 build 2.7.5-alt1 from /gears/p/python3-module-django-tables2.git fetched at 2025-May-13 10:56:00 from sisyphus
#1440 build 1.1.0-alt1 from /gears/p/python3-module-pytest-lazy-fixtures.git fetched at 2025-May-13 13:43:19 from sisyphus
#1500 build 7.1-alt1 from /gears/p/python3-module-django-timezone-field.git fetched at 2025-May-13 10:56:49 from sisyphus
#1600 build 3.16.0-alt1 from /gears/p/python3-module-djangorestframework.git fetched at 2025-May-13 10:58:44 from sisyphus
#1700 build 0.28.0-alt1 from /gears/p/python3-module-drf-spectacular.git fetched at 2025-May-13 11:00:42 from sisyphus
#2000 build 2025.5.1-alt1 from /gears/p/python3-module-drf-spectacular-sidecar.git fetched at 2025-May-13 11:01:13 from sisyphus
#2100 build 3.1.6-alt1 from /gears/p/python3-module-jinja2.git fetched at 2025-May-13 11:02:55 from sisyphus
#2200 build 4.23.0-alt1 from /gears/p/python3-module-jsonschema.git fetched at 2025-May-13 11:03:26 from sisyphus
#2300 removed
#2400 build 9.6.12-alt1 from /gears/p/python3-module-mkdocs-material.git fetched at 2025-May-13 11:05:03 from sisyphus
#2440 build 1.3.0-alt1 from /gears/p/python3-module-mkdocs-git-revision-date-localized-plugin.git fetched at 2025-May-13 14:30:06 from sisyphus
#2450 build 5.8-alt1 from /gears/p/python3-module-backrefs.git fetched at 2025-May-13 15:28:09 from sisyphus
#2460 build 1.3.1-alt1 from /gears/p/python3-module-mkdocs-material-extensions.git fetched at 2025-May-13 15:12:28 from sisyphus
#2500 removed
#2600 build 1.3.0-alt2 from /gears/p/python3-module-netaddr.git fetched at 2025-May-13 11:08:05 from sisyphus
#2700 build 0.2.21-alt1 from /gears/p/python3-module-nh3.git fetched at 2025-May-13 11:09:12 from sisyphus
#3000 build python3-module-Pillow-11.2.1-alt1 from /gears/p/python3-module-Pillow.git fetched at 2025-May-13 11:09:40 from sisyphus
#3100 build 3.2.7-alt1 from /gears/p/python3-module-psycopg.git fetched at 2025-May-13 11:10:08 from sisyphus
#3140 build python3-module-yaml-6.0.2-alt1 from /people/thatman/packages/python3-module-yaml.git fetched at 2025-May-13 17:06:46
#3200 removed
#3300 build 2.3.2-alt1 from /gears/p/python3-module-rq.git fetched at 2025-May-13 11:14:58 from sisyphus
#3400 build 5.4.3-alt1 from /gears/p/python3-module-social-app-django.git fetched at 2025-May-13 11:15:33 from sisyphus
#3500 build 4.6.1-alt1 from /gears/p/python3-module-social-core.git fetched at 2025-May-13 11:16:03 from sisyphus
#3510 build 0.4.0-alt1 from /gears/p/python3-module-typing-inspection.git fetched at 2025-May-15 12:31:54 from sisyphus
#3514 build 0.3.1-alt1 from /gears/p/python3-module-pytest-run-parallel.git fetched at 2025-May-15 12:46:46 from sisyphus
#3520 build 1.0.0-alt1 from /gears/p/python3-module-sentinels.git fetched at 2025-May-14 14:39:58 from sisyphus
#3524 build 0.25.3-alt1 from /gears/p/python3-module-pytest-asyncio.git fetched at 2025-May-15 11:30:36 from sisyphus
#3525 build 2.33.2-alt1 from /gears/p/python3-module-pydantic-core.git fetched at 2025-May-15 13:04:22 from sisyphus
#3526 build 2.11.4-alt1 from /gears/p/python3-module-pydantic.git fetched at 2025-May-15 12:14:40 from sisyphus
#3530 build 1.29.0-alt1 from /gears/p/python3-module-beanie.git fetched at 2025-May-15 08:43:53 from sisyphus
#3534 build 0.2.0-alt2 from /gears/p/python3-module-lazy-model.git fetched at 2025-May-15 09:35:06 from sisyphus
#3536 build 4.12.1-alt1 from /gears/p/python3-module-pymongo.git fetched at 2025-May-15 10:19:07 from sisyphus
#3537 build 3.7.0-alt1 from /gears/p/python3-module-motor.git fetched at 2025-May-15 11:04:23 from sisyphus
#3540 build 0.2.0-alt1 from /gears/p/python3-module-pytest-emoji.git fetched at 2025-May-14 09:24:45 from sisyphus
#3541 build 4.3.0-alt1 from /gears/p/python3-module-mongomock.git fetched at 2025-May-14 14:39:30 from sisyphus
#3542 removed
#3543 build 0.10.0-alt1 from /people/thatman/packages/python3-module-thingy.git fetched at 2025-May-14 14:58:21
#3544 build 0.23.0-alt1 from /gears/p/python3-module-inline-snapshot.git fetched at 2025-May-14 11:51:12 from sisyphus
#3545 removed
#3546 build 3.1.0-alt1 from /gears/p/python3-module-umongo.git fetched at 2025-May-14 14:37:10 from sisyphus
#3547 build 0.17.2-alt1 from /people/thatman/packages/python3-module-mongo-thingy.git fetched at 2025-May-14 17:50:22
#3550 build 0.18.6-alt1 from /gears/p/python3-module-msgspec.git fetched at 2025-May-14 09:58:35 from sisyphus
#3551 build 25.0.0-alt1 from /gears/p/python3-module-txmongo.git fetched at 2025-May-14 14:36:33 from sisyphus
#3552 build 0.0.35-alt1 from /gears/p/python3-module-mongomock-motor.git fetched at 2025-May-14 14:34:30 from sisyphus
#3554 build 0.9.3-alt1 from /gears/p/python3-module-picologging.git fetched at 2025-May-14 11:50:07 from sisyphus
#3555 removed
#3556 build 2.21.0-alt1 from /gears/p/python3-module-polyfactory.git fetched at 2025-May-14 11:52:56 from sisyphus
#3557 build 23.12.0-alt1 from /gears/p/python3-module-sanic-routing.git fetched at 2025-May-14 11:53:14 from sisyphus
#3560 build 2.9.1-alt2 from /gears/p/python3-module-litestar.git fetched at 2025-May-14 09:40:38 from sisyphus
#3600 build 0.266.0-alt1 from /gears/p/python3-module-strawberry-graphql.git fetched at 2025-May-13 11:16:40 from sisyphus
#3700 build 0.58.0-alt1 from /gears/p/python3-module-strawberry-django.git fetched at 2025-May-13 11:17:26 from sisyphus
#4000 build 1.4.3-alt1 from /gears/p/python3-module-svgwrite.git fetched at 2025-May-13 11:18:01 from sisyphus
#4100 build 3.8.0-alt1 from /gears/p/python3-module-tablib.git fetched at 2025-May-13 11:18:31 from sisyphus
#4200 build 2025.2-alt1 from /gears/p/python3-module-tzdata.git fetched at 2025-May-13 11:18:55 from sisyphus
#4240 build python3-module-markdown-3.8-alt1.src.rpm from sisyphus
#4260 build 0.29.1-alt1 from /gears/p/python3-module-mkdocstrings.git fetched at 2025-May-13 16:17:06 from sisyphus
#4300 build 7.4.1-alt1 from /gears/p/python3-module-pynetbox.git fetched at 2025-May-13 12:04:13 from sisyphus
#4400 build 1.3.0-alt1 from /gears/n/netbox-dns.git fetched at 2025-May-13 12:44:55 from sisyphus
#4500 build 0.0.1-alt1 from /gears/n/netbox-ip-monitor.git fetched at 2025-May-13 12:46:33 from sisyphus
#4600 build 1.4.9-alt1 from /gears/n/netbox-ipcalculator.git fetched at 2025-May-13 12:47:16 from sisyphus
#4700 build 4.2.1-alt1 from /gears/n/netbox-topology-views.git fetched at 2025-May-13 12:48:09 from sisyphus
#5000 build 4.3.0-alt1 from /gears/n/netbox.git fetched at 2025-May-13 13:03:26 from sisyphus
2025-May-15 13:04:36 :: created build repo
2025-May-15 13:04:37 :: #3500: force rebuild
2025-May-15 13:04:37 :: #3510: force rebuild
2025-May-15 13:04:37 :: #3514: force rebuild
2025-May-15 13:04:37 :: #3520: force rebuild
2025-May-15 13:04:37 :: #3524: force rebuild
2025-May-15 13:04:37 :: #3546: force rebuild
2025-May-15 13:04:37 :: #3547: force rebuild
2025-May-15 13:04:37 :: #3550: force rebuild
2025-May-15 13:04:37 :: #3551: force rebuild
2025-May-15 13:04:37 :: #3552: force rebuild
2025-May-15 13:04:37 :: #3554: force rebuild
2025-May-15 13:04:38 :: [x86_64] #100 python3-module-django.git 5.2.1-alt1: build start
2025-May-15 13:04:38 :: [i586] #100 python3-module-django.git 5.2.1-alt1: build start
2025-May-15 13:04:38 :: [aarch64] #100 python3-module-django.git 5.2.1-alt1: build start
2025-May-15 13:04:54 :: [i586] #100 python3-module-django.git 5.2.1-alt1: build OK (cached)
2025-May-15 13:04:54 :: [i586] #200 python3-module-django-cors-headers.git 4.7.0-alt1: build start
2025-May-15 13:05:07 :: [i586] #200 python3-module-django-cors-headers.git 4.7.0-alt1: build OK (cached)
2025-May-15 13:05:07 :: [i586] #260 python3-module-trove-classifiers.git 2025.4.11.15-alt1: build start
2025-May-15 13:05:09 :: [aarch64] #100 python3-module-django.git 5.2.1-alt1: build OK (cached)
2025-May-15 13:05:09 :: [aarch64] #200 python3-module-django-cors-headers.git 4.7.0-alt1: build start
2025-May-15 13:05:14 :: [x86_64] #100 python3-module-django.git 5.2.1-alt1: build OK (cached)
2025-May-15 13:05:14 :: [x86_64] #200 python3-module-django-cors-headers.git 4.7.0-alt1: build start
2025-May-15 13:05:20 :: [i586] #260 python3-module-trove-classifiers.git 2025.4.11.15-alt1: build OK (cached)
2025-May-15 13:05:20 :: [i586] #300 python3-module-django-debug-toolbar.git 5.2.0-alt1: build start
2025-May-15 13:05:32 :: [aarch64] #200 python3-module-django-cors-headers.git 4.7.0-alt1: build OK (cached)
2025-May-15 13:05:33 :: [aarch64] #260 python3-module-trove-classifiers.git 2025.4.11.15-alt1: build start
2025-May-15 13:05:33 :: [i586] #300 python3-module-django-debug-toolbar.git 5.2.0-alt1: build OK (cached)
2025-May-15 13:05:33 :: [i586] #400 python3-module-django-filter.git 25.1-alt1: build start
2025-May-15 13:05:44 :: [x86_64] #200 python3-module-django-cors-headers.git 4.7.0-alt1: build OK (cached)
2025-May-15 13:05:44 :: [x86_64] #260 python3-module-trove-classifiers.git 2025.4.11.15-alt1: build start
2025-May-15 13:05:46 :: [i586] #400 python3-module-django-filter.git 25.1-alt1: build OK (cached)
2025-May-15 13:05:46 :: [i586] #500 python3-module-django-htmx.git 1.23.0-alt1: build start
2025-May-15 13:05:55 :: [aarch64] #260 python3-module-trove-classifiers.git 2025.4.11.15-alt1: build OK (cached)
2025-May-15 13:05:56 :: [aarch64] #300 python3-module-django-debug-toolbar.git 5.2.0-alt1: build start
2025-May-15 13:05:59 :: [i586] #500 python3-module-django-htmx.git 1.23.0-alt1: build OK (cached)
2025-May-15 13:05:59 :: [i586] #540 python3-module-django-graphiql-debug-toolbar.git 0.2.0-alt4: build start
2025-May-15 13:06:02 :: [x86_64] #260 python3-module-trove-classifiers.git 2025.4.11.15-alt1: build OK (cached)
2025-May-15 13:06:03 :: [x86_64] #300 python3-module-django-debug-toolbar.git 5.2.0-alt1: build start
2025-May-15 13:06:12 :: [i586] #540 python3-module-django-graphiql-debug-toolbar.git 0.2.0-alt4: build OK (cached)
2025-May-15 13:06:12 :: [i586] #700 python3-module-django-mptt.git 0.17-alt1: build start
2025-May-15 13:06:17 :: [x86_64] #300 python3-module-django-debug-toolbar.git 5.2.0-alt1: build OK (cached)
2025-May-15 13:06:17 :: [x86_64] #400 python3-module-django-filter.git 25.1-alt1: build start
2025-May-15 13:06:19 :: [aarch64] #300 python3-module-django-debug-toolbar.git 5.2.0-alt1: build OK (cached)
2025-May-15 13:06:19 :: [aarch64] #400 python3-module-django-filter.git 25.1-alt1: build start
2025-May-15 13:06:25 :: [i586] #700 python3-module-django-mptt.git 0.17-alt1: build OK (cached)
2025-May-15 13:06:25 :: [i586] #740 python3-module-django-rich.git 2.0.0-alt1: build start
2025-May-15 13:06:40 :: [i586] #740 python3-module-django-rich.git 2.0.0-alt1: build OK (cached)
2025-May-15 13:06:41 :: [i586] #1100 python3-module-django-rq.git 3.0.1-alt1: build start
2025-May-15 13:06:42 :: [aarch64] #400 python3-module-django-filter.git 25.1-alt1: build OK (cached)
2025-May-15 13:06:42 :: [x86_64] #400 python3-module-django-filter.git 25.1-alt1: build OK (cached)
2025-May-15 13:06:42 :: [aarch64] #500 python3-module-django-htmx.git 1.23.0-alt1: build start
2025-May-15 13:06:43 :: [x86_64] #500 python3-module-django-htmx.git 1.23.0-alt1: build start
2025-May-15 13:06:54 :: [i586] #1100 python3-module-django-rq.git 3.0.1-alt1: build OK (cached)
2025-May-15 13:06:55 :: [i586] #1200 python3-module-django-storages.git 1.14.6-alt1: build start
2025-May-15 13:07:05 :: [aarch64] #500 python3-module-django-htmx.git 1.23.0-alt1: build OK (cached)
2025-May-15 13:07:05 :: [aarch64] #540 python3-module-django-graphiql-debug-toolbar.git 0.2.0-alt4: build start
2025-May-15 13:07:11 :: [i586] #1200 python3-module-django-storages.git 1.14.6-alt1: build OK (cached)
2025-May-15 13:07:11 :: [i586] #1300 python3-module-django-taggit.git 6.1.0-alt1: build start
2025-May-15 13:07:13 :: [x86_64] #500 python3-module-django-htmx.git 1.23.0-alt1: build OK (cached)
2025-May-15 13:07:14 :: [x86_64] #540 python3-module-django-graphiql-debug-toolbar.git 0.2.0-alt4: build start
2025-May-15 13:07:28 :: [i586] #1300 python3-module-django-taggit.git 6.1.0-alt1: build OK (cached)
2025-May-15 13:07:28 :: [i586] #1400 python3-module-django-tables2.git 2.7.5-alt1: build start
2025-May-15 13:07:28 :: [aarch64] #540 python3-module-django-graphiql-debug-toolbar.git 0.2.0-alt4: build OK (cached)
2025-May-15 13:07:29 :: [aarch64] #700 python3-module-django-mptt.git 0.17-alt1: build start
2025-May-15 13:07:43 :: [i586] #1400 python3-module-django-tables2.git 2.7.5-alt1: build OK (cached)
2025-May-15 13:07:44 :: [i586] #1440 python3-module-pytest-lazy-fixtures.git 1.1.0-alt1: build start
2025-May-15 13:07:44 :: [x86_64] #540 python3-module-django-graphiql-debug-toolbar.git 0.2.0-alt4: build OK (cached)
2025-May-15 13:07:45 :: [x86_64] #700 python3-module-django-mptt.git 0.17-alt1: build start
2025-May-15 13:07:52 :: [aarch64] #700 python3-module-django-mptt.git 0.17-alt1: build OK (cached)
2025-May-15 13:07:52 :: [aarch64] #740 python3-module-django-rich.git 2.0.0-alt1: build start
2025-May-15 13:07:59 :: [i586] #1440 python3-module-pytest-lazy-fixtures.git 1.1.0-alt1: build OK (cached)
2025-May-15 13:07:59 :: [i586] #1500 python3-module-django-timezone-field.git 7.1-alt1: build start
2025-May-15 13:08:14 :: [i586] #1500 python3-module-django-timezone-field.git 7.1-alt1: build OK (cached)
2025-May-15 13:08:14 :: [i586] #1600 python3-module-djangorestframework.git 3.16.0-alt1: build start
2025-May-15 13:08:15 :: [aarch64] #740 python3-module-django-rich.git 2.0.0-alt1: build OK (cached)
2025-May-15 13:08:15 :: [x86_64] #700 python3-module-django-mptt.git 0.17-alt1: build OK (cached)
2025-May-15 13:08:16 :: [aarch64] #1100 python3-module-django-rq.git 3.0.1-alt1: build start
2025-May-15 13:08:16 :: [x86_64] #740 python3-module-django-rich.git 2.0.0-alt1: build start
2025-May-15 13:08:28 :: [i586] #1600 python3-module-djangorestframework.git 3.16.0-alt1: build OK (cached)
2025-May-15 13:08:28 :: [i586] #1700 python3-module-drf-spectacular.git 0.28.0-alt1: build start
2025-May-15 13:08:39 :: [aarch64] #1100 python3-module-django-rq.git 3.0.1-alt1: build OK (cached)
2025-May-15 13:08:40 :: [aarch64] #1200 python3-module-django-storages.git 1.14.6-alt1: build start
2025-May-15 13:08:41 :: [i586] #1700 python3-module-drf-spectacular.git 0.28.0-alt1: build OK (cached)
2025-May-15 13:08:42 :: [i586] #2000 python3-module-drf-spectacular-sidecar.git 2025.5.1-alt1: build start
2025-May-15 13:08:47 :: [x86_64] #740 python3-module-django-rich.git 2.0.0-alt1: build OK (cached)
2025-May-15 13:08:47 :: [x86_64] #1100 python3-module-django-rq.git 3.0.1-alt1: build start
2025-May-15 13:08:56 :: [i586] #2000 python3-module-drf-spectacular-sidecar.git 2025.5.1-alt1: build OK (cached)
2025-May-15 13:08:56 :: [i586] #2100 python3-module-jinja2.git 3.1.6-alt1: build start
2025-May-15 13:09:05 :: [aarch64] #1200 python3-module-django-storages.git 1.14.6-alt1: build OK (cached)
2025-May-15 13:09:05 :: [aarch64] #1300 python3-module-django-taggit.git 6.1.0-alt1: build start
2025-May-15 13:09:11 :: [i586] #2100 python3-module-jinja2.git 3.1.6-alt1: build OK (cached)
2025-May-15 13:09:11 :: [i586] #2200 python3-module-jsonschema.git 4.23.0-alt1: build start
2025-May-15 13:09:12 :: [x86_64] #1100 python3-module-django-rq.git 3.0.1-alt1: build OK (cached)
2025-May-15 13:09:13 :: [x86_64] #1200 python3-module-django-storages.git 1.14.6-alt1: build start
2025-May-15 13:09:27 :: [i586] #2200 python3-module-jsonschema.git 4.23.0-alt1: build OK (cached)
2025-May-15 13:09:28 :: [i586] #2400 python3-module-mkdocs-material.git 9.6.12-alt1: build start
2025-May-15 13:09:29 :: [x86_64] #1200 python3-module-django-storages.git 1.14.6-alt1: build OK (cached)
2025-May-15 13:09:29 :: [x86_64] #1300 python3-module-django-taggit.git 6.1.0-alt1: build start
2025-May-15 13:09:30 :: [aarch64] #1300 python3-module-django-taggit.git 6.1.0-alt1: build OK (cached)
2025-May-15 13:09:30 :: [aarch64] #1400 python3-module-django-tables2.git 2.7.5-alt1: build start
2025-May-15 13:09:46 :: [x86_64] #1300 python3-module-django-taggit.git 6.1.0-alt1: build OK (cached)
2025-May-15 13:09:47 :: [x86_64] #1400 python3-module-django-tables2.git 2.7.5-alt1: build start
2025-May-15 13:09:49 :: [i586] #2400 python3-module-mkdocs-material.git 9.6.12-alt1: build OK (cached)
2025-May-15 13:09:50 :: [i586] #2440 python3-module-mkdocs-git-revision-date-localized-plugin.git 1.3.0-alt1: build start
2025-May-15 13:09:56 :: [aarch64] #1400 python3-module-django-tables2.git 2.7.5-alt1: build OK (cached)
2025-May-15 13:09:56 :: [aarch64] #1440 python3-module-pytest-lazy-fixtures.git 1.1.0-alt1: build start
2025-May-15 13:10:16 :: [i586] #2440 python3-module-mkdocs-git-revision-date-localized-plugin.git 1.3.0-alt1: build OK (cached)
2025-May-15 13:10:17 :: [i586] #2450 python3-module-backrefs.git 5.8-alt1: build start
2025-May-15 13:10:18 :: [x86_64] #1400 python3-module-django-tables2.git 2.7.5-alt1: build OK (cached)
2025-May-15 13:10:18 :: [x86_64] #1440 python3-module-pytest-lazy-fixtures.git 1.1.0-alt1: build start
2025-May-15 13:10:21 :: [aarch64] #1440 python3-module-pytest-lazy-fixtures.git 1.1.0-alt1: build OK (cached)
2025-May-15 13:10:21 :: [aarch64] #1500 python3-module-django-timezone-field.git 7.1-alt1: build start
2025-May-15 13:10:31 :: [i586] #2450 python3-module-backrefs.git 5.8-alt1: build OK (cached)
2025-May-15 13:10:31 :: [i586] #2460 python3-module-mkdocs-material-extensions.git 1.3.1-alt1: build start
2025-May-15 13:10:45 :: [i586] #2460 python3-module-mkdocs-material-extensions.git 1.3.1-alt1: build OK (cached)
2025-May-15 13:10:45 :: [i586] #2600 python3-module-netaddr.git 1.3.0-alt2: build start
2025-May-15 13:10:46 :: [aarch64] #1500 python3-module-django-timezone-field.git 7.1-alt1: build OK (cached)
2025-May-15 13:10:46 :: [aarch64] #1600 python3-module-djangorestframework.git 3.16.0-alt1: build start
2025-May-15 13:10:49 :: [x86_64] #1440 python3-module-pytest-lazy-fixtures.git 1.1.0-alt1: build OK (cached)
2025-May-15 13:10:50 :: [x86_64] #1500 python3-module-django-timezone-field.git 7.1-alt1: build start
2025-May-15 13:11:01 :: [i586] #2600 python3-module-netaddr.git 1.3.0-alt2: build OK (cached)
2025-May-15 13:11:01 :: [i586] #2700 python3-module-nh3.git 0.2.21-alt1: build start
2025-May-15 13:11:11 :: [aarch64] #1600 python3-module-djangorestframework.git 3.16.0-alt1: build OK (cached)
2025-May-15 13:11:12 :: [aarch64] #1700 python3-module-drf-spectacular.git 0.28.0-alt1: build start
2025-May-15 13:11:15 :: [i586] #2700 python3-module-nh3.git 0.2.21-alt1: build OK (cached)
2025-May-15 13:11:15 :: [i586] #3000 python3-module-Pillow.git python3-module-Pillow-11.2.1-alt1: build start
2025-May-15 13:11:22 :: [x86_64] #1500 python3-module-django-timezone-field.git 7.1-alt1: build OK (cached)
2025-May-15 13:11:22 :: [x86_64] #1600 python3-module-djangorestframework.git 3.16.0-alt1: build start
2025-May-15 13:11:30 :: [i586] #3000 python3-module-Pillow.git python3-module-Pillow-11.2.1-alt1: build OK (cached)
2025-May-15 13:11:30 :: [i586] #3100 python3-module-psycopg.git 3.2.7-alt1: build start
2025-May-15 13:11:35 :: [aarch64] #1700 python3-module-drf-spectacular.git 0.28.0-alt1: build OK (cached)
2025-May-15 13:11:36 :: [aarch64] #2000 python3-module-drf-spectacular-sidecar.git 2025.5.1-alt1: build start
2025-May-15 13:11:45 :: [i586] #3100 python3-module-psycopg.git 3.2.7-alt1: build OK (cached)
2025-May-15 13:11:45 :: [i586] #3140 python3-module-yaml.git python3-module-yaml-6.0.2-alt1: build start
2025-May-15 13:11:52 :: [x86_64] #1600 python3-module-djangorestframework.git 3.16.0-alt1: build OK (cached)
2025-May-15 13:11:53 :: [x86_64] #1700 python3-module-drf-spectacular.git 0.28.0-alt1: build start
2025-May-15 13:11:58 :: [i586] #3140 python3-module-yaml.git python3-module-yaml-6.0.2-alt1: build OK (cached)
2025-May-15 13:11:59 :: [aarch64] #2000 python3-module-drf-spectacular-sidecar.git 2025.5.1-alt1: build OK (cached)
2025-May-15 13:11:59 :: [i586] #3300 python3-module-rq.git 2.3.2-alt1: build start
2025-May-15 13:11:59 :: [aarch64] #2100 python3-module-jinja2.git 3.1.6-alt1: build start
2025-May-15 13:12:12 :: [i586] #3300 python3-module-rq.git 2.3.2-alt1: build OK (cached)
2025-May-15 13:12:12 :: [i586] #3400 python3-module-social-app-django.git 5.4.3-alt1: build start
2025-May-15 13:12:22 :: [aarch64] #2100 python3-module-jinja2.git 3.1.6-alt1: build OK (cached)
2025-May-15 13:12:22 :: [x86_64] #1700 python3-module-drf-spectacular.git 0.28.0-alt1: build OK (cached)
2025-May-15 13:12:23 :: [aarch64] #2200 python3-module-jsonschema.git 4.23.0-alt1: build start
2025-May-15 13:12:23 :: [x86_64] #2000 python3-module-drf-spectacular-sidecar.git 2025.5.1-alt1: build start
2025-May-15 13:12:25 :: [i586] #3400 python3-module-social-app-django.git 5.4.3-alt1: build OK (cached)
2025-May-15 13:12:25 :: [i586] #3500 python3-module-social-core.git 4.6.1-alt1: build start
2025-May-15 13:12:40 :: [x86_64] #2000 python3-module-drf-spectacular-sidecar.git 2025.5.1-alt1: build OK (cached)
2025-May-15 13:12:40 :: [x86_64] #2100 python3-module-jinja2.git 3.1.6-alt1: build start
2025-May-15 13:12:46 :: [aarch64] #2200 python3-module-jsonschema.git 4.23.0-alt1: build OK (cached)
2025-May-15 13:12:46 :: [aarch64] #2400 python3-module-mkdocs-material.git 9.6.12-alt1: build start
2025-May-15 13:12:56 :: [x86_64] #2100 python3-module-jinja2.git 3.1.6-alt1: build OK (cached)
2025-May-15 13:12:56 :: [x86_64] #2200 python3-module-jsonschema.git 4.23.0-alt1: build start
2025-May-15 13:13:11 :: [aarch64] #2400 python3-module-mkdocs-material.git 9.6.12-alt1: build OK (cached)
2025-May-15 13:13:11 :: [aarch64] #2440 python3-module-mkdocs-git-revision-date-localized-plugin.git 1.3.0-alt1: build start
2025-May-15 13:13:25 :: [x86_64] #2200 python3-module-jsonschema.git 4.23.0-alt1: build OK (cached)
2025-May-15 13:13:26 :: [x86_64] #2400 python3-module-mkdocs-material.git 9.6.12-alt1: build start
2025-May-15 13:13:35 :: [aarch64] #2440 python3-module-mkdocs-git-revision-date-localized-plugin.git 1.3.0-alt1: build OK (cached)
2025-May-15 13:13:36 :: [aarch64] #2450 python3-module-backrefs.git 5.8-alt1: build start
2025-May-15 13:13:56 :: [x86_64] #2400 python3-module-mkdocs-material.git 9.6.12-alt1: build OK (cached)
2025-May-15 13:13:57 :: [x86_64] #2440 python3-module-mkdocs-git-revision-date-localized-plugin.git 1.3.0-alt1: build start
2025-May-15 13:14:00 :: [aarch64] #2450 python3-module-backrefs.git 5.8-alt1: build OK (cached)
2025-May-15 13:14:00 :: [aarch64] #2460 python3-module-mkdocs-material-extensions.git 1.3.1-alt1: build start
2025-May-15 13:14:25 :: [aarch64] #2460 python3-module-mkdocs-material-extensions.git 1.3.1-alt1: build OK (cached)
2025-May-15 13:14:25 :: [aarch64] #2600 python3-module-netaddr.git 1.3.0-alt2: build start
2025-May-15 13:14:27 :: [x86_64] #2440 python3-module-mkdocs-git-revision-date-localized-plugin.git 1.3.0-alt1: build OK (cached)
2025-May-15 13:14:28 :: [x86_64] #2450 python3-module-backrefs.git 5.8-alt1: build start
2025-May-15 13:14:48 :: [aarch64] #2600 python3-module-netaddr.git 1.3.0-alt2: build OK (cached)
2025-May-15 13:14:49 :: [aarch64] #2700 python3-module-nh3.git 0.2.21-alt1: build start
2025-May-15 13:14:56 :: [i586] #3500 python3-module-social-core.git 4.6.1-alt1: build OK
2025-May-15 13:14:56 :: [i586] #3510 python3-module-typing-inspection.git 0.4.0-alt1: build start
2025-May-15 13:14:57 :: [x86_64] #2450 python3-module-backrefs.git 5.8-alt1: build OK (cached)
2025-May-15 13:14:58 :: [x86_64] #2460 python3-module-mkdocs-material-extensions.git 1.3.1-alt1: build start
2025-May-15 13:15:13 :: [aarch64] #2700 python3-module-nh3.git 0.2.21-alt1: build OK (cached)
2025-May-15 13:15:13 :: [aarch64] #3000 python3-module-Pillow.git python3-module-Pillow-11.2.1-alt1: build start
2025-May-15 13:15:24 :: [i586] #3510 python3-module-typing-inspection.git 0.4.0-alt1: build OK
2025-May-15 13:15:25 :: [i586] #3514 python3-module-pytest-run-parallel.git 0.3.1-alt1: build start
2025-May-15 13:15:27 :: [x86_64] #2460 python3-module-mkdocs-material-extensions.git 1.3.1-alt1: build OK (cached)
2025-May-15 13:15:28 :: [x86_64] #2600 python3-module-netaddr.git 1.3.0-alt2: build start
2025-May-15 13:15:40 :: [aarch64] #3000 python3-module-Pillow.git python3-module-Pillow-11.2.1-alt1: build OK (cached)
2025-May-15 13:15:40 :: [aarch64] #3100 python3-module-psycopg.git 3.2.7-alt1: build start
2025-May-15 13:15:43 :: [x86_64] #2600 python3-module-netaddr.git 1.3.0-alt2: build OK (cached)
2025-May-15 13:15:43 :: [x86_64] #2700 python3-module-nh3.git 0.2.21-alt1: build start
2025-May-15 13:15:57 :: [i586] #3514 python3-module-pytest-run-parallel.git 0.3.1-alt1: build OK
2025-May-15 13:15:58 :: [i586] #3520 python3-module-sentinels.git 1.0.0-alt1: build start
2025-May-15 13:15:58 :: [x86_64] #2700 python3-module-nh3.git 0.2.21-alt1: build OK (cached)
2025-May-15 13:15:58 :: [x86_64] #3000 python3-module-Pillow.git python3-module-Pillow-11.2.1-alt1: build start
2025-May-15 13:16:07 :: [aarch64] #3100 python3-module-psycopg.git 3.2.7-alt1: build OK (cached)
2025-May-15 13:16:07 :: [aarch64] #3140 python3-module-yaml.git python3-module-yaml-6.0.2-alt1: build start
2025-May-15 13:16:26 :: [i586] #3520 python3-module-sentinels.git 1.0.0-alt1: build OK
2025-May-15 13:16:27 :: [i586] #3524 python3-module-pytest-asyncio.git 0.25.3-alt1: build start
2025-May-15 13:16:28 :: [x86_64] #3000 python3-module-Pillow.git python3-module-Pillow-11.2.1-alt1: build OK (cached)
2025-May-15 13:16:29 :: [x86_64] #3100 python3-module-psycopg.git 3.2.7-alt1: build start
2025-May-15 13:16:30 :: [aarch64] #3140 python3-module-yaml.git python3-module-yaml-6.0.2-alt1: build OK (cached)
2025-May-15 13:16:31 :: [aarch64] #3300 python3-module-rq.git 2.3.2-alt1: build start
2025-May-15 13:16:53 :: [aarch64] #3300 python3-module-rq.git 2.3.2-alt1: build OK (cached)
2025-May-15 13:16:54 :: [aarch64] #3400 python3-module-social-app-django.git 5.4.3-alt1: build start
2025-May-15 13:17:03 :: [x86_64] #3100 python3-module-psycopg.git 3.2.7-alt1: build OK (cached)
2025-May-15 13:17:03 :: [x86_64] #3140 python3-module-yaml.git python3-module-yaml-6.0.2-alt1: build start
2025-May-15 13:17:17 :: [aarch64] #3400 python3-module-social-app-django.git 5.4.3-alt1: build OK (cached)
2025-May-15 13:17:17 :: [aarch64] #3500 python3-module-social-core.git 4.6.1-alt1: build start
2025-May-15 13:17:33 :: [x86_64] #3140 python3-module-yaml.git python3-module-yaml-6.0.2-alt1: build OK (cached)
2025-May-15 13:17:34 :: [x86_64] #3300 python3-module-rq.git 2.3.2-alt1: build start
2025-May-15 13:17:34 :: [i586] #3524 python3-module-pytest-asyncio.git 0.25.3-alt1: build OK
2025-May-15 13:17:35 :: [i586] #3525 python3-module-pydantic-core.git 2.33.2-alt1: build start
2025-May-15 13:18:04 :: [x86_64] #3300 python3-module-rq.git 2.3.2-alt1: build OK (cached)
2025-May-15 13:18:04 :: [x86_64] #3400 python3-module-social-app-django.git 5.4.3-alt1: build start
2025-May-15 13:18:35 :: [x86_64] #3400 python3-module-social-app-django.git 5.4.3-alt1: build OK (cached)
2025-May-15 13:18:35 :: [x86_64] #3500 python3-module-social-core.git 4.6.1-alt1: build start
2025-May-15 13:19:54 :: [aarch64] #3500 python3-module-social-core.git 4.6.1-alt1: build OK
2025-May-15 13:19:54 :: [aarch64] #3510 python3-module-typing-inspection.git 0.4.0-alt1: build start
2025-May-15 13:20:41 :: [aarch64] #3510 python3-module-typing-inspection.git 0.4.0-alt1: build OK
2025-May-15 13:20:42 :: [aarch64] #3514 python3-module-pytest-run-parallel.git 0.3.1-alt1: build start
2025-May-15 13:20:44 :: [x86_64] #3500 python3-module-social-core.git 4.6.1-alt1: build OK
2025-May-15 13:20:44 :: [x86_64] #3510 python3-module-typing-inspection.git 0.4.0-alt1: build start
2025-May-15 13:21:32 :: [aarch64] #3514 python3-module-pytest-run-parallel.git 0.3.1-alt1: build OK
2025-May-15 13:21:33 :: [aarch64] #3520 python3-module-sentinels.git 1.0.0-alt1: build start
2025-May-15 13:21:40 :: [x86_64] #3510 python3-module-typing-inspection.git 0.4.0-alt1: build OK
2025-May-15 13:21:40 :: [x86_64] #3514 python3-module-pytest-run-parallel.git 0.3.1-alt1: build start
2025-May-15 13:22:19 :: [aarch64] #3520 python3-module-sentinels.git 1.0.0-alt1: build OK
2025-May-15 13:22:20 :: [aarch64] #3524 python3-module-pytest-asyncio.git 0.25.3-alt1: build start
2025-May-15 13:22:31 :: [x86_64] #3514 python3-module-pytest-run-parallel.git 0.3.1-alt1: build OK
2025-May-15 13:22:32 :: [x86_64] #3520 python3-module-sentinels.git 1.0.0-alt1: build start
2025-May-15 13:23:14 :: [x86_64] #3520 python3-module-sentinels.git 1.0.0-alt1: build OK
2025-May-15 13:23:15 :: [x86_64] #3524 python3-module-pytest-asyncio.git 0.25.3-alt1: build start
2025-May-15 13:24:01 :: [i586] #3525 python3-module-pydantic-core.git 2.33.2-alt1: build OK
2025-May-15 13:24:02 :: [i586] #3526 python3-module-pydantic.git 2.11.4-alt1: build start
2025-May-15 13:24:20 :: [aarch64] #3524 python3-module-pytest-asyncio.git 0.25.3-alt1: build OK
2025-May-15 13:24:21 :: [aarch64] #3525 python3-module-pydantic-core.git 2.33.2-alt1: build start
2025-May-15 13:24:24 :: [x86_64] #3524 python3-module-pytest-asyncio.git 0.25.3-alt1: build OK
2025-May-15 13:24:24 :: [x86_64] #3525 python3-module-pydantic-core.git 2.33.2-alt1: build start
2025-May-15 13:25:26 :: [i586] #3526 python3-module-pydantic.git 2.11.4-alt1: build OK
2025-May-15 13:25:26 :: [i586] #3530 python3-module-beanie.git 1.29.0-alt1: build start
2025-May-15 13:25:56 :: [i586] #3530 python3-module-beanie.git 1.29.0-alt1: build OK (cached)
2025-May-15 13:25:56 :: [i586] #3534 python3-module-lazy-model.git 0.2.0-alt2: build start
2025-May-15 13:26:22 :: [i586] #3534 python3-module-lazy-model.git 0.2.0-alt2: build OK (cached)
2025-May-15 13:26:22 :: [i586] #3536 python3-module-pymongo.git 4.12.1-alt1: build start
2025-May-15 13:26:44 :: [i586] #3536 python3-module-pymongo.git 4.12.1-alt1: build OK (cached)
2025-May-15 13:26:44 :: [i586] #3537 python3-module-motor.git 3.7.0-alt1: build start
2025-May-15 13:27:04 :: [i586] #3537 python3-module-motor.git 3.7.0-alt1: build OK (cached)
2025-May-15 13:27:05 :: [i586] #3540 python3-module-pytest-emoji.git 0.2.0-alt1: build start
2025-May-15 13:27:32 :: [i586] #3540 python3-module-pytest-emoji.git 0.2.0-alt1: build OK (cached)
2025-May-15 13:27:33 :: [i586] #3541 python3-module-mongomock.git 4.3.0-alt1: build start
2025-May-15 13:28:22 :: [i586] #3541 python3-module-mongomock.git 4.3.0-alt1: build OK
2025-May-15 13:28:22 :: [i586] #3543 python3-module-thingy.git 0.10.0-alt1: build start
2025-May-15 13:28:36 :: [i586] #3543 python3-module-thingy.git 0.10.0-alt1: build OK (cached)
2025-May-15 13:28:36 :: [i586] #3544 python3-module-inline-snapshot.git 0.23.0-alt1: build start
2025-May-15 13:30:19 :: [x86_64] #3525 python3-module-pydantic-core.git 2.33.2-alt1: build OK
2025-May-15 13:30:19 :: [x86_64] #3526 python3-module-pydantic.git 2.11.4-alt1: build start
2025-May-15 13:30:31 :: [aarch64] #3525 python3-module-pydantic-core.git 2.33.2-alt1: build OK
2025-May-15 13:30:32 :: [aarch64] #3526 python3-module-pydantic.git 2.11.4-alt1: build start
2025-May-15 13:31:52 :: [x86_64] #3526 python3-module-pydantic.git 2.11.4-alt1: build OK
2025-May-15 13:31:53 :: [x86_64] #3530 python3-module-beanie.git 1.29.0-alt1: build start
2025-May-15 13:32:21 :: [x86_64] #3530 python3-module-beanie.git 1.29.0-alt1: build OK (cached)
2025-May-15 13:32:21 :: [x86_64] #3534 python3-module-lazy-model.git 0.2.0-alt2: build start
2025-May-15 13:32:26 :: [aarch64] #3526 python3-module-pydantic.git 2.11.4-alt1: build OK
2025-May-15 13:32:26 :: [aarch64] #3530 python3-module-beanie.git 1.29.0-alt1: build start
2025-May-15 13:32:51 :: [x86_64] #3534 python3-module-lazy-model.git 0.2.0-alt2: build OK (cached)
2025-May-15 13:32:52 :: [x86_64] #3536 python3-module-pymongo.git 4.12.1-alt1: build start
2025-May-15 13:32:52 :: [aarch64] #3530 python3-module-beanie.git 1.29.0-alt1: build OK (cached)
2025-May-15 13:32:53 :: [aarch64] #3534 python3-module-lazy-model.git 0.2.0-alt2: build start
2025-May-15 13:33:18 :: [i586] #3544 python3-module-inline-snapshot.git 0.23.0-alt1: build OK
2025-May-15 13:33:18 :: [i586] #3546 python3-module-umongo.git 3.1.0-alt1: build start
2025-May-15 13:33:18 :: [aarch64] #3534 python3-module-lazy-model.git 0.2.0-alt2: build OK (cached)
2025-May-15 13:33:19 :: [aarch64] #3536 python3-module-pymongo.git 4.12.1-alt1: build start
2025-May-15 13:33:21 :: [x86_64] #3536 python3-module-pymongo.git 4.12.1-alt1: build OK (cached)
2025-May-15 13:33:21 :: [x86_64] #3537 python3-module-motor.git 3.7.0-alt1: build start
2025-May-15 13:33:44 :: [aarch64] #3536 python3-module-pymongo.git 4.12.1-alt1: build OK (cached)
2025-May-15 13:33:44 :: [aarch64] #3537 python3-module-motor.git 3.7.0-alt1: build start
2025-May-15 13:33:49 :: [i586] #3546 python3-module-umongo.git 3.1.0-alt1: build OK
2025-May-15 13:33:49 :: [i586] #3547 python3-module-mongo-thingy.git 0.17.2-alt1: build start
2025-May-15 13:33:51 :: [x86_64] #3537 python3-module-motor.git 3.7.0-alt1: build OK (cached)
2025-May-15 13:33:51 :: [x86_64] #3540 python3-module-pytest-emoji.git 0.2.0-alt1: build start
2025-May-15 13:34:09 :: [aarch64] #3537 python3-module-motor.git 3.7.0-alt1: build OK (cached)
2025-May-15 13:34:09 :: [aarch64] #3540 python3-module-pytest-emoji.git 0.2.0-alt1: build start
2025-May-15 13:34:15 :: [i586] #3547 python3-module-mongo-thingy.git 0.17.2-alt1: build OK
2025-May-15 13:34:16 :: [i586] #3550 python3-module-msgspec.git 0.18.6-alt1: build start
2025-May-15 13:34:20 :: [x86_64] #3540 python3-module-pytest-emoji.git 0.2.0-alt1: build OK (cached)
2025-May-15 13:34:21 :: [x86_64] #3541 python3-module-mongomock.git 4.3.0-alt1: build start
2025-May-15 13:34:34 :: [aarch64] #3540 python3-module-pytest-emoji.git 0.2.0-alt1: build OK (cached)
2025-May-15 13:34:34 :: [aarch64] #3541 python3-module-mongomock.git 4.3.0-alt1: build start
2025-May-15 13:35:09 :: [i586] #3550 python3-module-msgspec.git 0.18.6-alt1: build OK
2025-May-15 13:35:10 :: [i586] #3551 python3-module-txmongo.git 25.0.0-alt1: build start
2025-May-15 13:35:18 :: [x86_64] #3541 python3-module-mongomock.git 4.3.0-alt1: build OK
2025-May-15 13:35:18 :: [x86_64] #3543 python3-module-thingy.git 0.10.0-alt1: build start
2025-May-15 13:35:25 :: [aarch64] #3541 python3-module-mongomock.git 4.3.0-alt1: build OK
2025-May-15 13:35:26 :: [aarch64] #3543 python3-module-thingy.git 0.10.0-alt1: build start
2025-May-15 13:35:36 :: [i586] #3551 python3-module-txmongo.git 25.0.0-alt1: build OK
2025-May-15 13:35:37 :: [i586] #3552 python3-module-mongomock-motor.git 0.0.35-alt1: build start
2025-May-15 13:35:47 :: [x86_64] #3543 python3-module-thingy.git 0.10.0-alt1: build OK (cached)
2025-May-15 13:35:47 :: [x86_64] #3544 python3-module-inline-snapshot.git 0.23.0-alt1: build start
2025-May-15 13:35:50 :: [aarch64] #3543 python3-module-thingy.git 0.10.0-alt1: build OK (cached)
2025-May-15 13:35:50 :: [aarch64] #3544 python3-module-inline-snapshot.git 0.23.0-alt1: build start
2025-May-15 13:36:12 :: [i586] #3552 python3-module-mongomock-motor.git 0.0.35-alt1: build OK
2025-May-15 13:36:13 :: [i586] #3554 python3-module-picologging.git 0.9.3-alt1: build start
2025-May-15 13:37:00 :: [i586] #3554 python3-module-picologging.git 0.9.3-alt1: build OK
2025-May-15 13:37:01 :: [i586] #3556 python3-module-polyfactory.git 2.21.0-alt1: build start
2025-May-15 13:37:48 :: [i586] #3556 python3-module-polyfactory.git 2.21.0-alt1: build OK
2025-May-15 13:37:48 :: [i586] #3557 python3-module-sanic-routing.git 23.12.0-alt1: build start
2025-May-15 13:38:16 :: [i586] #3557 python3-module-sanic-routing.git 23.12.0-alt1: build OK
2025-May-15 13:38:16 :: [i586] #3560 python3-module-litestar.git 2.9.1-alt2: build start
2025-May-15 13:38:54 :: [i586] #3560 python3-module-litestar.git 2.9.1-alt2: build OK
2025-May-15 13:38:54 :: [i586] #3600 python3-module-strawberry-graphql.git 0.266.0-alt1: build start
[i586] <13>May 15 13:39:07 rpmi: libmpdec3-2.5.1-alt3 p11+349211.100.1.1 1716635090 installed
[i586] <13>May 15 13:39:07 rpmi: libgdbm-1.8.3-alt10 sisyphus+346222.200.3.2 1716468406 installed
[i586] <13>May 15 13:39:07 rpmi: libexpat-2.7.1-alt1 p11+379972.100.3.1 1744981641 installed
[i586] <13>May 15 13:39:07 rpmi: openssl-config-3.2.0-alt1 p11+370688.200.3.1 1738846989 installed
[i586] <13>May 15 13:39:07 rpmi: libb2-0.98.1-alt1_1 p11+348811.100.1.1 1716520219 installed
[i586] <13>May 15 13:39:07 rpmi: libp11-kit-1:0.25.5-alt1 p11+352554.100.2.1 1721826049 installed
[i586] <13>May 15 13:39:07 rpmi: libtasn1-4.20.0-alt1 p11+374933.100.1.1 1739641427 installed
[i586] <13>May 15 13:39:07 rpmi: rpm-macros-alternatives-0.5.3-alt1 p11+371884.100.2.1 1738152096 installed
[i586] <13>May 15 13:39:07 rpmi: alternatives-0.5.3-alt1 p11+371884.100.2.1 1738152096 installed
[i586] <13>May 15 13:39:07 rpmi: ca-certificates-2025.02.10-alt1 p11+378599.20.3.1 1744008931 installed
[i586] <13>May 15 13:39:07 rpmi: ca-trust-0.2.0-alt1 sisyphus+344843.100.1.1 1712743326 installed
[i586] <13>May 15 13:39:07 rpmi: p11-kit-trust-1:0.25.5-alt1 p11+352554.100.2.1 1721826049 installed
[i586] <13>May 15 13:39:07 rpmi: libcrypto3-3.3.3-alt1 p11+374399.100.2.1 1739522622 installed
[i586] <13>May 15 13:39:07 rpmi: libssl3-3.3.3-alt1 p11+374399.100.2.1 1739522622 installed
[i586] <13>May 15 13:39:07 rpmi: python3-3.12.7-alt1 p11+358835.100.7.1 1731756103 installed
[i586] <13>May 15 13:39:08 rpmi: python3-base-3.12.7-alt1 p11+358835.100.7.1 1731756103 installed
[i586] <13>May 15 13:39:08 rpmi: python3-module-py3dephell-0.1.0-alt2 sisyphus+328191.600.5.1 1693609196 installed
[i586] <13>May 15 13:39:08 rpmi: tests-for-installed-python3-pkgs-0.1.25-alt1 sisyphus+344685.100.1.1 1712595070 installed
[i586] <13>May 15 13:39:08 rpmi: rpm-build-python3-0.1.25-alt1 sisyphus+344685.100.1.1 1712595070 installed
[i586] Reading Package Lists...
[i586] Building Dependency Tree...
[i586] MI2a: marked for install (shallow): python3-module-setuptools
[i586] MI2a:  satisfying Depends: python3-dev  (NULL)
[i586] MI2a:   maybe install (a direct target): python3-dev 3.12.7-alt1:p11+358835.100.7.1@1731756103
[i586] MI2a:  target SELECTED: python3-dev 3.12.7-alt1:p11+358835.100.7.1@1731756103
[i586] MI2a:  requesting to install python3-dev (unspec'd ver; inspect with Debug::pkgMark-shallow)
[i586] MI2a:    marked for install (shallow): python3-dev
[i586] MI2a:     satisfying Depends: libncurses-devel  (NULL)
[i586] MI2a:      maybe install (a direct target): libncurses-devel 6.3.20220618-alt4:sisyphus+327286.4600.14.1@1711486782
[i586] MI2a:     target SELECTED: libncurses-devel 6.3.20220618-alt4:sisyphus+327286.4600.14.1@1711486782
[i586] MI2a:     requesting to install libncurses-devel (unspec'd ver; inspect with Debug::pkgMark-shallow)
[i586] MI2a:       marked for install (shallow): libncurses-devel
[i586] MI2a:        satisfying Depends: libtinfo-devel = 6.3.20220618-alt4:sisyphus+327286.4600.14.1
[i586] MI2a:         maybe install (a direct target): libtinfo-devel 6.3.20220618-alt4:sisyphus+327286.4600.14.1@1711486782
[i586] MI2a:        target SELECTED: libtinfo-devel 6.3.20220618-alt4:sisyphus+327286.4600.14.1@1711486782
[i586] MI2a:        requesting to install libtinfo-devel (unspec'd ver; inspect with Debug::pkgMark-shallow)
[i586] MI2a:          marked for install (shallow): libtinfo-devel
[i586] MI2a:        satisfying Depends: libncurses6 = 6.3.20220618-alt4:sisyphus+327286.4600.14.1
[i586] MI2a:         maybe install (a direct target): libncurses6 6.3.20220618-alt4:sisyphus+327286.4600.14.1@1711486782
[i586] MI2a:        target SELECTED: libncurses6 6.3.20220618-alt4:sisyphus+327286.4600.14.1@1711486782
[i586] MI2a:        requesting to install libncurses6 (unspec'd ver; inspect with Debug::pkgMark-shallow)
[i586] MI2a:          marked for install (shallow): libncurses6
[i586] MI2a:     satisfying Depends: libpython3 = 3.12.7-alt1:p11+358835.100.7.1
[i586] MI2a:      maybe install (a direct target): libpython3 3.12.7-alt1:p11+358835.100.7.1@1731756103
[i586] MI2a:     target SELECTED: libpython3 3.12.7-alt1:p11+358835.100.7.1@1731756103
[i586] MI2a:     requesting to install libpython3 (unspec'd ver; inspect with Debug::pkgMark-shallow)
[i586] MI2a:       marked for install (shallow): libpython3
[i586] MI2a:  satisfying Depends: python3-module-pkg_resources = 1:75.8.0-alt2:p11+370642.440.7.1
[i586] MI2a:   maybe install (a direct target): python3-module-pkg_resources 1:75.8.0-alt2:p11+370642.440.7.1@1740585286
[i586] MI2a:  target SELECTED: python3-module-pkg_resources 1:75.8.0-alt2:p11+370642.440.7.1@1740585286
[i586] MI2a:  requesting to install python3-module-pkg_resources (unspec'd ver; inspect with Debug::pkgMark-shallow)
[i586] MI2a:    marked for install (shallow): python3-module-pkg_resources
[i586] MI2a:     satisfying Depends: python3-module-jaraco-collections  (NULL)
[i586] MI2a:      maybe install (a providing target): python3-module-jaraco.collections 5.0.1-alt1:sisyphus+345202.100.1.1@1713192914
[i586] MI2a:     target SELECTED: python3-module-jaraco.collections 5.0.1-alt1:sisyphus+345202.100.1.1@1713192914
[i586] MI2a:     requesting to install python3-module-jaraco.collections (unspec'd ver; inspect with Debug::pkgMark-shallow)
[i586] MI2a:       marked for install (shallow): python3-module-jaraco.collections
[i586] MI2a:        satisfying Depends: python3-module-jaraco-text  (NULL)
[i586] MI2a:         maybe install (a providing target): python3-module-jaraco.text 4.0.0-alt0.p11.1:p11+353839.3700.5.1@1723792447
[i586] MI2a:        target SELECTED: python3-module-jaraco.text 4.0.0-alt0.p11.1:p11+353839.3700.5.1@1723792447
[i586] MI2a:        requesting to install python3-module-jaraco.text (unspec'd ver; inspect with Debug::pkgMark-shallow)
[i586] MI2a:          marked for install (shallow): python3-module-jaraco.text
[i586] MI2a:           satisfying Depends: python3-module-autocommand  (NULL)
[i586] MI2a:            maybe install (a direct target): python3-module-autocommand 2.2.2-alt1.1:sisyphus+339714.100.1.1@1706968174
[i586] MI2a:           target SELECTED: python3-module-autocommand 2.2.2-alt1.1:sisyphus+339714.100.1.1@1706968174
[i586] MI2a:           requesting to install python3-module-autocommand (unspec'd ver; inspect with Debug::pkgMark-shallow)
[i586] MI2a:             marked for install (shallow): python3-module-autocommand
[i586] MI2a:           satisfying Depends: python3-module-jaraco-context  (NULL)
[i586] MI2a:            maybe install (a providing target): python3-module-jaraco.context 5.3.0-alt1:sisyphus+344634.100.1.1@1712568316
[i586] MI2a:           target SELECTED: python3-module-jaraco.context 5.3.0-alt1:sisyphus+344634.100.1.1@1712568316
[i586] MI2a:           requesting to install python3-module-jaraco.context (unspec'd ver; inspect with Debug::pkgMark-shallow)
[i586] MI2a:             marked for install (shallow): python3-module-jaraco.context
[i586] MI2a:           satisfying Depends: python3-module-jaraco-functools  (NULL)
[i586] MI2a:            maybe install (a providing target): python3-module-jaraco.functools 4.0.1-alt1:sisyphus+345573.100.1.1@1713672617
[i586] MI2a:           target SELECTED: python3-module-jaraco.functools 4.0.1-alt1:sisyphus+345573.100.1.1@1713672617
[i586] MI2a:           requesting to install python3-module-jaraco.functools (unspec'd ver; inspect with Debug::pkgMark-shallow)
[i586] MI2a:             marked for install (shallow): python3-module-jaraco.functools
[i586] MI2a:              satisfying Depends: python3(more_itertools) < 0
[i586] MI2a:               maybe install (a providing target): python3-module-more-itertools 10.2.0-alt1:sisyphus+337886.100.2.1@1705917332
[i586] MI2a:              target SELECTED: python3-module-more-itertools 10.2.0-alt1:sisyphus+337886.100.2.1@1705917332
[i586] MI2a:              requesting to install python3-module-more-itertools (unspec'd ver; inspect with Debug::pkgMark-shallow)
[i586] MI2a:                marked for install (shallow): python3-module-more-itertools
[i586] MI2a:     satisfying Depends: python3-module-packaging  (NULL)
[i586] MI2a:      maybe install (a direct target): python3-module-packaging 24.2-alt1:p11+370642.300.7.1@1740584904
[i586] MI2a:     target SELECTED: python3-module-packaging 24.2-alt1:p11+370642.300.7.1@1740584904
[i586] MI2a:     requesting to install python3-module-packaging (unspec'd ver; inspect with Debug::pkgMark-shallow)
[i586] MI2a:       marked for install (shallow): python3-module-packaging
[i586] MI2a:     satisfying Depends: python3-module-platformdirs  (NULL)
[i586] MI2a:      maybe install (a direct target): python3-module-platformdirs 4.2.2-alt1:sisyphus+348107.100.1.1@1715765810
[i586] MI2a:     target SELECTED: python3-module-platformdirs 4.2.2-alt1:sisyphus+348107.100.1.1@1715765810
[i586] MI2a:     requesting to install python3-module-platformdirs (unspec'd ver; inspect with Debug::pkgMark-shallow)
[i586] MI2a:       marked for install (shallow): python3-module-platformdirs
[i586] MI2a:     satisfying Depends: python3-module-wheel  (NULL)
[i586] MI2a:      maybe install (a direct target): python3-module-wheel 0.45.1-alt1:p11+370642.340.7.1@1740584978
[i586] MI2a:     target SELECTED: python3-module-wheel 0.45.1-alt1:p11+370642.340.7.1@1740584978
[i586] MI2a:     requesting to install python3-module-wheel (unspec'd ver; inspect with Debug::pkgMark-shallow)
[i586] MI2a:       marked for install (shallow): python3-module-wheel
[i586] MI2a: marked for install (shallow): python3-module-poetry
[i586] MI2a:  satisfying Depends: python3-module-poetry-core >= 1.9.1
[i586] MI2a:   maybe install (a direct target): python3-module-poetry-core 1.9.1-alt1:p11+361200.47000.17.1@1732242337
[i586] MI2a:  target SELECTED: python3-module-poetry-core 1.9.1-alt1:p11+361200.47000.17.1@1732242337
[i586] MI2a:  requesting to install python3-module-poetry-core (unspec'd ver; inspect with Debug::pkgMark-shallow)
[i586] MI2a:    marked for install (shallow): python3-module-poetry-core
[i586] MI2a:     satisfying Depends: python3(poetry) < 0
[i586] MI2a:      maybe install (a providing target): python3-module-poetry-alt-namespace 0.0.1-alt1:sisyphus+306728.100.1.1@1663083685
[i586] MI2a:     target SELECTED: python3-module-poetry-alt-namespace 0.0.1-alt1:sisyphus+306728.100.1.1@1663083685
[i586] MI2a:     requesting to install python3-module-poetry-alt-namespace (unspec'd ver; inspect with Debug::pkgMark-shallow)
[i586] MI2a:       marked for install (shallow): python3-module-poetry-alt-namespace
[i586] MI2a:     satisfying Depends: python3-module-fastjsonschema  (NULL)
[i586] MI2a:      maybe install (a direct target): python3-module-fastjsonschema 2.19.1-alt1:sisyphus+347302.100.2.1@1714727719
[i586] MI2a:     target SELECTED: python3-module-fastjsonschema 2.19.1-alt1:sisyphus+347302.100.2.1@1714727719
[i586] MI2a:     requesting to install python3-module-fastjsonschema (unspec'd ver; inspect with Debug::pkgMark-shallow)
[i586] MI2a:       marked for install (shallow): python3-module-fastjsonschema
[i586] MI2a:     satisfying Depends: python3-module-lark  (NULL)
[i586] MI2a:      maybe install (a direct target): python3-module-lark 1.1.9-alt1:sisyphus+341080.100.1.1@1708359651
[i586] MI2a:     target SELECTED: python3-module-lark 1.1.9-alt1:sisyphus+341080.100.1.1@1708359651
[i586] MI2a:     requesting to install python3-module-lark (unspec'd ver; inspect with Debug::pkgMark-shallow)
[i586] MI2a:       marked for install (shallow): python3-module-lark
[i586] MI2a:     satisfying Depends: python3-module-tomli  (NULL)
[i586] MI2a:      maybe install (a direct target): python3-module-tomli 2.0.1-alt2:sisyphus+305000.3300.2.1@1660575675
[i586] MI2a:     target SELECTED: python3-module-tomli 2.0.1-alt2:sisyphus+305000.3300.2.1@1660575675
[i586] MI2a:     requesting to install python3-module-tomli (unspec'd ver; inspect with Debug::pkgMark-shallow)
[i586] MI2a:       marked for install (shallow): python3-module-tomli
[i586] MI2a:  satisfying Depends: python3-module-dulwich >= 0.21.2
[i586] MI2a:   maybe install (a direct target): python3-module-dulwich 0.22.1-alt1:sisyphus+347759.400.2.1@1715287814
[i586] MI2a:  target SELECTED: python3-module-dulwich 0.22.1-alt1:sisyphus+347759.400.2.1@1715287814
[i586] MI2a:  requesting to install python3-module-dulwich (unspec'd ver; inspect with Debug::pkgMark-shallow)
[i586] MI2a:    marked for install (shallow): python3-module-dulwich
[i586] MI2a:     satisfying Depends: python3(fastimport) < 0
[i586] MI2a:      maybe install (a providing target): python3-module-fastimport 0.9.14-alt2:sisyphus+318148.100.1.1@1680797712
[i586] MI2a:     target SELECTED: python3-module-fastimport 0.9.14-alt2:sisyphus+318148.100.1.1@1680797712
[i586] MI2a:     requesting to install python3-module-fastimport (unspec'd ver; inspect with Debug::pkgMark-shallow)
[i586] MI2a:       marked for install (shallow): python3-module-fastimport
[i586] MI2a:     satisfying Depends: python3(gevent) < 0
[i586] MI2a:      maybe install (a providing target): python3-module-gevent 23.9.1-alt1:sisyphus+340984.100.2.2@1708285338
[i586] MI2a:     target SELECTED: python3-module-gevent 23.9.1-alt1:sisyphus+340984.100.2.2@1708285338
[i586] MI2a:     requesting to install python3-module-gevent (unspec'd ver; inspect with Debug::pkgMark-shallow)
[i586] MI2a:       marked for install (shallow): python3-module-gevent
[i586] MI2a:        satisfying Depends: python3(greenlet) < 0
[i586] MI2a:         maybe install (a providing target): python3-module-greenlet 3.1.1-alt1:p11+370642.2500.7.1@1740585825
[i586] MI2a:        target SELECTED: python3-module-greenlet 3.1.1-alt1:p11+370642.2500.7.1@1740585825
[i586] MI2a:        requesting to install python3-module-greenlet (unspec'd ver; inspect with Debug::pkgMark-shallow)
[i586] MI2a:          marked for install (shallow): python3-module-greenlet
[i586] MI2a:           satisfying Depends: python3(objgraph) < 0
[i586] MI2a:            maybe install (a providing target): python3-module-objgraph 3.6.1-alt1:sisyphus+344386.100.1.1@1712226667
[i586] MI2a:           target SELECTED: python3-module-objgraph 3.6.1-alt1:sisyphus+344386.100.1.1@1712226667
[i586] MI2a:           requesting to install python3-module-objgraph (unspec'd ver; inspect with Debug::pkgMark-shallow)
[i586] MI2a:             marked for install (shallow): python3-module-objgraph
[i586] MI2a:           satisfying Depends: python3(psutil) < 0
[i586] MI2a:            maybe install (a providing target): python3-module-psutil 5.9.8-alt1:sisyphus+341001.100.1.1@1708284056
[i586] MI2a:           target SELECTED: python3-module-psutil 5.9.8-alt1:sisyphus+341001.100.1.1@1708284056
[i586] MI2a:           requesting to install python3-module-psutil (unspec'd ver; inspect with Debug::pkgMark-shallow)
[i586] MI2a:             marked for install (shallow): python3-module-psutil
[i586] MI2a:        satisfying Depends: libcares.so.2 >= set:miZcqpIMz6qNacolQqvWHLweBKrWcLuhJfbHqi1
[i586] MI2a:         maybe install (a providing target): libcares 1.34.4-alt1:p11+366654.100.1.1@1735290272
[i586] MI2a:        target SELECTED: libcares 1.34.4-alt1:p11+366654.100.1.1@1735290272
[i586] MI2a:        requesting to install libcares (unspec'd ver; inspect with Debug::pkgMark-shallow)
[i586] MI2a:          marked for install (shallow): libcares
[i586] MI2a:        satisfying Depends: libev.so.4 >= set:kePKyiZkErgk4oJyZD1pYiw8QUPkSlSo2oVWB4hEjYIlbFFasBbJvt9OeoFp4LMJ78Kc9UNyZkOb2wesW3ydCD7c9Y8WeSX5nuqixAjAvDr7Kfi0
[i586] MI2a:         maybe install (a providing target): libev4 4.33-alt3:sisyphus+334335.340.4.1@1699912675
[i586] MI2a:        target SELECTED: libev4 4.33-alt3:sisyphus+334335.340.4.1@1699912675
[i586] MI2a:        requesting to install libev4 (unspec'd ver; inspect with Debug::pkgMark-shallow)
[i586] MI2a:          marked for install (shallow): libev4
[i586] MI2a:        satisfying Depends: libuv.so.1 >= set:mgRq8px87t4QhqZzhBUt9vZwZr1vmZnmzCV5IbCLaaZLWFkE9gdw6ZprPC1KJnsOvDMmsgo2Z9Ok94PMM6TDqSIad7nY65Cd1B98abNW7RWLiTl0xdTh57Mc6j9h1bEVXhWT93buejCqXts2
[i586] MI2a:         maybe install (a providing target): libuv 1.49.2-alt1:p11+366244.64.10.1@1738580173
[i586] MI2a:        target SELECTED: libuv 1.49.2-alt1:p11+366244.64.10.1@1738580173
[i586] MI2a:        requesting to install libuv (unspec'd ver; inspect with Debug::pkgMark-shallow)
[i586] MI2a:          marked for install (shallow): libuv
[i586] MI2a:        satisfying Depends: python3(cffi) < 0
[i586] MI2a:         maybe install (a providing target): python3-module-cffi 1.17.1-alt1:p11+377603.700.15.1@1745489429
[i586] MI2a:        target SELECTED: python3-module-cffi 1.17.1-alt1:p11+377603.700.15.1@1745489429
[i586] MI2a:        requesting to install python3-module-cffi (unspec'd ver; inspect with Debug::pkgMark-shallow)
[i586] MI2a:          marked for install (shallow): python3-module-cffi
[i586] MI2a:           satisfying Depends: python3-module-pycparser  (NULL)
[i586] MI2a:            maybe install (a direct target): python3-module-pycparser 2.21-alt1.1:sisyphus+309935.7300.4.1@1668527005
[i586] MI2a:           target SELECTED: python3-module-pycparser 2.21-alt1.1:sisyphus+309935.7300.4.1@1668527005
[i586] MI2a:           requesting to install python3-module-pycparser (unspec'd ver; inspect with Debug::pkgMark-shallow)
[i586] MI2a:             marked for install (shallow): python3-module-pycparser
[i586] MI2a:        satisfying Depends: python3(zope.event) < 0
[i586] MI2a:         maybe install (a providing target): python3-module-zope.event 5.0-alt1.1:sisyphus+325755.140.2.1@1690991538
[i586] MI2a:        target SELECTED: python3-module-zope.event 5.0-alt1.1:sisyphus+325755.140.2.1@1690991538
[i586] MI2a:        requesting to install python3-module-zope.event (unspec'd ver; inspect with Debug::pkgMark-shallow)
[i586] MI2a:          marked for install (shallow): python3-module-zope.event
[i586] MI2a:           satisfying Depends: python3(zope) < 0
[i586] MI2a:            maybe install (a providing target): python3-module-zope 3.3.0-alt9:sisyphus+281937.200.4.1@1628175910
[i586] MI2a:           target SELECTED: python3-module-zope 3.3.0-alt9:sisyphus+281937.200.4.1@1628175910
[i586] MI2a:           requesting to install python3-module-zope (unspec'd ver; inspect with Debug::pkgMark-shallow)
[i586] MI2a:             marked for install (shallow): python3-module-zope
[i586] MI2a:              satisfying Depends: python3-module-zope.interface  (NULL)
[i586] MI2a:               maybe install (a direct target): python3-module-zope.interface 6.4-alt1:sisyphus+348184.100.1.1@1715858755
[i586] MI2a:              target SELECTED: python3-module-zope.interface 6.4-alt1:sisyphus+348184.100.1.1@1715858755
[i586] MI2a:              requesting to install python3-module-zope.interface (unspec'd ver; inspect with Debug::pkgMark-shallow)
[i586] MI2a:                marked for install (shallow): python3-module-zope.interface
[i586] MI2a:              satisfying Depends: python3-module-zc  (NULL)
[i586] MI2a:               maybe install (a direct target): python3-module-zc 1.0.0-alt7:sisyphus+284857.100.1.1@1631109117
[i586] MI2a:              target SELECTED: python3-module-zc 1.0.0-alt7:sisyphus+284857.100.1.1@1631109117
[i586] MI2a:              requesting to install python3-module-zc (unspec'd ver; inspect with Debug::pkgMark-shallow)
[i586] MI2a:                marked for install (shallow): python3-module-zc
[i586] MI2a:                 satisfying Depends: python3-module-z3c  (NULL)
[i586] MI2a:                  maybe install (a direct target): python3-module-z3c 3.0.0-alt4:sisyphus+284857.200.1.1@1631109149
[i586] MI2a:                 target SELECTED: python3-module-z3c 3.0.0-alt4:sisyphus+284857.200.1.1@1631109149
[i586] MI2a:                 requesting to install python3-module-z3c (unspec'd ver; inspect with Debug::pkgMark-shallow)
[i586] MI2a:                   marked for install (shallow): python3-module-z3c
[i586] MI2a:  satisfying Depends: python3(build) < 0
[i586] MI2a:   maybe install (a providing target): python3-module-build 1.2.1-alt3:sisyphus+348465.100.1.1@1716150139
[i586] MI2a:  target SELECTED: python3-module-build 1.2.1-alt3:sisyphus+348465.100.1.1@1716150139
[i586] MI2a:  requesting to install python3-module-build (unspec'd ver; inspect with Debug::pkgMark-shallow)
[i586] MI2a:    marked for install (shallow): python3-module-build
[i586] MI2a:     satisfying Depends: python3-module-pyproject-hooks  (NULL)
[i586] MI2a:      maybe install (a providing target): python3-module-pyproject_hooks 1.1.0-alt2:p11+370642.5100.7.1@1740586947
[i586] MI2a:     target SELECTED: python3-module-pyproject_hooks 1.1.0-alt2:p11+370642.5100.7.1@1740586947
[i586] MI2a:     requesting to install python3-module-pyproject_hooks (unspec'd ver; inspect with Debug::pkgMark-shallow)
[i586] MI2a:       marked for install (shallow): python3-module-pyproject_hooks
[i586] MI2a:  satisfying Depends: python3(cachecontrol) < 0
[i586] MI2a:   maybe install (a providing target): python3-module-cachecontrol 0.14.2-alt1:p11+372203.11200.14.1@1739207493
[i586] MI2a:  target SELECTED: python3-module-cachecontrol 0.14.2-alt1:p11+372203.11200.14.1@1739207493
[i586] MI2a:  requesting to install python3-module-cachecontrol (unspec'd ver; inspect with Debug::pkgMark-shallow)
[i586] MI2a:    marked for install (shallow): python3-module-cachecontrol
[i586] MI2a:     satisfying Depends: python3(msgpack) < 0
[i586] MI2a:      maybe install (a providing target): python3-module-msgpack 1.0.7-alt1:sisyphus+340996.100.2.1@1708285631
[i586] MI2a:     target SELECTED: python3-module-msgpack 1.0.7-alt1:sisyphus+340996.100.2.1@1708285631
[i586] MI2a:     requesting to install python3-module-msgpack (unspec'd ver; inspect with Debug::pkgMark-shallow)
[i586] MI2a:       marked for install (shallow): python3-module-msgpack
[i586] MI2a:     satisfying Depends: python3(requests) < 0
[i586] MI2a:      maybe install (a providing target): python3-module-requests 2.32.3-alt1:p11+362993.100.4.1@1732522216
[i586] MI2a:     target SELECTED: python3-module-requests 2.32.3-alt1:p11+362993.100.4.1@1732522216
[i586] MI2a:     requesting to install python3-module-requests (unspec'd ver; inspect with Debug::pkgMark-shallow)
[i586] MI2a:       marked for install (shallow): python3-module-requests
[i586] MI2a:        satisfying Depends: python3-module-charset-normalizer  (NULL)
[i586] MI2a:         maybe install (a direct target): python3-module-charset-normalizer 3.2.0-alt1:sisyphus+347396.200.2.1@1714733144
[i586] MI2a:        target SELECTED: python3-module-charset-normalizer 3.2.0-alt1:sisyphus+347396.200.2.1@1714733144
[i586] MI2a:        requesting to install python3-module-charset-normalizer (unspec'd ver; inspect with Debug::pkgMark-shallow)
[i586] MI2a:          marked for install (shallow): python3-module-charset-normalizer
[i586] MI2a:        satisfying Depends: python3-module-idna  (NULL)
[i586] MI2a:         maybe install (a direct target): python3-module-idna 3.7-alt1:sisyphus+345659.100.1.1@1713798399
[i586] MI2a:        target SELECTED: python3-module-idna 3.7-alt1:sisyphus+345659.100.1.1@1713798399
[i586] MI2a:        requesting to install python3-module-idna (unspec'd ver; inspect with Debug::pkgMark-shallow)
[i586] MI2a:          marked for install (shallow): python3-module-idna
[i586] MI2a:        satisfying Depends: python3-module-urllib3  (NULL)
[i586] MI2a:         maybe install (a direct target): python3-module-urllib3 2:2.2.1-alt1:sisyphus+341073.200.1.1@1708356525
[i586] MI2a:        target SELECTED: python3-module-urllib3 2:2.2.1-alt1:sisyphus+341073.200.1.1@1708356525
[i586] MI2a:        requesting to install python3-module-urllib3 (unspec'd ver; inspect with Debug::pkgMark-shallow)
[i586] MI2a:          marked for install (shallow): python3-module-urllib3
[i586] MI2a:  satisfying Depends: python3(cleo.application) < 0
[i586] MI2a:   maybe install (a providing target): python3-module-cleo 2.2.1-alt1:p11+363895.7600.5.1@1733767062
[i586] MI2a:  target SELECTED: python3-module-cleo 2.2.1-alt1:p11+363895.7600.5.1@1733767062
[i586] MI2a:  requesting to install python3-module-cleo (unspec'd ver; inspect with Debug::pkgMark-shallow)
[i586] MI2a:    marked for install (shallow): python3-module-cleo
[i586] MI2a:  satisfying Depends: python3(crashtest.contracts.has_solutions_for_exception) < 0
[i586] MI2a:   maybe install (a providing target): python3-module-crashtest 0.4.1-alt1:sisyphus+309874.100.1.1@1668207042
[i586] MI2a:  target SELECTED: python3-module-crashtest 0.4.1-alt1:sisyphus+309874.100.1.1@1668207042
[i586] MI2a:  requesting to install python3-module-crashtest (unspec'd ver; inspect with Debug::pkgMark-shallow)
[i586] MI2a:    marked for install (shallow): python3-module-crashtest
[i586] MI2a:  satisfying Depends: python3(installer) < 0
[i586] MI2a:   maybe install (a providing target): python3-module-installer 0.7.0-alt1:sisyphus+318881.100.2.1@1681988183
[i586] MI2a:  target SELECTED: python3-module-installer 0.7.0-alt1:sisyphus+318881.100.2.1@1681988183
[i586] MI2a:  requesting to install python3-module-installer (unspec'd ver; inspect with Debug::pkgMark-shallow)
[i586] MI2a:    marked for install (shallow): python3-module-installer
[i586] MI2a:  satisfying Depends: python3(pexpect) < 0
[i586] MI2a:   maybe install (a providing target): python3-module-pexpect 4.9.0-alt1:sisyphus+341927.40.2.1@1709544794
[i586] MI2a:  target SELECTED: python3-module-pexpect 4.9.0-alt1:sisyphus+341927.40.2.1@1709544794
[i586] MI2a:  requesting to install python3-module-pexpect (unspec'd ver; inspect with Debug::pkgMark-shallow)
[i586] MI2a:    marked for install (shallow): python3-module-pexpect
[i586] MI2a:     satisfying Depends: python3(ptyprocess) < 0
[i586] MI2a:      maybe install (a providing target): python3-module-ptyprocess 0.7.0-alt1:sisyphus+283469.100.1.1@1629400504
[i586] MI2a:     target SELECTED: python3-module-ptyprocess 0.7.0-alt1:sisyphus+283469.100.1.1@1629400504
[i586] MI2a:     requesting to install python3-module-ptyprocess (unspec'd ver; inspect with Debug::pkgMark-shallow)
[i586] MI2a:       marked for install (shallow): python3-module-ptyprocess
[i586] MI2a:  satisfying Depends: python3(pkginfo) < 0
[i586] MI2a:   maybe install (a providing target): python3-module-pkginfo 1.12.1.2-alt2:p11+370642.11500.7.1@1740588437
[i586] MI2a:  target SELECTED: python3-module-pkginfo 1.12.1.2-alt2:p11+370642.11500.7.1@1740588437
[i586] MI2a:  requesting to install python3-module-pkginfo (unspec'd ver; inspect with Debug::pkgMark-shallow)
[i586] MI2a:    marked for install (shallow): python3-module-pkginfo
[i586] MI2a:  satisfying Depends: python3(poetry_plugin_export.command) < 0
[i586] MI2a:   maybe install (a providing target): python3-module-poetry_plugin_export 1.8.0-alt1:sisyphus+348028.100.1.1@1715669346
[i586] MI2a:  target SELECTED: python3-module-poetry_plugin_export 1.8.0-alt1:sisyphus+348028.100.1.1@1715669346
[i586] MI2a:  requesting to install python3-module-poetry_plugin_export (unspec'd ver; inspect with Debug::pkgMark-shallow)
[i586] MI2a:    marked for install (shallow): python3-module-poetry_plugin_export
[i586] MI2a:  satisfying Depends: python3(requests_toolbelt) < 0
[i586] MI2a:   maybe install (a providing target): python3-module-requests_toolbelt 1.0.0-alt3:sisyphus+338996.100.1.1@1706201427
[i586] MI2a:  target SELECTED: python3-module-requests_toolbelt 1.0.0-alt3:sisyphus+338996.100.1.1@1706201427
[i586] MI2a:  requesting to install python3-module-requests_toolbelt (unspec'd ver; inspect with Debug::pkgMark-shallow)
[i586] MI2a:    marked for install (shallow): python3-module-requests_toolbelt
[i586] MI2a:     satisfying Depends: python3(OpenSSL.crypto) < 0
[i586] MI2a:      maybe install (a providing target): python3-module-openssl 24.0.0-alt1:sisyphus+340924.100.1.1@1708214977
[i586] MI2a:     target SELECTED: python3-module-openssl 24.0.0-alt1:sisyphus+340924.100.1.1@1708214977
[i586] MI2a:     requesting to install python3-module-openssl (unspec'd ver; inspect with Debug::pkgMark-shallow)
[i586] MI2a:       marked for install (shallow): python3-module-openssl
[i586] MI2a:        satisfying Depends: python3-module-cryptography < 43
[i586] MI2a:         maybe install (a direct target): python3-module-cryptography 42.0.5-alt1:sisyphus+341498.100.1.1@1709027854
[i586] MI2a:        target SELECTED: python3-module-cryptography 42.0.5-alt1:sisyphus+341498.100.1.1@1709027854
[i586] MI2a:        requesting to install python3-module-cryptography (unspec'd ver; inspect with Debug::pkgMark-shallow)
[i586] MI2a:          marked for install (shallow): python3-module-cryptography
[i586] MI2a:  satisfying Depends: python3(shellingham) < 0
[i586] MI2a:   maybe install (a providing target): python3-module-shellingham 1.5.4-alt1:sisyphus+332574.100.1.1@1698135363
[i586] MI2a:  target SELECTED: python3-module-shellingham 1.5.4-alt1:sisyphus+332574.100.1.1@1698135363
[i586] MI2a:  requesting to install python3-module-shellingham (unspec'd ver; inspect with Debug::pkgMark-shallow)
[i586] MI2a:    marked for install (shallow): python3-module-shellingham
[i586] MI2a:  satisfying Depends: python3(tomlkit) < 0
[i586] MI2a:   maybe install (a providing target): python3-module-tomlkit 0.12.5-alt1:sisyphus+347939.100.1.1@1715614211
[i586] MI2a:  target SELECTED: python3-module-tomlkit 0.12.5-alt1:sisyphus+347939.100.1.1@1715614211
[i586] MI2a:  requesting to install python3-module-tomlkit (unspec'd ver; inspect with Debug::pkgMark-shallow)
[i586] MI2a:    marked for install (shallow): python3-module-tomlkit
[i586] MI2a:  satisfying Depends: python3(virtualenv) < 0
[i586] MI2a:   maybe install (a providing target): python3-module-virtualenv 20.30.0-alt1:p11+380095.100.2.1@1746333720
[i586] MI2a:  target SELECTED: python3-module-virtualenv 20.30.0-alt1:p11+380095.100.2.1@1746333720
[i586] MI2a:  requesting to install python3-module-virtualenv (unspec'd ver; inspect with Debug::pkgMark-shallow)
[i586] MI2a:    marked for install (shallow): python3-module-virtualenv
[i586] MI2a:     satisfying Depends: python3-module-system-seed-wheels-wheels  (NULL)
[i586] MI2a:      maybe install (a direct target): python3-module-system-seed-wheels-wheels 0.0.1-alt1:sisyphus+270533.400.6.1@1619683380
[i586] MI2a:     target SELECTED: python3-module-system-seed-wheels-wheels 0.0.1-alt1:sisyphus+270533.400.6.1@1619683380
[i586] MI2a:     requesting to install python3-module-system-seed-wheels-wheels (unspec'd ver; inspect with Debug::pkgMark-shallow)
[i586] MI2a:       marked for install (shallow): python3-module-system-seed-wheels-wheels
[i586] MI2a:        satisfying Depends: python3-module-setuptools-wheel  (NULL)
[i586] MI2a:         maybe install (a direct target): python3-module-setuptools-wheel 1:75.8.0-alt2:p11+370642.440.7.1@1740585286
[i586] MI2a:        target SELECTED: python3-module-setuptools-wheel 1:75.8.0-alt2:p11+370642.440.7.1@1740585286
[i586] MI2a:        requesting to install python3-module-setuptools-wheel (unspec'd ver; inspect with Debug::pkgMark-shallow)
[i586] MI2a:          marked for install (shallow): python3-module-setuptools-wheel
[i586] MI2a:           satisfying Depends: python3(system_seed_wheels) < 0
[i586] MI2a:            maybe install (a providing target): python3-module-system-seed-wheels 0.0.1-alt1:sisyphus+270533.400.6.1@1619683380
[i586] MI2a:           target SELECTED: python3-module-system-seed-wheels 0.0.1-alt1:sisyphus+270533.400.6.1@1619683380
[i586] MI2a:           requesting to install python3-module-system-seed-wheels (unspec'd ver; inspect with Debug::pkgMark-shallow)
[i586] MI2a:             marked for install (shallow): python3-module-system-seed-wheels
[i586] MI2a:        satisfying Depends: python3-module-wheel-wheel  (NULL)
[i586] MI2a:         maybe install (a direct target): python3-module-wheel-wheel 0.45.1-alt1:p11+370642.340.7.1@1740584978
[i586] MI2a:        target SELECTED: python3-module-wheel-wheel 0.45.1-alt1:p11+370642.340.7.1@1740584978
[i586] MI2a:        requesting to install python3-module-wheel-wheel (unspec'd ver; inspect with Debug::pkgMark-shallow)
[i586] MI2a:          marked for install (shallow): python3-module-wheel-wheel
[i586] MI2a:        satisfying Depends: python3-module-pip-wheel  (NULL)
[i586] MI2a:         maybe install (a direct target): python3-module-pip-wheel 24.0-alt1:sisyphus+340181.100.1.1@1707480859
[i586] MI2a:        target SELECTED: python3-module-pip-wheel 24.0-alt1:sisyphus+340181.100.1.1@1707480859
[i586] MI2a:        requesting to install python3-module-pip-wheel (unspec'd ver; inspect with Debug::pkgMark-shallow)
[i586] MI2a:          marked for install (shallow): python3-module-pip-wheel
[i586] MI2a:     satisfying Depends: python3-module-distlib  (NULL)
[i586] MI2a:      maybe install (a direct target): python3-module-distlib 0.3.8-alt1:sisyphus+336560.100.2.1@1702987353
[i586] MI2a:     target SELECTED: python3-module-distlib 0.3.8-alt1:sisyphus+336560.100.2.1@1702987353
[i586] MI2a:     requesting to install python3-module-distlib (unspec'd ver; inspect with Debug::pkgMark-shallow)
[i586] MI2a:       marked for install (shallow): python3-module-distlib
[i586] MI2a:     satisfying Depends: python3-module-filelock  (NULL)
[i586] MI2a:      maybe install (a direct target): python3-module-filelock 3.16.1-alt1:p11+358127.100.3.1@1729244658
[i586] MI2a:     target SELECTED: python3-module-filelock 3.16.1-alt1:p11+358127.100.3.1@1729244658
[i586] MI2a:     requesting to install python3-module-filelock (unspec'd ver; inspect with Debug::pkgMark-shallow)
[i586] MI2a:       marked for install (shallow): python3-module-filelock
[i586] MI2a: marked for install (shallow): python3-module-pytest
[i586] MI2a:  satisfying Depends: python3-module-iniconfig  (NULL)
[i586] MI2a:   maybe install (a direct target): python3-module-iniconfig 2.0.0-alt1:sisyphus+314076.200.3.1@1674737275
[i586] MI2a:  target SELECTED: python3-module-iniconfig 2.0.0-alt1:sisyphus+314076.200.3.1@1674737275
[i586] MI2a:  requesting to install python3-module-iniconfig (unspec'd ver; inspect with Debug::pkgMark-shallow)
[i586] MI2a:    marked for install (shallow): python3-module-iniconfig
[i586] MI2a:  satisfying Depends: python3-module-pluggy  (NULL)
[i586] MI2a:   maybe install (a direct target): python3-module-pluggy 1.5.0-alt1:sisyphus+345632.100.2.1@1713864244
[i586] MI2a:  target SELECTED: python3-module-pluggy 1.5.0-alt1:sisyphus+345632.100.2.1@1713864244
[i586] MI2a:  requesting to install python3-module-pluggy (unspec'd ver; inspect with Debug::pkgMark-shallow)
[i586] MI2a:    marked for install (shallow): python3-module-pluggy
[i586] MI2a: marked for install (shallow): python3-module-rich
[i586] MI2a:  satisfying Depends: python3-module-markdown-it-py  (NULL)
[i586] MI2a:   maybe install (a providing target): python3-module-markdown-it 3.0.0-alt2:p11+372203.10400.14.1@1739205384
[i586] MI2a:  target SELECTED: python3-module-markdown-it 3.0.0-alt2:p11+372203.10400.14.1@1739205384
[i586] MI2a:  requesting to install python3-module-markdown-it (unspec'd ver; inspect with Debug::pkgMark-shallow)
[i586] MI2a:    marked for install (shallow): python3-module-markdown-it
[i586] MI2a:     satisfying Depends: python3-module-mdurl  (NULL)
[i586] MI2a:      maybe install (a direct target): python3-module-mdurl 0.1.2-alt1:sisyphus+318894.1000.3.1@1682420700
[i586] MI2a:     target SELECTED: python3-module-mdurl 0.1.2-alt1:sisyphus+318894.1000.3.1@1682420700
[i586] MI2a:     requesting to install python3-module-mdurl (unspec'd ver; inspect with Debug::pkgMark-shallow)
[i586] MI2a:       marked for install (shallow): python3-module-mdurl
[i586] MI2a:     satisfying Depends: python3(linkify_it) < 0
[i586] MI2a:      maybe install (a providing target): python3-module-linkify-it-py 2.0.3-alt1:sisyphus+343902.100.1.1@1711708185
[i586] MI2a:     target SELECTED: python3-module-linkify-it-py 2.0.3-alt1:sisyphus+343902.100.1.1@1711708185
[i586] MI2a:     requesting to install python3-module-linkify-it-py (unspec'd ver; inspect with Debug::pkgMark-shallow)
[i586] MI2a:       marked for install (shallow): python3-module-linkify-it-py
[i586] MI2a:        satisfying Depends: python3-module-uc-micro-py  (NULL)
[i586] MI2a:         maybe install (a direct target): python3-module-uc-micro-py 1.0.3-alt1:sisyphus+341790.100.1.1@1709309103
[i586] MI2a:        target SELECTED: python3-module-uc-micro-py 1.0.3-alt1:sisyphus+341790.100.1.1@1709309103
[i586] MI2a:        requesting to install python3-module-uc-micro-py (unspec'd ver; inspect with Debug::pkgMark-shallow)
[i586] MI2a:          marked for install (shallow): python3-module-uc-micro-py
[i586] MI2a:  satisfying Depends: python3-module-pygments  (NULL)
[i586] MI2a:   maybe install (a providing target): python3-module-Pygments 2.18.0-alt1:sisyphus+347552.100.1.1@1714992955
[i586] MI2a:  target SELECTED: python3-module-Pygments 2.18.0-alt1:sisyphus+347552.100.1.1@1714992955
[i586] MI2a:  requesting to install python3-module-Pygments (unspec'd ver; inspect with Debug::pkgMark-shallow)
[i586] MI2a:    marked for install (shallow): python3-module-Pygments
[i586] MI2a: marked for install (shallow): python3-module-dateutil
[i586] MI2a:  satisfying Depends: python3(six) < 0
[i586] MI2a:   maybe install (a providing target): python3-module-six 1.16.0-alt2:sisyphus+324249.100.1.1@1688484676
[i586] MI2a:  target SELECTED: python3-module-six 1.16.0-alt2:sisyphus+324249.100.1.1@1688484676
[i586] MI2a:  requesting to install python3-module-six (unspec'd ver; inspect with Debug::pkgMark-shallow)
[i586] MI2a:    marked for install (shallow): python3-module-six
[i586] MI2a: marked for install (shallow): python3-module-libcst
[i586] MI2a:  satisfying Depends: python3-module-pyyaml  (NULL)
[i586] MI2a:   maybe install (a providing target): python3-module-yaml 6.0.2-alt1:p11+383988.3140.19.1@1747242383
[i586] MI2a:  target SELECTED: python3-module-yaml 6.0.2-alt1:p11+383988.3140.19.1@1747242383
[i586] MI2a:  requesting to install python3-module-yaml (unspec'd ver; inspect with Debug::pkgMark-shallow)
[i586] MI2a:    marked for install (shallow): python3-module-yaml
[i586] MI2a:     satisfying Depends: libyaml-0.so.2 >= set:jeDuSUAbEuz1xrY3muBZ56F9Jbi2W3kR6iB5oRQxGfDDGyazcKxJ4shcJWS8IVb7
[i586] MI2a:      maybe install (a providing target): libyaml2 0.2.5-alt1:sisyphus+278391.100.1.1@1626094932
[i586] MI2a:     target SELECTED: libyaml2 0.2.5-alt1:sisyphus+278391.100.1.1@1626094932
[i586] MI2a:     requesting to install libyaml2 (unspec'd ver; inspect with Debug::pkgMark-shallow)
[i586] MI2a:       marked for install (shallow): libyaml2
[i586] MI2a: marked for install (shallow): python3-module-pydantic
[i586] MI2a:  satisfying Depends: python3-module-annotated-types  (NULL)
[i586] MI2a:   maybe install (a direct target): python3-module-annotated-types 0.6.0-alt1:sisyphus+340662.100.1.1@1707901407
[i586] MI2a:  target SELECTED: python3-module-annotated-types 0.6.0-alt1:sisyphus+340662.100.1.1@1707901407
[i586] MI2a:  requesting to install python3-module-annotated-types (unspec'd ver; inspect with Debug::pkgMark-shallow)
[i586] MI2a:    marked for install (shallow): python3-module-annotated-types
[i586] MI2a:  satisfying Depends: python3-module-pydantic-core  (NULL)
[i586] MI2a:   maybe install (a direct target): python3-module-pydantic-core 2.33.2-alt1:p11+383988.3525.29.1@1747315430
[i586] MI2a:  target SELECTED: python3-module-pydantic-core 2.33.2-alt1:p11+383988.3525.29.1@1747315430
[i586] MI2a:  requesting to install python3-module-pydantic-core (unspec'd ver; inspect with Debug::pkgMark-shallow)
[i586] MI2a:    marked for install (shallow): python3-module-pydantic-core
[i586] MI2a:  satisfying Depends: python3-module-typing-inspection  (NULL)
[i586] MI2a:   maybe install (a direct target): python3-module-typing-inspection 0.4.0-alt1:p11+383988.3510.29.1@1747314923
[i586] MI2a:  target SELECTED: python3-module-typing-inspection 0.4.0-alt1:p11+383988.3510.29.1@1747314923
[i586] MI2a:  requesting to install python3-module-typing-inspection (unspec'd ver; inspect with Debug::pkgMark-shallow)
[i586] MI2a:    marked for install (shallow): python3-module-typing-inspection
[i586] MI2a: marked for install (shallow): python3-module-inline-snapshot
[i586] MI2a:  satisfying Depends: python3(asttokens) < 0
[i586] MI2a:   maybe install (a providing target): python3-module-asttokens 2.4.1-alt1:sisyphus+338523.100.2.1@1706229862
[i586] MI2a:  target SELECTED: python3-module-asttokens 2.4.1-alt1:sisyphus+338523.100.2.1@1706229862
[i586] MI2a:  requesting to install python3-module-asttokens (unspec'd ver; inspect with Debug::pkgMark-shallow)
[i586] MI2a:    marked for install (shallow): python3-module-asttokens
[i586] MI2a:  satisfying Depends: python3(executing) < 0
[i586] MI2a:   maybe install (a providing target): python3-module-executing 2.2.0-alt1:p11+377603.1200.15.1@1745489475
[i586] MI2a:  target SELECTED: python3-module-executing 2.2.0-alt1:p11+377603.1200.15.1@1745489475
[i586] MI2a:  requesting to install python3-module-executing (unspec'd ver; inspect with Debug::pkgMark-shallow)
[i586] MI2a:    marked for install (shallow): python3-module-executing
[i586] MI2a: marked for install (shallow): python3-module-litestar
[i586] MI2a:  satisfying Depends: python3(advanced_alchemy.base) < 0
[i586] MI2a:  satisfying Depends: python3(advanced_alchemy.config.asyncio) < 0
[i586] MI2a:  satisfying Depends: python3(advanced_alchemy.config.common) < 0
[i586] MI2a:  satisfying Depends: python3(advanced_alchemy.config.engine) < 0
[i586] MI2a:  satisfying Depends: python3(advanced_alchemy.config.sync) < 0
[i586] MI2a:  satisfying Depends: python3(advanced_alchemy.extensions.litestar.dto) < 0
[i586] MI2a:  satisfying Depends: python3(advanced_alchemy.extensions.litestar.plugins) < 0
[i586] MI2a:  satisfying Depends: python3(advanced_alchemy.extensions.litestar.plugins.init.config.asyncio) < 0
[i586] MI2a:  satisfying Depends: python3(advanced_alchemy.extensions.litestar.plugins.init.config.common) < 0
[i586] MI2a:  satisfying Depends: python3(advanced_alchemy.extensions.litestar.plugins.init.config.sync) < 0
[i586] MI2a:  satisfying Depends: python3(advanced_alchemy.repository) < 0
[i586] MI2a:  satisfying Depends: python3(advanced_alchemy.repository._util) < 0
[i586] MI2a:  satisfying Depends: python3(advanced_alchemy.repository.typing) < 0
[i586] MI2a:  satisfying Depends: python3(advanced_alchemy.types) < 0
[i586] MI2a:  satisfying Depends: python3(anyio) < 0
[i586] MI2a:   maybe install (a providing target): python3-module-anyio 4.3.0-alt1:sisyphus+341920.100.1.1@1709492541
[i586] MI2a:  target SELECTED: python3-module-anyio 4.3.0-alt1:sisyphus+341920.100.1.1@1709492541
[i586] MI2a:  requesting to install python3-module-anyio (unspec'd ver; inspect with Debug::pkgMark-shallow)
[i586] MI2a:    marked for install (shallow): python3-module-anyio
[i586] MI2a:     satisfying Depends: python3-module-sniffio  (NULL)
[i586] MI2a:      maybe install (a direct target): python3-module-sniffio 1.3.1-alt1:sisyphus+341424.100.1.1@1708941879
[i586] MI2a:     target SELECTED: python3-module-sniffio 1.3.1-alt1:sisyphus+341424.100.1.1@1708941879
[i586] MI2a:     requesting to install python3-module-sniffio (unspec'd ver; inspect with Debug::pkgMark-shallow)
[i586] MI2a:       marked for install (shallow): python3-module-sniffio
[i586] MI2a:     satisfying Depends: python3(outcome) < 0
[i586] MI2a:      maybe install (a providing target): python3-module-outcome 1.3.0-alt1:sisyphus+332382.100.1.1@1697882349
[i586] MI2a:     target SELECTED: python3-module-outcome 1.3.0-alt1:sisyphus+332382.100.1.1@1697882349
[i586] MI2a:     requesting to install python3-module-outcome (unspec'd ver; inspect with Debug::pkgMark-shallow)
[i586] MI2a:       marked for install (shallow): python3-module-outcome
[i586] MI2a:        satisfying Depends: python3-module-attrs  (NULL)
[i586] MI2a:         maybe install (a direct target): python3-module-attrs 23.2.0-alt1:sisyphus+338876.100.1.2@1706109385
[i586] MI2a:        target SELECTED: python3-module-attrs 23.2.0-alt1:sisyphus+338876.100.1.2@1706109385
[i586] MI2a:        requesting to install python3-module-attrs (unspec'd ver; inspect with Debug::pkgMark-shallow)
[i586] MI2a:          marked for install (shallow): python3-module-attrs
[i586] MI2a:  satisfying Depends: python3(asyncpg) < 0
[i586] MI2a:   maybe install (a providing target): python3-module-asyncpg 0.29.0-alt2:sisyphus+333513.40110.73.1@1704637324
[i586] MI2a:  target SELECTED: python3-module-asyncpg 0.29.0-alt2:sisyphus+333513.40110.73.1@1704637324
[i586] MI2a:  requesting to install python3-module-asyncpg (unspec'd ver; inspect with Debug::pkgMark-shallow)
[i586] MI2a:    marked for install (shallow): python3-module-asyncpg
[i586] MI2a:  satisfying Depends: python3(click) < 0
[i586] MI2a:   maybe install (a providing target): python3-module-click 8.1.7-alt1:sisyphus+327424.100.2.1@1695395098
[i586] MI2a:  target SELECTED: python3-module-click 8.1.7-alt1:sisyphus+327424.100.2.1@1695395098
[i586] MI2a:  requesting to install python3-module-click (unspec'd ver; inspect with Debug::pkgMark-shallow)
[i586] MI2a:    marked for install (shallow): python3-module-click
[i586] MI2a:  satisfying Depends: python3(httpx) < 0
[i586] MI2a:   maybe install (a providing target): python3-module-httpx 0.27.0-alt1:sisyphus+347574.100.1.1@1715005951
[i586] MI2a:  target SELECTED: python3-module-httpx 0.27.0-alt1:sisyphus+347574.100.1.1@1715005951
[i586] MI2a:  requesting to install python3-module-httpx (unspec'd ver; inspect with Debug::pkgMark-shallow)
[i586] MI2a:    marked for install (shallow): python3-module-httpx
[i586] MI2a:     satisfying Depends: python3(certifi) < 0
[i586] MI2a:      maybe install (a providing target): python3-module-certifi 2024.8.30-alt1:p11+364852.100.1.1@1734011790
[i586] MI2a:     target SELECTED: python3-module-certifi 2024.8.30-alt1:p11+364852.100.1.1@1734011790
[i586] MI2a:     requesting to install python3-module-certifi (unspec'd ver; inspect with Debug::pkgMark-shallow)
[i586] MI2a:       marked for install (shallow): python3-module-certifi
[i586] MI2a:     satisfying Depends: python3(httpcore) < 0
[i586] MI2a:      maybe install (a providing target): python3-module-httpcore 1.0.5-alt1:sisyphus+347570.100.1.1@1715005713
[i586] MI2a:     target SELECTED: python3-module-httpcore 1.0.5-alt1:sisyphus+347570.100.1.1@1715005713
[i586] MI2a:     requesting to install python3-module-httpcore (unspec'd ver; inspect with Debug::pkgMark-shallow)
[i586] MI2a:       marked for install (shallow): python3-module-httpcore
[i586] MI2a:        satisfying Depends: python3(h11) < 0
[i586] MI2a:         maybe install (a providing target): python3-module-h11 0.14.0-alt1:sisyphus+312690.100.1.1@1672395335
[i586] MI2a:        target SELECTED: python3-module-h11 0.14.0-alt1:sisyphus+312690.100.1.1@1672395335
[i586] MI2a:        requesting to install python3-module-h11 (unspec'd ver; inspect with Debug::pkgMark-shallow)
[i586] MI2a:          marked for install (shallow): python3-module-h11
[i586] MI2a:        satisfying Depends: python3(socksio) < 0
[i586] MI2a:         maybe install (a providing target): python3-module-socksio 1.0.0-alt1:sisyphus+295017.1500.2.1@1644498004
[i586] MI2a:        target SELECTED: python3-module-socksio 1.0.0-alt1:sisyphus+295017.1500.2.1@1644498004
[i586] MI2a:        requesting to install python3-module-socksio (unspec'd ver; inspect with Debug::pkgMark-shallow)
[i586] MI2a:          marked for install (shallow): python3-module-socksio
[i586] MI2a:  satisfying Depends: python3(jose) < 0
[i586] MI2a:   maybe install (a providing target): python3-module-jose 3.3.0-alt3:sisyphus+320065.70.1.1@1683366909
[i586] MI2a:  target SELECTED: python3-module-jose 3.3.0-alt3:sisyphus+320065.70.1.1@1683366909
[i586] MI2a:  requesting to install python3-module-jose (unspec'd ver; inspect with Debug::pkgMark-shallow)
[i586] MI2a:    marked for install (shallow): python3-module-jose
[i586] MI2a:     satisfying Depends: python3(ecdsa) < 0
[i586] MI2a:      maybe install (a providing target): python3-module-ecdsa 0.18.0-alt1:sisyphus+306548.100.1.1@1662892185
[i586] MI2a:     target SELECTED: python3-module-ecdsa 0.18.0-alt1:sisyphus+306548.100.1.1@1662892185
[i586] MI2a:     requesting to install python3-module-ecdsa (unspec'd ver; inspect with Debug::pkgMark-shallow)
[i586] MI2a:       marked for install (shallow): python3-module-ecdsa
[i586] MI2a:     satisfying Depends: python3(pyasn1.codec.der) < 0
[i586] MI2a:      maybe install (a providing target): python3-module-pyasn1 0.6.0-alt1:sisyphus+343691.100.1.1@1711530038
[i586] MI2a:     target SELECTED: python3-module-pyasn1 0.6.0-alt1:sisyphus+343691.100.1.1@1711530038
[i586] MI2a:     requesting to install python3-module-pyasn1 (unspec'd ver; inspect with Debug::pkgMark-shallow)
[i586] MI2a:       marked for install (shallow): python3-module-pyasn1
[i586] MI2a:     satisfying Depends: python3(rsa) < 0
[i586] MI2a:      maybe install (a providing target): python3-module-rsa 4.9-alt2:p11+370642.5600.7.1@1740587117
[i586] MI2a:     target SELECTED: python3-module-rsa 4.9-alt2:p11+370642.5600.7.1@1740587117
[i586] MI2a:     requesting to install python3-module-rsa (unspec'd ver; inspect with Debug::pkgMark-shallow)
[i586] MI2a:       marked for install (shallow): python3-module-rsa
[i586] MI2a:  satisfying Depends: python3(msgspec) < 0
[i586] MI2a:   maybe install (a providing target): python3-module-msgspec 0.18.6-alt1:p11+383988.3550.29.1@1747316107
[i586] MI2a:  target SELECTED: python3-module-msgspec 0.18.6-alt1:p11+383988.3550.29.1@1747316107
[i586] MI2a:  requesting to install python3-module-msgspec (unspec'd ver; inspect with Debug::pkgMark-shallow)
[i586] MI2a:    marked for install (shallow): python3-module-msgspec
[i586] MI2a:  satisfying Depends: python3(multidict) < 0
[i586] MI2a:   maybe install (a providing target): python3-module-multidict 6.0.5-alt1:sisyphus+344299.100.1.1@1712158380
[i586] MI2a:  target SELECTED: python3-module-multidict 6.0.5-alt1:sisyphus+344299.100.1.1@1712158380
[i586] MI2a:  requesting to install python3-module-multidict (unspec'd ver; inspect with Debug::pkgMark-shallow)
[i586] MI2a:    marked for install (shallow): python3-module-multidict
[i586] MI2a:  satisfying Depends: python3(opentelemetry.instrumentation.asgi) < 0
[i586] MI2a:  satisfying Depends: python3(opentelemetry.semconv.trace) < 0
[i586] MI2a:   maybe install (a providing target): python3-module-opentelemetry-semantic-conventions 1.24.0-alt2:p11+353839.3300.5.1@1723792348
[i586] MI2a:  target SELECTED: python3-module-opentelemetry-semantic-conventions 1.24.0-alt2:p11+353839.3300.5.1@1723792348
[i586] MI2a:  requesting to install python3-module-opentelemetry-semantic-conventions (unspec'd ver; inspect with Debug::pkgMark-shallow)
[i586] MI2a:    marked for install (shallow): python3-module-opentelemetry-semantic-conventions
[i586] MI2a:     satisfying Depends: python3(deprecated) < 0
[i586] MI2a:      maybe install (a providing target): python3-module-deprecated 1.2.14-alt1:sisyphus+323063.100.1.1@1686816667
[i586] MI2a:     target SELECTED: python3-module-deprecated 1.2.14-alt1:sisyphus+323063.100.1.1@1686816667
[i586] MI2a:     requesting to install python3-module-deprecated (unspec'd ver; inspect with Debug::pkgMark-shallow)
[i586] MI2a:       marked for install (shallow): python3-module-deprecated
[i586] MI2a:        satisfying Depends: python3-module-wrapt  (NULL)
[i586] MI2a:         maybe install (a direct target): python3-module-wrapt 1.16.0-alt1:sisyphus+338885.100.1.2@1706112829
[i586] MI2a:        target SELECTED: python3-module-wrapt 1.16.0-alt1:sisyphus+338885.100.1.2@1706112829
[i586] MI2a:        requesting to install python3-module-wrapt (unspec'd ver; inspect with Debug::pkgMark-shallow)
[i586] MI2a:          marked for install (shallow): python3-module-wrapt
[i586] MI2a:  satisfying Depends: python3(opentelemetry.trace) < 0
[i586] MI2a:   maybe install (a providing target): python3-module-opentelemetry-api 1.24.0-alt2:p11+353839.3300.5.1@1723792348
[i586] MI2a:  target SELECTED: python3-module-opentelemetry-api 1.24.0-alt2:p11+353839.3300.5.1@1723792348
[i586] MI2a:  requesting to install python3-module-opentelemetry-api (unspec'd ver; inspect with Debug::pkgMark-shallow)
[i586] MI2a:    marked for install (shallow): python3-module-opentelemetry-api
[i586] MI2a:     satisfying Depends: python3(importlib_metadata) < 0
[i586] MI2a:      maybe install (a providing target): python3-module-importlib-metadata 7.1.0-alt1:sisyphus+343253.100.1.1@1711017097
[i586] MI2a:     target SELECTED: python3-module-importlib-metadata 7.1.0-alt1:sisyphus+343253.100.1.1@1711017097
[i586] MI2a:     requesting to install python3-module-importlib-metadata (unspec'd ver; inspect with Debug::pkgMark-shallow)
[i586] MI2a:       marked for install (shallow): python3-module-importlib-metadata
[i586] MI2a:        satisfying Depends: python3-module-zipp  (NULL)
[i586] MI2a:         maybe install (a direct target): python3-module-zipp 3.18.2-alt1:sisyphus+348194.200.2.1@1715938896
[i586] MI2a:        target SELECTED: python3-module-zipp 3.18.2-alt1:sisyphus+348194.200.2.1@1715938896
[i586] MI2a:        requesting to install python3-module-zipp (unspec'd ver; inspect with Debug::pkgMark-shallow)
[i586] MI2a:          marked for install (shallow): python3-module-zipp
[i586] MI2a:  satisfying Depends: python3(opentelemetry.util.http) < 0
[i586] MI2a:  satisfying Depends: python3(picologging) < 0
[i586] MI2a:   maybe install (a providing target): python3-module-picologging 0.9.3-alt1:p11+383988.3554.29.1@1747316217
[i586] MI2a:  target SELECTED: python3-module-picologging 0.9.3-alt1:p11+383988.3554.29.1@1747316217
[i586] MI2a:  requesting to install python3-module-picologging (unspec'd ver; inspect with Debug::pkgMark-shallow)
[i586] MI2a:    marked for install (shallow): python3-module-picologging
[i586] MI2a:  satisfying Depends: python3(polyfactory.exceptions) < 0
[i586] MI2a:   maybe install (a providing target): python3-module-polyfactory 2.21.0-alt1:p11+383988.3556.29.1@1747316265
[i586] MI2a:  target SELECTED: python3-module-polyfactory 2.21.0-alt1:p11+383988.3556.29.1@1747316265
[i586] MI2a:  requesting to install python3-module-polyfactory (unspec'd ver; inspect with Debug::pkgMark-shallow)
[i586] MI2a:    marked for install (shallow): python3-module-polyfactory
[i586] MI2a:     satisfying Depends: python3(faker) < 0
[i586] MI2a:      maybe install (a providing target): python3-module-faker 25.2.0-alt1:sisyphus+348035.100.1.1@1715675089
[i586] MI2a:     target SELECTED: python3-module-faker 25.2.0-alt1:sisyphus+348035.100.1.1@1715675089
[i586] MI2a:     requesting to install python3-module-faker (unspec'd ver; inspect with Debug::pkgMark-shallow)
[i586] MI2a:       marked for install (shallow): python3-module-faker
[i586] MI2a:  satisfying Depends: python3(prometheus_client) < 0
[i586] MI2a:   maybe install (a providing target): python3-module-prometheus_client 0.8.0-alt2:sisyphus+333384.200.2.1@1699359287
[i586] MI2a:  target SELECTED: python3-module-prometheus_client 0.8.0-alt2:sisyphus+333384.200.2.1@1699359287
[i586] MI2a:  requesting to install python3-module-prometheus_client (unspec'd ver; inspect with Debug::pkgMark-shallow)
[i586] MI2a:    marked for install (shallow): python3-module-prometheus_client
[i586] MI2a:     satisfying Depends: python3(twisted.internet) < 0
[i586] MI2a:      maybe install (a providing target): python3-module-twisted-core 22.10.0-alt3:sisyphus+341870.100.1.1@1709406646
[i586] MI2a:     target SELECTED: python3-module-twisted-core 22.10.0-alt3:sisyphus+341870.100.1.1@1709406646
[i586] MI2a:     requesting to install python3-module-twisted-core (unspec'd ver; inspect with Debug::pkgMark-shallow)
[i586] MI2a:       marked for install (shallow): python3-module-twisted-core
[i586] MI2a:        satisfying Depends: python3(appdirs) < 0
[i586] MI2a:         maybe install (a providing target): python3-module-appdirs 1.4.4-alt2:p11+370642.700.7.1@1740585347
[i586] MI2a:        target SELECTED: python3-module-appdirs 1.4.4-alt2:p11+370642.700.7.1@1740585347
[i586] MI2a:        requesting to install python3-module-appdirs (unspec'd ver; inspect with Debug::pkgMark-shallow)
[i586] MI2a:          marked for install (shallow): python3-module-appdirs
[i586] MI2a:        satisfying Depends: python3(automat) < 0
[i586] MI2a:         maybe install (a providing target): python3-module-automat 22.10.0-alt1:sisyphus+322927.200.2.1@1686736914
[i586] MI2a:        target SELECTED: python3-module-automat 22.10.0-alt1:sisyphus+322927.200.2.1@1686736914
[i586] MI2a:        requesting to install python3-module-automat (unspec'd ver; inspect with Debug::pkgMark-shallow)
[i586] MI2a:          marked for install (shallow): python3-module-automat
[i586] MI2a:        satisfying Depends: python3(hyperlink) < 0
[i586] MI2a:         maybe install (a providing target): python3-module-hyperlink 21.0.0-alt1.1:sisyphus+304836.100.1.1@1659710964
[i586] MI2a:        target SELECTED: python3-module-hyperlink 21.0.0-alt1.1:sisyphus+304836.100.1.1@1659710964
[i586] MI2a:        requesting to install python3-module-hyperlink (unspec'd ver; inspect with Debug::pkgMark-shallow)
[i586] MI2a:          marked for install (shallow): python3-module-hyperlink
[i586] MI2a:        satisfying Depends: python3(imp) < 0
[i586] MI2a:         maybe install (a providing target): python3-module-zombie-imp 0.0.2-alt1:sisyphus+339293.100.1.1@1706537230
[i586] MI2a:        target SELECTED: python3-module-zombie-imp 0.0.2-alt1:sisyphus+339293.100.1.1@1706537230
[i586] MI2a:        requesting to install python3-module-zombie-imp (unspec'd ver; inspect with Debug::pkgMark-shallow)
[i586] MI2a:          marked for install (shallow): python3-module-zombie-imp
[i586] MI2a:        satisfying Depends: python3(serial) < 0
[i586] MI2a:         maybe install (a providing target): python3-module-serial 3.5-alt2:sisyphus+281995.100.1.1@1628172783
[i586] MI2a:        target SELECTED: python3-module-serial 3.5-alt2:sisyphus+281995.100.1.1@1628172783
[i586] MI2a:        requesting to install python3-module-serial (unspec'd ver; inspect with Debug::pkgMark-shallow)
[i586] MI2a:          marked for install (shallow): python3-module-serial
[i586] MI2a:           satisfying Depends: python3(hid) < 0
[i586] MI2a:            maybe install (a providing target): python3-module-cython-hidapi 0.14.0-alt1.1:sisyphus+333513.54340.73.1@1704649757
[i586] MI2a:           target SELECTED: python3-module-cython-hidapi 0.14.0-alt1.1:sisyphus+333513.54340.73.1@1704649757
[i586] MI2a:           requesting to install python3-module-cython-hidapi (unspec'd ver; inspect with Debug::pkgMark-shallow)
[i586] MI2a:             marked for install (shallow): python3-module-cython-hidapi
[i586] MI2a:              satisfying Depends: libhidapi-hidraw.so.0 >= set:idVzQSm8qwHaDxTkTjc0uUa9b4LCTWaiqTzomaKPl5
[i586] MI2a:               maybe install (a providing target): libhidapi 0.12.0-alt1_1:sisyphus+303213.100.1.1@1657034193
[i586] MI2a:              target SELECTED: libhidapi 0.12.0-alt1_1:sisyphus+303213.100.1.1@1657034193
[i586] MI2a:              requesting to install libhidapi (unspec'd ver; inspect with Debug::pkgMark-shallow)
[i586] MI2a:                marked for install (shallow): libhidapi
[i586] MI2a:                 satisfying Depends: libusb-1.0.so.0 >= set:kfVTRgUEIUmjFX2IAipIvyS7RTRZqexJaD3JlmiYanqVHFDk94KrEEGfYdbQ1ana
[i586] MI2a:                  maybe install (a providing target): libusb 1.0.27-alt1:sisyphus+347412.100.1.1@1714739652
[i586] MI2a:                 target SELECTED: libusb 1.0.27-alt1:sisyphus+347412.100.1.1@1714739652
[i586] MI2a:                 requesting to install libusb (unspec'd ver; inspect with Debug::pkgMark-shallow)
[i586] MI2a:                   marked for install (shallow): libusb
[i586] MI2a:        satisfying Depends: python3(tkinter.messagebox) < 0
[i586] MI2a:         maybe install (a providing target): python3-modules-tkinter 3.12.7-alt1:p11+358835.100.7.1@1731756103
[i586] MI2a:        target SELECTED: python3-modules-tkinter 3.12.7-alt1:p11+358835.100.7.1@1731756103
[i586] MI2a:        requesting to install python3-modules-tkinter (unspec'd ver; inspect with Debug::pkgMark-shallow)
[i586] MI2a:          marked for install (shallow): python3-modules-tkinter
[i586] MI2a:           satisfying Depends: tk  (NULL)
[i586] MI2a:            maybe install (a direct target): tk 8.6.13-alt1:p11+349650.100.1.1@1716881808
[i586] MI2a:           target SELECTED: tk 8.6.13-alt1:p11+349650.100.1.1@1716881808
[i586] MI2a:           requesting to install tk (unspec'd ver; inspect with Debug::pkgMark-shallow)
[i586] MI2a:             marked for install (shallow): tk
[i586] MI2a:              satisfying Depends: tcl = 8.6.13
[i586] MI2a:               maybe install (a direct target): tcl 8.6.13-alt1:p11+349609.100.1.2@1716835382
[i586] MI2a:              target SELECTED: tcl 8.6.13-alt1:p11+349609.100.1.2@1716835382
[i586] MI2a:              requesting to install tcl (unspec'd ver; inspect with Debug::pkgMark-shallow)
[i586] MI2a:                marked for install (shallow): tcl
[i586] MI2a:                 satisfying Depends: libtcl = 8.6.13-alt1:p11+349609.100.1.2
[i586] MI2a:                  maybe install (a direct target): libtcl 8.6.13-alt1:p11+349609.100.1.2@1716835382
[i586] MI2a:                 target SELECTED: libtcl 8.6.13-alt1:p11+349609.100.1.2@1716835382
[i586] MI2a:                 requesting to install libtcl (unspec'd ver; inspect with Debug::pkgMark-shallow)
[i586] MI2a:                   marked for install (shallow): libtcl
[i586] MI2a:              satisfying Depends: libtk = 8.6.13-alt1:p11+349650.100.1.1
[i586] MI2a:               maybe install (a direct target): libtk 8.6.13-alt1:p11+349650.100.1.1@1716881808
[i586] MI2a:              target SELECTED: libtk 8.6.13-alt1:p11+349650.100.1.1@1716881808
[i586] MI2a:              requesting to install libtk (unspec'd ver; inspect with Debug::pkgMark-shallow)
[i586] MI2a:                marked for install (shallow): libtk
[i586] MI2a:                 satisfying Depends: libX11.so.6 >= set:ogMoYIg59hgY2Ksjj8xakpdaqBLhyGHkYepwDnaMadD1HA0P0g20QAKbGl6fAdJ2C8OexpjNQ5ql4NGeswEb1URwrG2Fg3NW15casGTM96Rq9exvtgJ3o2ZlXR60sMmZy7U2jDRcFQapAC8THZoXTSqm40amQoV8m3KXnOJXplz6iHDq06CO3APr9TF1ovR0Oxj8oEpVAfop5ky0NVwOIsKTSL4q1solD0SXh0FHPpGa1wCmd0nurceaLNYjeHxeZBH40ERMjxbJzZt8baZ3vnWR8cuciZ31W9P54b4smZeetuEYpLhyd6D0zdcsIgmZk1Mklk3hVK3y2wB3rrflOM9ck2XaQx6Oai1FeNaVIzUZbu5JZkSx6Rj7rlH0R51WuSY0sbrdZeSb
[i586] MI2a:                  maybe install (a providing target): libX11 3:1.8.8-alt1:sisyphus+343583.100.1.1@1711440722
[i586] MI2a:                 target SELECTED: libX11 3:1.8.8-alt1:sisyphus+343583.100.1.1@1711440722
[i586] MI2a:                 requesting to install libX11 (unspec'd ver; inspect with Debug::pkgMark-shallow)
[i586] MI2a:                   marked for install (shallow): libX11
[i586] MI2a:                    satisfying Depends: libxcb.so.1 >= set:ni0Q79T9m8c8LtIHEZvE2to7CMOpYYJtPQlu1To9g36rmZ7fk1
[i586] MI2a:                     maybe install (a providing target): libxcb 1.17.0-alt1:sisyphus+345308.200.1.1@1713342009
[i586] MI2a:                    target SELECTED: libxcb 1.17.0-alt1:sisyphus+345308.200.1.1@1713342009
[i586] MI2a:                    requesting to install libxcb (unspec'd ver; inspect with Debug::pkgMark-shallow)
[i586] MI2a:                      marked for install (shallow): libxcb
[i586] MI2a:                       satisfying Depends: libXau.so.6 >= set:ge34k81
[i586] MI2a:                        maybe install (a providing target): libXau 1.0.11-alt1:sisyphus+311428.100.1.1@1670577440
[i586] MI2a:                       target SELECTED: libXau 1.0.11-alt1:sisyphus+311428.100.1.1@1670577440
[i586] MI2a:                       requesting to install libXau (unspec'd ver; inspect with Debug::pkgMark-shallow)
[i586] MI2a:                         marked for install (shallow): libXau
[i586] MI2a:                       satisfying Depends: libXdmcp.so.6 >= set:jiOzo
[i586] MI2a:                        maybe install (a providing target): libXdmcp 1.1.5-alt1:sisyphus+343583.700.1.1@1711441073
[i586] MI2a:                       target SELECTED: libXdmcp 1.1.5-alt1:sisyphus+343583.700.1.1@1711441073
[i586] MI2a:                       requesting to install libXdmcp (unspec'd ver; inspect with Debug::pkgMark-shallow)
[i586] MI2a:                         marked for install (shallow): libXdmcp
[i586] MI2a:                    satisfying Depends: libX11-locales = 3:1.8.8-alt1:sisyphus+343583.100.1.1
[i586] MI2a:                     maybe install (a direct target): libX11-locales 3:1.8.8-alt1:sisyphus+343583.100.1.1@1711440719
[i586] MI2a:                    target SELECTED: libX11-locales 3:1.8.8-alt1:sisyphus+343583.100.1.1@1711440719
[i586] MI2a:                    requesting to install libX11-locales (unspec'd ver; inspect with Debug::pkgMark-shallow)
[i586] MI2a:                      marked for install (shallow): libX11-locales
[i586] MI2a:                 satisfying Depends: libXft.so.2 >= set:kg9tcuToQBDJiqX3qVi9WK9CC7eUP6u4Wh3S
[i586] MI2a:                  maybe install (a providing target): libXft 2.3.8-alt1:sisyphus+331490.400.1.1@1697023273
[i586] MI2a:                 target SELECTED: libXft 2.3.8-alt1:sisyphus+331490.400.1.1@1697023273
[i586] MI2a:                 requesting to install libXft (unspec'd ver; inspect with Debug::pkgMark-shallow)
[i586] MI2a:                   marked for install (shallow): libXft
[i586] MI2a:                    satisfying Depends: libXrender.so.1 >= set:jeLBsIE8aSZvn3omzyXcqHWM25rDldXnPaZxi1HVLbcZL2QyAP45QM0
[i586] MI2a:                     maybe install (a providing target): libXrender 0.9.11-alt1:sisyphus+308841.100.1.1@1666436131
[i586] MI2a:                    target SELECTED: libXrender 0.9.11-alt1:sisyphus+308841.100.1.1@1666436131
[i586] MI2a:                    requesting to install libXrender (unspec'd ver; inspect with Debug::pkgMark-shallow)
[i586] MI2a:                      marked for install (shallow): libXrender
[i586] MI2a:                    satisfying Depends: libfontconfig.so.1 >= set:lfTbaL2nZaZCcCx3h9VxSyDq49U4UKO0chrehDDiXxzdZz1oSfzmCJ3ssp70pCM2KbupHOlAiCG3LSIZwS6ju7IhJhfmy4IMCR2v
[i586] MI2a:                     maybe install (a providing target): libfontconfig1 2.16.0-alt1:p11+381864.100.3.1@1747299318
[i586] MI2a:                    target SELECTED: libfontconfig1 2.16.0-alt1:p11+381864.100.3.1@1747299318
[i586] MI2a:                    requesting to install libfontconfig1 (unspec'd ver; inspect with Debug::pkgMark-shallow)
[i586] MI2a:                      marked for install (shallow): libfontconfig1
[i586] MI2a:                       satisfying Depends: libfreetype.so.6 >= set:lgqTiyftOqKxwdqnIV5HufX080aBTqlvVAdZBtPOwgGxyybL8jpBd9E7U1S0
[i586] MI2a:                        maybe install (a providing target): libfreetype 2.13.2-alt1:sisyphus+328677.100.1.1@1693834346
[i586] MI2a:                       target SELECTED: libfreetype 2.13.2-alt1:sisyphus+328677.100.1.1@1693834346
[i586] MI2a:                       requesting to install libfreetype (unspec'd ver; inspect with Debug::pkgMark-shallow)
[i586] MI2a:                         marked for install (shallow): libfreetype
[i586] MI2a:                          satisfying PreDepends: libharfbuzz  (NULL)
[i586] MI2a:                           maybe install (a direct target): libharfbuzz 10.3.0-alt1:p11+375809.200.6.1@1743422574
[i586] MI2a:                          target SELECTED: libharfbuzz 10.3.0-alt1:p11+375809.200.6.1@1743422574
[i586] MI2a:                          requesting to install libharfbuzz (unspec'd ver; inspect with Debug::pkgMark-shallow)
[i586] MI2a:                            marked for install (shallow): libharfbuzz
[i586] MI2a:                             satisfying Depends: libgraphite2.so.3 >= set:kf32hGmUjq3tuKutzOJRzIQSHEyjposq2iEoszFE7SlOdnc
[i586] MI2a:                              maybe install (a providing target): libgraphite2 1.3.14-alt2.1:sisyphus+279571.100.1.2@1626605157
[i586] MI2a:                             target SELECTED: libgraphite2 1.3.14-alt2.1:sisyphus+279571.100.1.2@1626605157
[i586] MI2a:                             requesting to install libgraphite2 (unspec'd ver; inspect with Debug::pkgMark-shallow)
[i586] MI2a:                               marked for install (shallow): libgraphite2
[i586] MI2a:                          satisfying Depends: libbrotlidec.so.1 >= set:hgSP7
[i586] MI2a:                           maybe install (a providing target): libbrotlidec 1.1.0-alt1:sisyphus+328501.100.1.1@1693598420
[i586] MI2a:                          target SELECTED: libbrotlidec 1.1.0-alt1:sisyphus+328501.100.1.1@1693598420
[i586] MI2a:                          requesting to install libbrotlidec (unspec'd ver; inspect with Debug::pkgMark-shallow)
[i586] MI2a:                            marked for install (shallow): libbrotlidec
[i586] MI2a:                             satisfying Depends: libbrotlicommon = 1.1.0-alt1:sisyphus+328501.100.1.1
[i586] MI2a:                              maybe install (a direct target): libbrotlicommon 1.1.0-alt1:sisyphus+328501.100.1.1@1693598420
[i586] MI2a:                             target SELECTED: libbrotlicommon 1.1.0-alt1:sisyphus+328501.100.1.1@1693598420
[i586] MI2a:                             requesting to install libbrotlicommon (unspec'd ver; inspect with Debug::pkgMark-shallow)
[i586] MI2a:                               marked for install (shallow): libbrotlicommon
[i586] MI2a:                          satisfying Depends: libpng16.so.16 >= set:lgOKIQUxni0O7jHgjpNW6A1wpahp3UbHTCRKMJBuQNMRZ2RrxxTI5e42UDd
[i586] MI2a:                           maybe install (a providing target): libpng16 1.6.42-alt2:sisyphus+339555.100.1.1@1706781690
[i586] MI2a:                          target SELECTED: libpng16 1.6.42-alt2:sisyphus+339555.100.1.1@1706781690
[i586] MI2a:                          requesting to install libpng16 (unspec'd ver; inspect with Debug::pkgMark-shallow)
[i586] MI2a:                            marked for install (shallow): libpng16
[i586] MI2a:                 satisfying Depends: libXss.so.1 >= set:hequImNheF2
[i586] MI2a:                  maybe install (a providing target): libXScrnSaver 1.2.4-alt1:sisyphus+311188.500.1.1@1670233772
[i586] MI2a:                 target SELECTED: libXScrnSaver 1.2.4-alt1:sisyphus+311188.500.1.1@1670233772
[i586] MI2a:                 requesting to install libXScrnSaver (unspec'd ver; inspect with Debug::pkgMark-shallow)
[i586] MI2a:                   marked for install (shallow): libXScrnSaver
[i586] MI2a:                    satisfying Depends: libXext.so.6 >= set:liZBRXKXiahqLHgP0
[i586] MI2a:                     maybe install (a providing target): libXext 1.3.6-alt1:sisyphus+343583.1000.1.1@1711441114
[i586] MI2a:                    target SELECTED: libXext 1.3.6-alt1:sisyphus+343583.1000.1.1@1711441114
[i586] MI2a:                    requesting to install libXext (unspec'd ver; inspect with Debug::pkgMark-shallow)
[i586] MI2a:                      marked for install (shallow): libXext
[i586] MI2a:           satisfying Depends: tcl-tix  (NULL)
[i586] MI2a:            maybe install (a direct target): tcl-tix 8.4.3-alt4:sisyphus+277292.300.2.1@1625442551
[i586] MI2a:           target SELECTED: tcl-tix 8.4.3-alt4:sisyphus+277292.300.2.1@1625442551
[i586] MI2a:           requesting to install tcl-tix (unspec'd ver; inspect with Debug::pkgMark-shallow)
[i586] MI2a:             marked for install (shallow): tcl-tix
[i586] MI2a:        satisfying Depends: python3-module-twisted-logger = 22.10.0-alt3:sisyphus+341870.100.1.1
[i586] MI2a:         maybe install (a direct target): python3-module-twisted-logger 22.10.0-alt3:sisyphus+341870.100.1.1@1709406646
[i586] MI2a:        target SELECTED: python3-module-twisted-logger 22.10.0-alt3:sisyphus+341870.100.1.1@1709406646
[i586] MI2a:        requesting to install python3-module-twisted-logger (unspec'd ver; inspect with Debug::pkgMark-shallow)
[i586] MI2a:          marked for install (shallow): python3-module-twisted-logger
[i586] MI2a:           satisfying Depends: python3(constantly) < 0
[i586] MI2a:            maybe install (a providing target): python3-module-constantly 15.1.0-alt7:sisyphus+338906.100.1.1@1706107088
[i586] MI2a:           target SELECTED: python3-module-constantly 15.1.0-alt7:sisyphus+338906.100.1.1@1706107088
[i586] MI2a:           requesting to install python3-module-constantly (unspec'd ver; inspect with Debug::pkgMark-shallow)
[i586] MI2a:             marked for install (shallow): python3-module-constantly
[i586] MI2a:           satisfying Depends: python3(incremental) < 0
[i586] MI2a:            maybe install (a providing target): python3-module-incremental 22.10.0-alt1:sisyphus+312706.100.1.1@1672404273
[i586] MI2a:           target SELECTED: python3-module-incremental 22.10.0-alt1:sisyphus+312706.100.1.1@1672404273
[i586] MI2a:           requesting to install python3-module-incremental (unspec'd ver; inspect with Debug::pkgMark-shallow)
[i586] MI2a:             marked for install (shallow): python3-module-incremental
[i586] MI2a:        satisfying Depends: python3-module-twisted-web = 22.10.0-alt3:sisyphus+341870.100.1.1
[i586] MI2a:         maybe install (a direct target): python3-module-twisted-web 22.10.0-alt3:sisyphus+341870.100.1.1@1709406646
[i586] MI2a:        target SELECTED: python3-module-twisted-web 22.10.0-alt3:sisyphus+341870.100.1.1@1709406646
[i586] MI2a:        requesting to install python3-module-twisted-web (unspec'd ver; inspect with Debug::pkgMark-shallow)
[i586] MI2a:          marked for install (shallow): python3-module-twisted-web
[i586] MI2a:           satisfying Depends: python3(h2.config) < 0
[i586] MI2a:            maybe install (a providing target): python3-module-h2 4.1.0-alt1:sisyphus+325714.100.2.2@1690478873
[i586] MI2a:           target SELECTED: python3-module-h2 4.1.0-alt1:sisyphus+325714.100.2.2@1690478873
[i586] MI2a:           requesting to install python3-module-h2 (unspec'd ver; inspect with Debug::pkgMark-shallow)
[i586] MI2a:             marked for install (shallow): python3-module-h2
[i586] MI2a:              satisfying Depends: python3-module-hyperframe < 7
[i586] MI2a:               maybe install (a direct target): python3-module-hyperframe 6.0.1-alt1:sisyphus+270376.300.2.1@1618957001
[i586] MI2a:              target SELECTED: python3-module-hyperframe 6.0.1-alt1:sisyphus+270376.300.2.1@1618957001
[i586] MI2a:              requesting to install python3-module-hyperframe (unspec'd ver; inspect with Debug::pkgMark-shallow)
[i586] MI2a:                marked for install (shallow): python3-module-hyperframe
[i586] MI2a:              satisfying Depends: python3-module-hpack < 5
[i586] MI2a:               maybe install (a direct target): python3-module-hpack 4.0.0-alt1:sisyphus+270376.200.1.1@1618956626
[i586] MI2a:              target SELECTED: python3-module-hpack 4.0.0-alt1:sisyphus+270376.200.1.1@1618956626
[i586] MI2a:              requesting to install python3-module-hpack (unspec'd ver; inspect with Debug::pkgMark-shallow)
[i586] MI2a:                marked for install (shallow): python3-module-hpack
[i586] MI2a:           satisfying Depends: python3(priority) < 0
[i586] MI2a:            maybe install (a providing target): python3-module-priority 2.0.0-alt3:sisyphus+338701.100.1.2@1705988383
[i586] MI2a:           target SELECTED: python3-module-priority 2.0.0-alt3:sisyphus+338701.100.1.2@1705988383
[i586] MI2a:           requesting to install python3-module-priority (unspec'd ver; inspect with Debug::pkgMark-shallow)
[i586] MI2a:             marked for install (shallow): python3-module-priority
[i586] MI2a:        satisfying Depends: python3-module-twisted-words = 22.10.0-alt3:sisyphus+341870.100.1.1
[i586] MI2a:         maybe install (a direct target): python3-module-twisted-words 22.10.0-alt3:sisyphus+341870.100.1.1@1709406646
[i586] MI2a:        target SELECTED: python3-module-twisted-words 22.10.0-alt3:sisyphus+341870.100.1.1@1709406646
[i586] MI2a:        requesting to install python3-module-twisted-words (unspec'd ver; inspect with Debug::pkgMark-shallow)
[i586] MI2a:          marked for install (shallow): python3-module-twisted-words
[i586] MI2a:  satisfying Depends: python3(psycopg) < 0
[i586] MI2a:   maybe install (a providing target): python3-module-psycopg 3.2.7-alt1:p11+383988.3100.19.1@1747242336
[i586] MI2a:  target SELECTED: python3-module-psycopg 3.2.7-alt1:p11+383988.3100.19.1@1747242336
[i586] MI2a:  requesting to install python3-module-psycopg (unspec'd ver; inspect with Debug::pkgMark-shallow)
[i586] MI2a:    marked for install (shallow): python3-module-psycopg
[i586] MI2a:     satisfying Depends: python3(shapely.geometry.base) < 0
[i586] MI2a:      maybe install (a providing target): python3-module-shapely 2.0.7-alt1:p11+370642.6200.7.1@1740587379
[i586] MI2a:     target SELECTED: python3-module-shapely 2.0.7-alt1:p11+370642.6200.7.1@1740587379
[i586] MI2a:     requesting to install python3-module-shapely (unspec'd ver; inspect with Debug::pkgMark-shallow)
[i586] MI2a:       marked for install (shallow): python3-module-shapely
[i586] MI2a:        satisfying Depends: libgeos_c.so.1 >= set:nfsaPpFrau5kH3RQqR8x5681ZpS7wVRcbw3YB9vL55swG4c1DMdRyE3uZ0ZobZsXHjghO2amVuwa3OCCOGi0XwFB4Y20wyNSQup2LChoZGgeSJzSZEcyV8G71CxZ0D79jNNBgsUouPE0vmVDOs7x1o39va0L7UedZxo5dWZ4bw5kzTk0zS3S94Ehy293He5tFH0P7RppRdab4oeDHiAhStcqGPVIQRmZ6iKibwWO5N8fiVJi3TWCfiFA6EEERhCuBO9dbEpPq8ruKLG2hQ0fLsdd0N1jfy5VZA4oXu2Nuwa8h1JW3MkcMaP1GwsoO9FfZDnudil0wIodnxZzlIUMGkedbxKFyM3c9h5oBgEcALZ74G6gU83Ke9A4fDl7CAAnrfcoYM5beBMGB2BjhWKjpX2wBZnz0BQSyBSzNsUqVOSH04n3
[i586] MI2a:         maybe install (a providing target): libgeos 3.12.1-alt1:sisyphus+334260.100.1.1@1699789560
[i586] MI2a:        target SELECTED: libgeos 3.12.1-alt1:sisyphus+334260.100.1.1@1699789560
[i586] MI2a:        requesting to install libgeos (unspec'd ver; inspect with Debug::pkgMark-shallow)
[i586] MI2a:          marked for install (shallow): libgeos
[i586] MI2a:        satisfying Depends: python3(numpy) < 0
[i586] MI2a:         maybe install (a providing target): python3-module-numpy 1:1.26.5-alt1:p11+352888.100.4.1@1722279796
[i586] MI2a:        target SELECTED: python3-module-numpy 1:1.26.5-alt1:p11+352888.100.4.1@1722279796
[i586] MI2a:        requesting to install python3-module-numpy (unspec'd ver; inspect with Debug::pkgMark-shallow)
[i586] MI2a:          marked for install (shallow): python3-module-numpy
[i586] MI2a:           satisfying Depends: liblapack.so.4 >= set:ojHKUptFIKqhToPKEDZbDNEOgKZarbNzKM9HZ9OfUNSOo2tR6upPkSTHhaJ9zfmzkLehkw32XjvYkgMjqZ50bN7lxFXZxb
[i586] MI2a:            maybe install (a providing target): liblapack 1:3.8.0-alt8:p11+379386.100.2.1@1744192727
[i586] MI2a:           target SELECTED: liblapack 1:3.8.0-alt8:p11+379386.100.2.1@1744192727
[i586] MI2a:           requesting to install liblapack (unspec'd ver; inspect with Debug::pkgMark-shallow)
[i586] MI2a:             marked for install (shallow): liblapack
[i586] MI2a:              satisfying Depends: libgfortran.so.5 >= set:okAaMj4uBKwhkPdBq1vi1pzFEFsaZdFwca
[i586] MI2a:               maybe install (a providing target): libgfortran5 13.2.1-alt3:sisyphus+339335.100.1.1@1706563095
[i586] MI2a:              target SELECTED: libgfortran5 13.2.1-alt3:sisyphus+339335.100.1.1@1706563095
[i586] MI2a:              requesting to install libgfortran5 (unspec'd ver; inspect with Debug::pkgMark-shallow)
[i586] MI2a:                marked for install (shallow): libgfortran5
[i586] MI2a:                 satisfying Depends: libquadmath0 = 13.2.1-alt3:sisyphus+339335.100.1.1
[i586] MI2a:                  maybe install (a direct target): libquadmath0 13.2.1-alt3:sisyphus+339335.100.1.1@1706563095
[i586] MI2a:                 target SELECTED: libquadmath0 13.2.1-alt3:sisyphus+339335.100.1.1@1706563095
[i586] MI2a:                 requesting to install libquadmath0 (unspec'd ver; inspect with Debug::pkgMark-shallow)
[i586] MI2a:                   marked for install (shallow): libquadmath0
[i586] MI2a:              satisfying Depends: libopenblas.so.0 >= set:rjCxTpZl1LLbCG8tMAW0MghMBeZGV3d0geZByAlf2hCnTjOs24cLi2Q0cNLEfijiaOdqAwtMZ4bLprsmvqNWv4yyYauaYjTQ30Z2pU0u8GR9Rpt0GgsUOyIXk9xDFbEuyvgmZBBVDXrbg8O62WlseHncG3awL3fgCMZsv7ZFAAAqOlL58jo5HlCaAqRI6dIO60wPdOcZqcZ2DBI44Nypbx7appgrj7cKTPFII3ED394i4kT3ncKiq1sfzn0c2uZC8ZjTva0QriNCxh1izNiVPEPOwAUxhjePCzJ7P9gbsn63rGT7DkIQbS09Zj6KfazgyMnl2vRvyMcF8axj77TtdbnV8NjRuhGGSRkMY1jXCEo3Z5MNdAW913cbE1df3JSCDkJ111GuUq92fgttIlSG000AN7yze
[i586] MI2a:               maybe install (a providing target): libopenblas 0.3.27-alt1:sisyphus+348275.100.2.1@1716195843
[i586] MI2a:              target SELECTED: libopenblas 0.3.27-alt1:sisyphus+348275.100.2.1@1716195843
[i586] MI2a:              requesting to install libopenblas (unspec'd ver; inspect with Debug::pkgMark-shallow)
[i586] MI2a:                marked for install (shallow): libopenblas
[i586] MI2a:              satisfying Depends: libxblas.so.0 >= set:niNDETaaGg2ibbI86epWXK05U785Uq6VIIAwIh851eJRZ6UtoWfmbnZgff47CVapOrlbjQsKgarQ5cD09
[i586] MI2a:               maybe install (a providing target): libxblas 1.0.248-alt2:p11+349786.100.1.1@1716944249
[i586] MI2a:              target SELECTED: libxblas 1.0.248-alt2:p11+349786.100.1.1@1716944249
[i586] MI2a:              requesting to install libxblas (unspec'd ver; inspect with Debug::pkgMark-shallow)
[i586] MI2a:                marked for install (shallow): libxblas
[i586] MI2a:        satisfying Depends: python3(numpy.testing) < 0
[i586] MI2a:         maybe install (a providing target): python3-module-numpy-testing 1:1.26.5-alt1:p11+352888.100.4.1@1722279796
[i586] MI2a:        target SELECTED: python3-module-numpy-testing 1:1.26.5-alt1:p11+352888.100.4.1@1722279796
[i586] MI2a:        requesting to install python3-module-numpy-testing (unspec'd ver; inspect with Debug::pkgMark-shallow)
[i586] MI2a:          marked for install (shallow): python3-module-numpy-testing
[i586] MI2a:  satisfying Depends: python3(redis.asyncio) < 0
[i586] MI2a:   maybe install (a providing target): python3-module-redis-py 4.5.5-alt1.1:sisyphus+332415.100.1.1@1697904078
[i586] MI2a:  target SELECTED: python3-module-redis-py 4.5.5-alt1.1:sisyphus+332415.100.1.1@1697904078
[i586] MI2a:  requesting to install python3-module-redis-py (unspec'd ver; inspect with Debug::pkgMark-shallow)
[i586] MI2a:    marked for install (shallow): python3-module-redis-py
[i586] MI2a:  satisfying Depends: python3(sqlalchemy) < 0
[i586] MI2a:   maybe install (a providing target): python3-module-sqlalchemy 2.0.37-alt0.1:p11+373344.100.3.1@1739410342
[i586] MI2a:  target SELECTED: python3-module-sqlalchemy 2.0.37-alt0.1:p11+373344.100.3.1@1739410342
[i586] MI2a:  requesting to install python3-module-sqlalchemy (unspec'd ver; inspect with Debug::pkgMark-shallow)
[i586] MI2a:    marked for install (shallow): python3-module-sqlalchemy
[i586] MI2a:     satisfying Depends: python3-modules-sqlite3  (NULL)
[i586] MI2a:      maybe install (a direct target): python3-modules-sqlite3 3.12.7-alt1:p11+358835.100.7.1@1731756103
[i586] MI2a:     target SELECTED: python3-modules-sqlite3 3.12.7-alt1:p11+358835.100.7.1@1731756103
[i586] MI2a:     requesting to install python3-modules-sqlite3 (unspec'd ver; inspect with Debug::pkgMark-shallow)
[i586] MI2a:       marked for install (shallow): python3-modules-sqlite3
[i586] MI2a:        satisfying Depends: libsqlite3.so.0 >= set:ohbW8uvwE0AySekmaizOFVAhtivtNj465Jaq19KSn7gWBWHMZzUdeZFRZIlLMCDNHGfq3JQppRdwivwATaeCInZrCLJFYi1I6TwFGaoDiUzRZ0ZczZkNfeIbzVVIZphh6C0GhVy6OfMlkGjrO2NIBIVlSm2JbsGPotQwdzp8sw1iII7dAdkHysDJnhx5O8xXqZHCZBGY9zibimpwaELD9YJYj7rszqZ0oIoGBPSqUxjm3pXb0
[i586] MI2a:         maybe install (a providing target): libsqlite3 3.47.1-alt1:p11+372203.1100.14.1@1739196441
[i586] MI2a:        target SELECTED: libsqlite3 3.47.1-alt1:p11+372203.1100.14.1@1739196441
[i586] MI2a:        requesting to install libsqlite3 (unspec'd ver; inspect with Debug::pkgMark-shallow)
[i586] MI2a:          marked for install (shallow): libsqlite3
[i586] MI2a:     satisfying Depends: python3(mypy) < 0
[i586] MI2a:      maybe install (a providing target): python3-module-mypy 1.15.0-alt1:p11+370642.4300.7.1@1740586742
[i586] MI2a:     target SELECTED: python3-module-mypy 1.15.0-alt1:p11+370642.4300.7.1@1740586742
[i586] MI2a:     requesting to install python3-module-mypy (unspec'd ver; inspect with Debug::pkgMark-shallow)
[i586] MI2a:       marked for install (shallow): python3-module-mypy
[i586] MI2a:        satisfying Depends: python3-module-mypy-extensions  (NULL)
[i586] MI2a:         maybe install (a providing target): python3-module-mypy_extensions 1.0.0-alt1:sisyphus+316350.100.2.1@1678357948
[i586] MI2a:        target SELECTED: python3-module-mypy_extensions 1.0.0-alt1:sisyphus+316350.100.2.1@1678357948
[i586] MI2a:        requesting to install python3-module-mypy_extensions (unspec'd ver; inspect with Debug::pkgMark-shallow)
[i586] MI2a:          marked for install (shallow): python3-module-mypy_extensions
[i586] rpm-build-python3 is already the newest version.
[i586] E: Couldn't find package python3-module-pytest-codspeed
[i586] hsh-install: Failed to calculate package file list.
[i586] hsh-install: Failed to generate package file list.
2025-May-15 13:39:09 :: [i586] python3-module-strawberry-graphql.git 0.266.0-alt1: remote: cannot build src.rpm
2025-May-15 13:39:09 :: [i586] #3600 python3-module-strawberry-graphql.git 0.266.0-alt1: build FAILED
2025-May-15 13:39:09 :: [i586] requesting cancellation of task processing
2025-May-15 13:41:34 :: [aarch64] #3544 python3-module-inline-snapshot.git 0.23.0-alt1: build OK
2025-May-15 13:41:34 :: [aarch64] task processing CANCELLED
2025-May-15 13:42:23 :: [x86_64] #3544 python3-module-inline-snapshot.git 0.23.0-alt1: build OK
2025-May-15 13:42:23 :: [x86_64] task processing CANCELLED
2025-May-15 13:39:09 :: [i586] build FAILED
2025-May-15 13:41:34 :: [aarch64] build FAILED
2025-May-15 13:42:23 :: [x86_64] build FAILED
2025-May-15 13:42:24 :: task #383988 for p11 FAILED


  parent reply	other threads:[~2025-05-15 13:42 UTC|newest]

Thread overview: 37+ messages / expand[flat|nested]  mbox.gz  Atom feed  top
2025-05-13 11:35 [#383988] [test-only] p11 FAILED python3-module-django.git=5.2.1-alt1 Girar awaiter (thatman)
2025-05-13 11:48 ` [#383988] [test-only] p11 FAILED (try 2) python3-module-django.git=5.2.1-alt1 Girar awaiter (thatman)
2025-05-13 11:58 ` [#383988] [test-only] p11 FAILED (try 3) python3-module-django.git=5.2.1-alt1 Girar awaiter (thatman)
2025-05-13 13:08 ` [#383988] [test-only] p11 FAILED (try 4) python3-module-django.git=5.2.1-alt1 Girar awaiter (thatman)
2025-05-13 13:41 ` [#383988] [test-only] p11 FAILED (try 5) python3-module-django.git=5.2.1-alt1 Girar awaiter (thatman)
2025-05-13 13:52 ` [#383988] [test-only] p11 FAILED (try 6) python3-module-django.git=5.2.1-alt1 Girar awaiter (thatman)
2025-05-13 14:27 ` [#383988] [test-only] p11 FAILED (try 7) python3-module-django.git=5.2.1-alt1 Girar awaiter (thatman)
2025-05-13 15:04 ` [#383988] [test-only] p11 FAILED (try 8) python3-module-django.git=5.2.1-alt1 Girar awaiter (thatman)
2025-05-13 15:20 ` [#383988] [test-only] p11 FAILED (try 9) python3-module-django.git=5.2.1-alt1 Girar awaiter (thatman)
2025-05-13 15:37 ` [#383988] [test-only] p11 FAILED (try 10) python3-module-django.git=5.2.1-alt1 Girar awaiter (thatman)
2025-05-13 16:30 ` [#383988] [test-only] p11 FAILED (try 11) python3-module-django.git=5.2.1-alt1 Girar awaiter (thatman)
2025-05-13 17:22 ` [#383988] [test-only] p11 FAILED (try 12) python3-module-django.git=5.2.1-alt1 Girar awaiter (thatman)
2025-05-14  9:38 ` [#383988] [test-only] p11 FAILED (try 13) python3-module-django.git=5.2.1-alt1 Girar awaiter (thatman)
2025-05-14  9:53 ` [#383988] [test-only] p11 FAILED (try 14) python3-module-django.git=5.2.1-alt1 Girar awaiter (thatman)
2025-05-14 11:42 ` [#383988] [test-only] p11 FAILED (try 15) python3-module-django.git=5.2.1-alt1 Girar awaiter (thatman)
2025-05-14 12:28 ` [#383988] [test-only] p11 FAILED (try 16) python3-module-django.git=5.2.1-alt1 Girar awaiter (thatman)
2025-05-14 14:31 ` [#383988] [test-only] p11 FAILED (try 17) python3-module-django.git=5.2.1-alt1 Girar awaiter (thatman)
2025-05-14 14:53 ` [#383988] [test-only] p11 FAILED (try 18) python3-module-django.git=5.2.1-alt1 Girar awaiter (thatman)
2025-05-14 17:14 ` [#383988] [test-only] p11 FAILED (try 19) python3-module-django.git=5.2.1-alt1 Girar awaiter (thatman)
2025-05-14 18:26 ` [#383988] [test-only] p11 FAILED (try 20) python3-module-django.git=5.2.1-alt1 Girar awaiter (thatman)
2025-05-15  9:21 ` [#383988] [test-only] p11 FAILED (try 21) python3-module-django.git=5.2.1-alt1 Girar awaiter (thatman)
2025-05-15 10:01 ` [#383988] [test-only] p11 FAILED (try 22) python3-module-django.git=5.2.1-alt1 Girar awaiter (thatman)
2025-05-15 11:02 ` [#383988] [test-only] p11 FAILED (try 23) python3-module-django.git=5.2.1-alt1 Girar awaiter (thatman)
2025-05-15 11:26 ` [#383988] [test-only] p11 FAILED (try 24) python3-module-django.git=5.2.1-alt1 Girar awaiter (thatman)
2025-05-15 12:01 ` [#383988] [test-only] p11 FAILED (try 25) python3-module-django.git=5.2.1-alt1 Girar awaiter (thatman)
2025-05-15 12:30 ` [#383988] [test-only] p11 FAILED (try 26) python3-module-django.git=5.2.1-alt1 Girar awaiter (thatman)
2025-05-15 12:44 ` [#383988] [test-only] p11 FAILED (try 27) python3-module-django.git=5.2.1-alt1 Girar awaiter (thatman)
2025-05-15 13:00 ` [#383988] [test-only] p11 FAILED (try 28) python3-module-django.git=5.2.1-alt1 Girar awaiter (thatman)
2025-05-15 13:42 ` Girar awaiter (thatman) [this message]
2025-05-15 16:16 ` [#383988] [test-only] p11 FAILED (try 30) python3-module-django.git=5.2.1-alt1 Girar awaiter (thatman)
2025-05-15 16:47 ` [#383988] [test-only] p11 FAILED (try 31) python3-module-django.git=5.2.1-alt1 Girar awaiter (thatman)
2025-05-16  1:28 ` [#383988] [test-only] p11 FAILED (try 32) python3-module-django.git=5.2.1-alt1 Girar awaiter (thatman)
2025-05-16 11:19 ` [#383988] [test-only] p11 FAILED (try 33) python3-module-django.git=5.2.1-alt1 Girar awaiter (thatman)
2025-05-16 11:56 ` [#383988] [test-only] p11 FAILED (try 34) python3-module-django.git=5.2.1-alt1 Girar awaiter (thatman)
2025-05-16 12:14 ` [#383988] [test-only] p11 FAILED (try 35) python3-module-django.git=5.2.1-alt1 Girar awaiter (thatman)
2025-05-16 14:12 ` [#383988] [test-only] p11 FAILED (try 36) python3-module-django.git=5.2.1-alt1 Girar awaiter (thatman)
2025-05-16 14:30 ` [#383988] [test-only] p11 FAILED (try 37) python3-module-django.git=5.2.1-alt1 Girar awaiter (thatman)

Reply instructions:

You may reply publicly to this message via plain-text email
using any one of the following methods:

* Save the following mbox file, import it into your mail client,
  and reply-to-all from there: mbox

  Avoid top-posting and favor interleaved quoting:
  https://en.wikipedia.org/wiki/Posting_style#Interleaved_style

* Reply using the --to, --cc, and --in-reply-to
  switches of git-send-email(1):

  git send-email \
    --in-reply-to=girar.task.383988.29.1@gyle.mskdc.altlinux.org \
    --to=girar-builder@altlinux.org \
    --cc=devel@lists.altlinux.org \
    --cc=girar-builder-p11@altlinux.org \
    --cc=girar-builder-p11@lists.altlinux.org \
    --cc=sisyphus-incominger@lists.altlinux.org \
    --cc=thatman@altlinux.org \
    /path/to/YOUR_REPLY

  https://kernel.org/pub/software/scm/git/docs/git-send-email.html

* If your mail client supports setting the In-Reply-To header
  via mailto: links, try the mailto: link

ALT Linux Girar Builder robot reports

This inbox may be cloned and mirrored by anyone:

	git clone --mirror http://lore.altlinux.org/sisyphus-incominger/0 sisyphus-incominger/git/0.git

	# If you have public-inbox 1.1+ installed, you may
	# initialize and index your mirror using the following commands:
	public-inbox-init -V2 sisyphus-incominger sisyphus-incominger/ http://lore.altlinux.org/sisyphus-incominger \
		sisyphus-incominger@lists.altlinux.org sisyphus-incominger@lists.altlinux.ru sisyphus-incominger@lists.altlinux.com
	public-inbox-index sisyphus-incominger

Example config snippet for mirrors.
Newsgroup available over NNTP:
	nntp://lore.altlinux.org/org.altlinux.lists.sisyphus-incominger


AGPL code for this site: git clone https://public-inbox.org/public-inbox.git