* [#380110] [test-only] FAILED gnu-efi.git=4.0.0-alt1
@ 2025-04-03 15:12 Girar awaiter (egori)
2025-04-03 15:25 ` [#380110] TESTED (try 2) gnu-efi.git=4.0.0-alt1 Girar awaiter (egori)
2025-04-03 15:34 ` [#380110] [test-only] FAILED (try 3) gnu-efi.git=4.0.0-alt1 fwupd.git=2.0.7-alt1 efitools.git=1.9.2-alt4 Girar awaiter (egori)
0 siblings, 2 replies; 3+ messages in thread
From: Girar awaiter (egori) @ 2025-04-03 15:12 UTC (permalink / raw)
To: Egor Ignatov; +Cc: sisyphus-incominger, girar-builder-sisyphus
https://git.altlinux.org/tasks/380110/logs/events.1.1.log
https://packages.altlinux.org/tasks/380110
subtask name aarch64 i586 x86_64
#100 gnu-efi failed failed 22
2025-Apr-03 15:12:26 :: test-only task #380110 for sisyphus started by egori:
#100 build 4.0.0-alt1 from /people/egori/packages/gnu-efi.git fetched at 2025-Apr-03 15:12:24
2025-Apr-03 15:12:27 :: [aarch64] #100 gnu-efi.git 4.0.0-alt1: build start
2025-Apr-03 15:12:27 :: [i586] #100 gnu-efi.git 4.0.0-alt1: build start
2025-Apr-03 15:12:27 :: [x86_64] #100 gnu-efi.git 4.0.0-alt1: build start
[i586] find-requires: running scripts (cpp,debuginfo,files,lib,pam,perl,pkgconfig,pkgconfiglib,python,python3,rpmlib,shebang,shell,static,symlinks,systemd-services)
[i586] /usr/src/tmp/gnu-efi-buildroot/usr/include/efi/efisetjmp.h:5:10: fatal error: efisetjmp_arch.h: No such file or directory
[i586] 5 | #include "efisetjmp_arch.h"
[i586] --
[i586] cpp.req: /usr/src/tmp/gnu-efi-buildroot/usr/include/efi/efisetjmp.h: cpp failed, trying c++ mode
[i586] /usr/src/tmp/gnu-efi-buildroot/usr/include/efi/efisetjmp.h:5:10: fatal error: efisetjmp_arch.h: No such file or directory
[i586] 5 | #include "efisetjmp_arch.h"
[i586] --
[i586] cpp.req: WARNING: /usr/src/tmp/gnu-efi-buildroot/usr/include/efi/efisetjmp.h: cpp failed
[i586] /usr/src/tmp/gnu-efi-buildroot/usr/include/efi/protocol/efidbg.h:45:10: fatal error: eficontext.h: No such file or directory
[i586] 45 | #include "eficontext.h"
[i586] --
[i586] cpp.req: /usr/src/tmp/gnu-efi-buildroot/usr/include/efi/protocol/efidbg.h: cpp failed, trying c++ mode
[i586] /usr/src/tmp/gnu-efi-buildroot/usr/include/efi/protocol/efidbg.h:45:10: fatal error: eficontext.h: No such file or directory
[i586] 45 | #include "eficontext.h"
[i586] --
[i586] /usr/lib/elf_ia32_efi_local.lds
[i586] error: File list check failed, terminating build
[i586] RPM build errors:
[i586] Installed (but unpackaged) file(s) found:
[i586] File list check failed, terminating build
2025-Apr-03 15:12:47 :: [i586] gnu-efi.git 4.0.0-alt1: remote: build failed
2025-Apr-03 15:12:47 :: [i586] #100 gnu-efi.git 4.0.0-alt1: build FAILED
2025-Apr-03 15:12:47 :: [i586] requesting cancellation of task processing
2025-Apr-03 15:12:49 :: [x86_64] #100 gnu-efi.git 4.0.0-alt1: build OK
[aarch64] find-requires: running scripts (cpp,debuginfo,files,lib,pam,perl,pkgconfig,pkgconfiglib,python,python3,rpmlib,shebang,shell,static,symlinks,systemd-services)
[aarch64] /usr/src/tmp/gnu-efi-buildroot/usr/include/efi/efisetjmp.h:5:10: fatal error: efisetjmp_arch.h: No such file or directory
[aarch64] 5 | #include "efisetjmp_arch.h"
[aarch64] --
[aarch64] cpp.req: /usr/src/tmp/gnu-efi-buildroot/usr/include/efi/efisetjmp.h: cpp failed, trying c++ mode
[aarch64] /usr/src/tmp/gnu-efi-buildroot/usr/include/efi/efisetjmp.h:5:10: fatal error: efisetjmp_arch.h: No such file or directory
[aarch64] 5 | #include "efisetjmp_arch.h"
[aarch64] --
[aarch64] cpp.req: WARNING: /usr/src/tmp/gnu-efi-buildroot/usr/include/efi/efisetjmp.h: cpp failed
[aarch64] /usr/src/tmp/gnu-efi-buildroot/usr/include/efi/protocol/efidbg.h:45:10: fatal error: eficontext.h: No such file or directory
[aarch64] 45 | #include "eficontext.h"
[aarch64] --
[aarch64] cpp.req: /usr/src/tmp/gnu-efi-buildroot/usr/include/efi/protocol/efidbg.h: cpp failed, trying c++ mode
[aarch64] /usr/src/tmp/gnu-efi-buildroot/usr/include/efi/protocol/efidbg.h:45:10: fatal error: eficontext.h: No such file or directory
[aarch64] 45 | #include "eficontext.h"
[aarch64] --
[aarch64] /usr/lib64/elf_aarch64_efi_local.lds
[aarch64] error: File list check failed, terminating build
[aarch64] RPM build errors:
[aarch64] Installed (but unpackaged) file(s) found:
[aarch64] File list check failed, terminating build
2025-Apr-03 15:12:58 :: [aarch64] gnu-efi.git 4.0.0-alt1: remote: build failed
2025-Apr-03 15:12:58 :: [aarch64] #100 gnu-efi.git 4.0.0-alt1: build FAILED
2025-Apr-03 15:12:47 :: [i586] build FAILED
2025-Apr-03 15:12:58 :: [aarch64] build FAILED
2025-Apr-03 15:12:58 :: task #380110 for sisyphus FAILED
^ permalink raw reply [flat|nested] 3+ messages in thread
* [#380110] TESTED (try 2) gnu-efi.git=4.0.0-alt1
2025-04-03 15:12 [#380110] [test-only] FAILED gnu-efi.git=4.0.0-alt1 Girar awaiter (egori)
@ 2025-04-03 15:25 ` Girar awaiter (egori)
2025-04-03 15:34 ` [#380110] [test-only] FAILED (try 3) gnu-efi.git=4.0.0-alt1 fwupd.git=2.0.7-alt1 efitools.git=1.9.2-alt4 Girar awaiter (egori)
1 sibling, 0 replies; 3+ messages in thread
From: Girar awaiter (egori) @ 2025-04-03 15:25 UTC (permalink / raw)
To: Egor Ignatov
Cc: Nikolai Kostrigin, sisyphus-incominger, Anton Farygin,
girar-builder-sisyphus
https://git.altlinux.org/tasks/380110/logs/events.2.1.log
https://packages.altlinux.org/tasks/380110
subtask name aarch64 i586 x86_64
#200 gnu-efi 32 21 22
2025-Apr-03 15:20:41 :: test-only task #380110 for sisyphus resumed by egori:
#100 removed
#200 build 4.0.0-alt1 from /people/egori/packages/gnu-efi.git fetched at 2025-Apr-03 15:20:36
2025-Apr-03 15:20:43 :: [aarch64] #200 gnu-efi.git 4.0.0-alt1: build start
2025-Apr-03 15:20:43 :: [i586] #200 gnu-efi.git 4.0.0-alt1: build start
2025-Apr-03 15:20:43 :: [x86_64] #200 gnu-efi.git 4.0.0-alt1: build start
2025-Apr-03 15:21:04 :: [i586] #200 gnu-efi.git 4.0.0-alt1: build OK
2025-Apr-03 15:21:05 :: [x86_64] #200 gnu-efi.git 4.0.0-alt1: build OK
2025-Apr-03 15:21:15 :: [aarch64] #200 gnu-efi.git 4.0.0-alt1: build OK
2025-Apr-03 15:21:23 :: #200: gnu-efi.git 4.0.0-alt1: build check OK
2025-Apr-03 15:21:24 :: build check OK
2025-Apr-03 15:21:26 :: noarch check OK
2025-Apr-03 15:21:27 :: plan: src +1 -1 =20072, aarch64 +1 -1 =34854, i586 +1 -1 =33709, x86_64 +1 -1 =35663
#200 gnu-efi 3.0.18-alt2 -> 1:4.0.0-alt1
Thu Apr 03 2025 Egor Ignatov <egori@altlinux> 1:4.0.0-alt1
- 4.0.0
2025-Apr-03 15:22:24 :: patched apt indices
2025-Apr-03 15:22:35 :: created next repo
2025-Apr-03 15:22:46 :: duplicate provides check OK
2025-Apr-03 15:23:30 :: dependencies check OK
2025-Apr-03 15:23:32 :: [x86_64 i586 aarch64] ELF symbols check OK
2025-Apr-03 15:23:46 :: [i586] #200 gnu-efi: install check OK
2025-Apr-03 15:23:46 :: [x86_64] #200 gnu-efi: install check OK
2025-Apr-03 15:23:56 :: [aarch64] #200 gnu-efi: install check OK
2025-Apr-03 15:23:57 :: [x86_64-i586] plan: #1 +1 -1 =11597
2025-Apr-03 15:24:13 :: [x86_64-i586] arepo build OK
2025-Apr-03 15:24:30 :: [x86_64-i586] generated apt indices
2025-Apr-03 15:24:32 :: [x86_64-i586] created next repo
2025-Apr-03 15:24:44 :: [x86_64-i586] dependencies check OK
2025-Apr-03 15:24:45 :: gears inheritance check OK
2025-Apr-03 15:24:46 :: srpm inheritance check OK
girar-check-perms: access to gnu-efi DENIED for egori: does not belong to approved builders list: rider nickel @qa
check-subtask-perms: #200: gnu-efi: Operation not permitted
2025-Apr-03 15:24:46 :: acl check IGNORED
2025-Apr-03 15:25:00 :: created contents_index files
2025-Apr-03 15:25:08 :: created hash files: aarch64 i586 src x86_64-i586 x86_64
2025-Apr-03 15:25:11 :: task #380110 for sisyphus TESTED
^ permalink raw reply [flat|nested] 3+ messages in thread
* [#380110] [test-only] FAILED (try 3) gnu-efi.git=4.0.0-alt1 fwupd.git=2.0.7-alt1 efitools.git=1.9.2-alt4 ...
2025-04-03 15:12 [#380110] [test-only] FAILED gnu-efi.git=4.0.0-alt1 Girar awaiter (egori)
2025-04-03 15:25 ` [#380110] TESTED (try 2) gnu-efi.git=4.0.0-alt1 Girar awaiter (egori)
@ 2025-04-03 15:34 ` Girar awaiter (egori)
1 sibling, 0 replies; 3+ messages in thread
From: Girar awaiter (egori) @ 2025-04-03 15:34 UTC (permalink / raw)
To: Egor Ignatov; +Cc: sisyphus-incominger, girar-builder-sisyphus
[-- Warning: decoded text below may be mangled, UTF-8 assumed --]
[-- Attachment #1: Type: text/plain; charset=unknown-8bit, Size: 3998 bytes --]
https://git.altlinux.org/tasks/380110/logs/events.3.1.log
https://packages.altlinux.org/tasks/380110
subtask name aarch64 i586 x86_64
#300 fwupd failed failed failed
2025-Apr-03 15:30:19 :: test-only task #380110 for sisyphus resumed by egori:
2025-Apr-03 15:30:19 :: message: gnu-efi ABI change
#100 removed
#200 build 4.0.0-alt1 from /people/egori/packages/gnu-efi.git fetched at 2025-Apr-03 15:20:36
#300 build 2.0.7-alt1 from /gears/f/fwupd.git fetched at 2025-Apr-03 15:28:34 from sisyphus
#400 build 1.9.2-alt4 from /gears/e/efitools.git fetched at 2025-Apr-03 15:28:38 from sisyphus
#500 build 0.9.5-alt3 from /gears/s/sbsigntools.git fetched at 2025-Apr-03 15:28:45 from sisyphus
#600 build 0.7.2-alt1 from /gears/m/mokutil.git fetched at 2025-Apr-03 15:28:49 from sisyphus
2025-Apr-03 15:30:20 :: created build repo
2025-Apr-03 15:30:21 :: [x86_64] #200 gnu-efi.git 4.0.0-alt1: build start
2025-Apr-03 15:30:21 :: [i586] #200 gnu-efi.git 4.0.0-alt1: build start
2025-Apr-03 15:30:21 :: [aarch64] #200 gnu-efi.git 4.0.0-alt1: build start
2025-Apr-03 15:30:38 :: [i586] #200 gnu-efi.git 4.0.0-alt1: build OK (cached)
2025-Apr-03 15:30:38 :: [i586] #300 fwupd.git 2.0.7-alt1: build start
2025-Apr-03 15:30:39 :: [x86_64] #200 gnu-efi.git 4.0.0-alt1: build OK (cached)
2025-Apr-03 15:30:39 :: [x86_64] #300 fwupd.git 2.0.7-alt1: build start
2025-Apr-03 15:30:56 :: [aarch64] #200 gnu-efi.git 4.0.0-alt1: build OK (cached)
2025-Apr-03 15:30:56 :: [aarch64] #300 fwupd.git 2.0.7-alt1: build start
[x86_64] [35/35] 🌑 fu-self-test 0/ 30s\r^[[K35/35 fu-self-test OK 0.09s
[x86_64] Summary of Failures:
[x86_64] 1/35 fwupd-exported-api FAIL 0.02s exit status 1
[x86_64] Ok: 34
[x86_64] Expected Fail: 0
[x86_64] Fail: 1
[x86_64] Unexpected Pass: 0
[x86_64] Skipped: 0
[x86_64] Timeout: 0
[x86_64] Full log written to /usr/src/RPM/BUILD/fwupd-2.0.7/x86_64-alt-linux/meson-logs/testlog.txt
2025-Apr-03 15:32:39 :: [x86_64] fwupd.git 2.0.7-alt1: remote: build failed
2025-Apr-03 15:32:39 :: [x86_64] #300 fwupd.git 2.0.7-alt1: build FAILED
2025-Apr-03 15:32:39 :: [x86_64] requesting cancellation of task processing
[i586] [33/33] 🌔 fu-self-test 0/ 30s\r^[[K33/33 fu-self-test OK 0.09s
[i586] Summary of Failures:
[i586] 1/33 fwupd-exported-api FAIL 0.02s exit status 1
[i586] Ok: 32
[i586] Expected Fail: 0
[i586] Fail: 1
[i586] Unexpected Pass: 0
[i586] Skipped: 0
[i586] Timeout: 0
[i586] Full log written to /usr/src/RPM/BUILD/fwupd-2.0.7/i586-alt-linux/meson-logs/testlog.txt
2025-Apr-03 15:32:46 :: [i586] fwupd.git 2.0.7-alt1: remote: build failed
2025-Apr-03 15:32:46 :: [i586] #300 fwupd.git 2.0.7-alt1: build FAILED
[aarch64] [29/29] 🌔 fu-self-test 0/ 30s\r^[[K29/29 fu-self-test OK 0.11s
[aarch64] Summary of Failures:
[aarch64] 1/29 fwupd-exported-api FAIL 0.03s exit status 1
[aarch64] Ok: 28
[aarch64] Expected Fail: 0
[aarch64] Fail: 1
[aarch64] Unexpected Pass: 0
[aarch64] Skipped: 0
[aarch64] Timeout: 0
[aarch64] Full log written to /usr/src/RPM/BUILD/fwupd-2.0.7/aarch64-alt-linux/meson-logs/testlog.txt
2025-Apr-03 15:34:10 :: [aarch64] fwupd.git 2.0.7-alt1: remote: build failed
2025-Apr-03 15:34:10 :: [aarch64] #300 fwupd.git 2.0.7-alt1: build FAILED
2025-Apr-03 15:32:39 :: [x86_64] build FAILED
2025-Apr-03 15:32:47 :: [i586] build FAILED
2025-Apr-03 15:34:10 :: [aarch64] build FAILED
2025-Apr-03 15:34:10 :: task #380110 for sisyphus FAILED
^ permalink raw reply [flat|nested] 3+ messages in thread
end of thread, other threads:[~2025-04-03 15:34 UTC | newest]
Thread overview: 3+ messages (download: mbox.gz / follow: Atom feed)
-- links below jump to the message on this page --
2025-04-03 15:12 [#380110] [test-only] FAILED gnu-efi.git=4.0.0-alt1 Girar awaiter (egori)
2025-04-03 15:25 ` [#380110] TESTED (try 2) gnu-efi.git=4.0.0-alt1 Girar awaiter (egori)
2025-04-03 15:34 ` [#380110] [test-only] FAILED (try 3) gnu-efi.git=4.0.0-alt1 fwupd.git=2.0.7-alt1 efitools.git=1.9.2-alt4 Girar awaiter (egori)
ALT Linux Girar Builder robot reports
This inbox may be cloned and mirrored by anyone:
git clone --mirror http://lore.altlinux.org/sisyphus-incominger/0 sisyphus-incominger/git/0.git
# If you have public-inbox 1.1+ installed, you may
# initialize and index your mirror using the following commands:
public-inbox-init -V2 sisyphus-incominger sisyphus-incominger/ http://lore.altlinux.org/sisyphus-incominger \
sisyphus-incominger@lists.altlinux.org sisyphus-incominger@lists.altlinux.ru sisyphus-incominger@lists.altlinux.com
public-inbox-index sisyphus-incominger
Example config snippet for mirrors.
Newsgroup available over NNTP:
nntp://lore.altlinux.org/org.altlinux.lists.sisyphus-incominger
AGPL code for this site: git clone https://public-inbox.org/public-inbox.git