* [#379807] [test-only] FAILED alterator-explorer.git=0.1.13-alt1
@ 2025-03-31 13:49 Girar awaiter (sav)
2025-03-31 14:21 ` [#379807] [test-only] FAILED (try 2) alterator-explorer.git=0.1.13-alt1 Girar awaiter (sav)
2025-03-31 14:37 ` [#379807] TESTED (try 3) alterator-explorer.git=0.1.13-alt1 Girar awaiter (sav)
0 siblings, 2 replies; 3+ messages in thread
From: Girar awaiter (sav) @ 2025-03-31 13:49 UTC (permalink / raw)
To: Aleksey Saprunov; +Cc: sisyphus-incominger, girar-builder-sisyphus
https://git.altlinux.org/tasks/379807/logs/events.1.1.log
https://packages.altlinux.org/tasks/379807
subtask name aarch64 i586 x86_64
#100 alterator-explorer failed failed failed
2025-Mar-31 13:49:09 :: test-only task #379807 for sisyphus started by sav:
#100 build 0.1.13-alt1 from /people/sav/packages/alterator-explorer.git fetched at 2025-Mar-31 13:48:07
2025-Mar-31 13:49:10 :: [x86_64] #100 alterator-explorer.git 0.1.13-alt1: build start
2025-Mar-31 13:49:10 :: [aarch64] #100 alterator-explorer.git 0.1.13-alt1: build start
2025-Mar-31 13:49:10 :: [i586] #100 alterator-explorer.git 0.1.13-alt1: build start
[i586] <13>Mar 31 13:49:21 rpmi: rpm-macros-cmake-3.29.1-alt1 sisyphus+344518.300.3.1 1712379787 installed
[i586] <13>Mar 31 13:49:21 rpmi: rpm-macros-alterator-5.4.5-alt1 sisyphus+357097.200.3.1 1725893188 installed
[i586] warning: Macro %_altdir not found
[i586] warning: Macro %_altdir not found
[i586] warning: Macro %_altdir not found
[i586] error: bad date in %changelog: Tue Apr 02 20 24 Aleksey Saprunov <sav@altlinux.org> 0.1.3-alt1
[i586] hsh-rebuild: pkg.tar: failed to fetch build dependencies.
2025-Mar-31 13:49:21 :: [i586] alterator-explorer.git 0.1.13-alt1: remote: cannot build src.rpm
2025-Mar-31 13:49:21 :: [i586] #100 alterator-explorer.git 0.1.13-alt1: build FAILED
2025-Mar-31 13:49:21 :: [i586] requesting cancellation of task processing
[x86_64] <13>Mar 31 13:49:21 rpmi: rpm-macros-cmake-3.29.1-alt1 sisyphus+344518.300.3.1 1712379787 installed
[x86_64] <13>Mar 31 13:49:21 rpmi: rpm-macros-alterator-5.4.5-alt1 sisyphus+357097.200.3.1 1725893188 installed
[x86_64] warning: Macro %_altdir not found
[x86_64] warning: Macro %_altdir not found
[x86_64] warning: Macro %_altdir not found
[x86_64] error: bad date in %changelog: Tue Apr 02 20 24 Aleksey Saprunov <sav@altlinux.org> 0.1.3-alt1
[x86_64] hsh-rebuild: pkg.tar: failed to fetch build dependencies.
2025-Mar-31 13:49:21 :: [x86_64] alterator-explorer.git 0.1.13-alt1: remote: cannot build src.rpm
2025-Mar-31 13:49:21 :: [x86_64] #100 alterator-explorer.git 0.1.13-alt1: build FAILED
[aarch64] <13>Mar 31 13:49:28 rpmi: rpm-macros-cmake-3.29.1-alt1 sisyphus+344518.300.3.1 1712379787 installed
[aarch64] <13>Mar 31 13:49:28 rpmi: rpm-macros-alterator-5.4.5-alt1 sisyphus+357097.200.3.1 1725893188 installed
[aarch64] warning: Macro %_altdir not found
[aarch64] warning: Macro %_altdir not found
[aarch64] warning: Macro %_altdir not found
[aarch64] error: bad date in %changelog: Tue Apr 02 20 24 Aleksey Saprunov <sav@altlinux.org> 0.1.3-alt1
[aarch64] hsh-rebuild: pkg.tar: failed to fetch build dependencies.
2025-Mar-31 13:49:28 :: [aarch64] alterator-explorer.git 0.1.13-alt1: remote: cannot build src.rpm
2025-Mar-31 13:49:28 :: [aarch64] #100 alterator-explorer.git 0.1.13-alt1: build FAILED
2025-Mar-31 13:49:21 :: [i586] build FAILED
2025-Mar-31 13:49:22 :: [x86_64] build FAILED
2025-Mar-31 13:49:28 :: [aarch64] build FAILED
2025-Mar-31 13:49:28 :: task #379807 for sisyphus FAILED
^ permalink raw reply [flat|nested] 3+ messages in thread
* [#379807] [test-only] FAILED (try 2) alterator-explorer.git=0.1.13-alt1
2025-03-31 13:49 [#379807] [test-only] FAILED alterator-explorer.git=0.1.13-alt1 Girar awaiter (sav)
@ 2025-03-31 14:21 ` Girar awaiter (sav)
2025-03-31 14:37 ` [#379807] TESTED (try 3) alterator-explorer.git=0.1.13-alt1 Girar awaiter (sav)
1 sibling, 0 replies; 3+ messages in thread
From: Girar awaiter (sav) @ 2025-03-31 14:21 UTC (permalink / raw)
To: Aleksey Saprunov; +Cc: sisyphus-incominger, girar-builder-sisyphus
https://git.altlinux.org/tasks/379807/logs/events.2.1.log
https://packages.altlinux.org/tasks/379807
subtask name aarch64 i586 x86_64
#200 alterator-explorer failed failed failed
2025-Mar-31 14:21:19 :: test-only task #379807 for sisyphus resumed by sav:
#100 removed
#200 build 0.1.13-alt1 from /people/sav/packages/alterator-explorer.git fetched at 2025-Mar-31 14:20:51
2025-Mar-31 14:21:20 :: [i586] #200 alterator-explorer.git 0.1.13-alt1: build start
2025-Mar-31 14:21:20 :: [x86_64] #200 alterator-explorer.git 0.1.13-alt1: build start
2025-Mar-31 14:21:20 :: [aarch64] #200 alterator-explorer.git 0.1.13-alt1: build start
[i586] <13>Mar 31 14:21:31 rpmi: rpm-macros-cmake-3.29.1-alt1 sisyphus+344518.300.3.1 1712379787 installed
[i586] <13>Mar 31 14:21:31 rpmi: rpm-macros-alternatives-0.5.3-alt1 sisyphus+371878.100.1.1 1737988822 installed
[i586] <13>Mar 31 14:21:31 rpmi: rpm-macros-alterator-5.4.5-alt1 sisyphus+357097.200.3.1 1725893188 installed
[i586] error: bad date in %changelog: Tue Apr 02 20 24 Aleksey Saprunov <sav@altlinux.org> 0.1.3-alt1
[i586] hsh-rebuild: pkg.tar: failed to fetch build dependencies.
2025-Mar-31 14:21:31 :: [i586] alterator-explorer.git 0.1.13-alt1: remote: cannot build src.rpm
2025-Mar-31 14:21:31 :: [i586] #200 alterator-explorer.git 0.1.13-alt1: build FAILED
2025-Mar-31 14:21:31 :: [i586] requesting cancellation of task processing
[x86_64] <13>Mar 31 14:21:31 rpmi: rpm-macros-cmake-3.29.1-alt1 sisyphus+344518.300.3.1 1712379787 installed
[x86_64] <13>Mar 31 14:21:31 rpmi: rpm-macros-alternatives-0.5.3-alt1 sisyphus+371878.100.1.1 1737988822 installed
[x86_64] <13>Mar 31 14:21:31 rpmi: rpm-macros-alterator-5.4.5-alt1 sisyphus+357097.200.3.1 1725893188 installed
[x86_64] error: bad date in %changelog: Tue Apr 02 20 24 Aleksey Saprunov <sav@altlinux.org> 0.1.3-alt1
[x86_64] hsh-rebuild: pkg.tar: failed to fetch build dependencies.
2025-Mar-31 14:21:31 :: [x86_64] alterator-explorer.git 0.1.13-alt1: remote: cannot build src.rpm
2025-Mar-31 14:21:31 :: [x86_64] #200 alterator-explorer.git 0.1.13-alt1: build FAILED
[aarch64] <13>Mar 31 14:21:38 rpmi: rpm-macros-cmake-3.29.1-alt1 sisyphus+344518.300.3.1 1712379787 installed
[aarch64] <13>Mar 31 14:21:38 rpmi: rpm-macros-alternatives-0.5.3-alt1 sisyphus+371878.100.1.1 1737988822 installed
[aarch64] <13>Mar 31 14:21:38 rpmi: rpm-macros-alterator-5.4.5-alt1 sisyphus+357097.200.3.1 1725893188 installed
[aarch64] error: bad date in %changelog: Tue Apr 02 20 24 Aleksey Saprunov <sav@altlinux.org> 0.1.3-alt1
[aarch64] hsh-rebuild: pkg.tar: failed to fetch build dependencies.
2025-Mar-31 14:21:38 :: [aarch64] alterator-explorer.git 0.1.13-alt1: remote: cannot build src.rpm
2025-Mar-31 14:21:38 :: [aarch64] #200 alterator-explorer.git 0.1.13-alt1: build FAILED
2025-Mar-31 14:21:31 :: [i586] build FAILED
2025-Mar-31 14:21:32 :: [x86_64] build FAILED
2025-Mar-31 14:21:38 :: [aarch64] build FAILED
2025-Mar-31 14:21:38 :: task #379807 for sisyphus FAILED
^ permalink raw reply [flat|nested] 3+ messages in thread
* [#379807] TESTED (try 3) alterator-explorer.git=0.1.13-alt1
2025-03-31 13:49 [#379807] [test-only] FAILED alterator-explorer.git=0.1.13-alt1 Girar awaiter (sav)
2025-03-31 14:21 ` [#379807] [test-only] FAILED (try 2) alterator-explorer.git=0.1.13-alt1 Girar awaiter (sav)
@ 2025-03-31 14:37 ` Girar awaiter (sav)
1 sibling, 0 replies; 3+ messages in thread
From: Girar awaiter (sav) @ 2025-03-31 14:37 UTC (permalink / raw)
To: Aleksey Saprunov; +Cc: sisyphus-incominger, girar-builder-sisyphus
https://git.altlinux.org/tasks/379807/logs/events.3.1.log
https://packages.altlinux.org/tasks/379807
subtask name aarch64 i586 x86_64
#300 alterator-explorer 1:31 1:01 57
2025-Mar-31 14:30:24 :: test-only task #379807 for sisyphus resumed by sav:
#100 removed
#200 removed
#300 build 0.1.13-alt1 from /people/sav/packages/alterator-explorer.git fetched at 2025-Mar-31 14:30:15
2025-Mar-31 14:30:25 :: [i586] #300 alterator-explorer.git 0.1.13-alt1: build start
2025-Mar-31 14:30:25 :: [x86_64] #300 alterator-explorer.git 0.1.13-alt1: build start
2025-Mar-31 14:30:25 :: [aarch64] #300 alterator-explorer.git 0.1.13-alt1: build start
2025-Mar-31 14:31:22 :: [x86_64] #300 alterator-explorer.git 0.1.13-alt1: build OK
2025-Mar-31 14:31:26 :: [i586] #300 alterator-explorer.git 0.1.13-alt1: build OK
2025-Mar-31 14:31:56 :: [aarch64] #300 alterator-explorer.git 0.1.13-alt1: build OK
2025-Mar-31 14:32:06 :: #300: alterator-explorer.git 0.1.13-alt1: build check OK
2025-Mar-31 14:32:07 :: build check OK
2025-Mar-31 14:32:10 :: noarch check OK
2025-Mar-31 14:32:11 :: plan: src +1 -1 =20040, aarch64 +2 -2 =34828, i586 +2 -2 =33695, x86_64 +2 -2 =35634
#300 alterator-explorer 0.1.12-alt1 -> 0.1.13-alt1
Mon Mar 31 2025 Aleksey Saprunov <sav@altlinux> 0.1.13-alt1
- add control interface
- refresh button
- fixed category icons size
- hide legacy switch button if acc-legacy not available
- toolbar apperance in different themes
2025-Mar-31 14:32:55 :: patched apt indices
2025-Mar-31 14:33:08 :: created next repo
2025-Mar-31 14:33:19 :: duplicate provides check OK
2025-Mar-31 14:34:00 :: dependencies check OK
2025-Mar-31 14:34:36 :: [x86_64 i586 aarch64] ELF symbols check OK
x86_64: alterator-explorer=0.1.13-alt1 post-install unowned files:
/usr/share/alterator/categories
2025-Mar-31 14:35:01 :: [x86_64] #300 alterator-explorer: install check OK
i586: alterator-explorer=0.1.13-alt1 post-install unowned files:
/usr/share/alterator/categories
2025-Mar-31 14:35:03 :: [i586] #300 alterator-explorer: install check OK
aarch64: alterator-explorer=0.1.13-alt1 post-install unowned files:
/usr/share/alterator/categories
2025-Mar-31 14:35:14 :: [aarch64] #300 alterator-explorer: install check OK
2025-Mar-31 14:35:40 :: [x86_64] #300 alterator-explorer-debuginfo: install check OK
2025-Mar-31 14:35:47 :: [i586] #300 alterator-explorer-debuginfo: install check OK
2025-Mar-31 14:36:11 :: [aarch64] #300 alterator-explorer-debuginfo: install check OK
2025-Mar-31 14:36:30 :: [x86_64-i586] generated apt indices
2025-Mar-31 14:36:30 :: [x86_64-i586] created next repo
2025-Mar-31 14:36:43 :: [x86_64-i586] dependencies check OK
2025-Mar-31 14:36:44 :: gears inheritance check OK
2025-Mar-31 14:36:44 :: srpm inheritance check OK
girar-check-perms: access to alterator-explorer DENIED for sav: does not belong to maintainers list yet
check-subtask-perms: #300: alterator-explorer: Operation not permitted
2025-Mar-31 14:36:45 :: acl check IGNORED
2025-Mar-31 14:36:58 :: created contents_index files
2025-Mar-31 14:37:07 :: created hash files: aarch64 i586 src x86_64
2025-Mar-31 14:37:10 :: task #379807 for sisyphus TESTED
^ permalink raw reply [flat|nested] 3+ messages in thread
end of thread, other threads:[~2025-03-31 14:37 UTC | newest]
Thread overview: 3+ messages (download: mbox.gz / follow: Atom feed)
-- links below jump to the message on this page --
2025-03-31 13:49 [#379807] [test-only] FAILED alterator-explorer.git=0.1.13-alt1 Girar awaiter (sav)
2025-03-31 14:21 ` [#379807] [test-only] FAILED (try 2) alterator-explorer.git=0.1.13-alt1 Girar awaiter (sav)
2025-03-31 14:37 ` [#379807] TESTED (try 3) alterator-explorer.git=0.1.13-alt1 Girar awaiter (sav)
ALT Linux Girar Builder robot reports
This inbox may be cloned and mirrored by anyone:
git clone --mirror http://lore.altlinux.org/sisyphus-incominger/0 sisyphus-incominger/git/0.git
# If you have public-inbox 1.1+ installed, you may
# initialize and index your mirror using the following commands:
public-inbox-init -V2 sisyphus-incominger sisyphus-incominger/ http://lore.altlinux.org/sisyphus-incominger \
sisyphus-incominger@lists.altlinux.org sisyphus-incominger@lists.altlinux.ru sisyphus-incominger@lists.altlinux.com
public-inbox-index sisyphus-incominger
Example config snippet for mirrors.
Newsgroup available over NNTP:
nntp://lore.altlinux.org/org.altlinux.lists.sisyphus-incominger
AGPL code for this site: git clone https://public-inbox.org/public-inbox.git