ALT Linux Girar Builder robot reports
 help / color / mirror / Atom feed
From: "Girar awaiter (cas)" <girar-builder@altlinux.org>
To: Andrey Cherepanov <cas@altlinux.org>
Cc: sisyphus-incominger@lists.altlinux.org,
	girar-builder-sisyphus@altlinux.org
Subject: [#379725] [test-only] FAILED (try 8) octave.git=10.1.0-alt1 srpm=octave-audio-2.0.5-alt2.src.rpm ...
Date: Mon, 31 Mar 2025 10:29:39 +0000
Message-ID: <girar.task.379725.8.1@gyle.mskdc.altlinux.org> (raw)
In-Reply-To: <girar.task.379725.1.1@gyle.mskdc.altlinux.org>

https://git.altlinux.org/tasks/379725/logs/events.8.1.log
https://packages.altlinux.org/tasks/379725

subtask  name                  aarch64    i586  x86_64
  #1400  octave-interval          1:48    1:14    1:09
  #1500  octave-io                1:35    1:05      59
  #1600  octave-lssa              1:16    1:01      57
  #2000  octave-mapping           2:32    2:19    2:26
  #2100  octave-miscellaneous        ?    1:57    1:49
  #2200  octave-netcdf               ?    1:36    1:32
  #2300  octave-nurbs                ?  failed  failed

2025-Mar-31 10:17:43 :: test-only task #379725 for sisyphus resumed by cas:
2025-Mar-31 10:17:43 :: message: New_version_of_octave
#100 removed
#200 build 10.1.0-alt1 from /people/cas/packages/octave.git fetched at 2025-Mar-31 05:38:18
#300 build octave-audio-2.0.5-alt2.src.rpm from sisyphus
#400 build 0.5.1-alt1 from /gears/o/octave-dicom.git fetched at 2025-Mar-31 08:33:43 from sisyphus
#500 build 1.1.2-alt1 from /gears/o/octave-econometrics.git fetched at 2025-Mar-31 08:33:43 from sisyphus
#600 build octave-fits-1.0.7-alt4.src.rpm from sisyphus
#700 build octave-general-2.1.3-alt2.src.rpm from sisyphus
#740 removed
#1000 removed
#1100 removed
#1200 removed
#1300 build octave-instrument-control-0.9.1-alt1.src.rpm from sisyphus
#1400 build octave-interval-3.2.1-alt2.src.rpm from sisyphus
#1500 build octave-io-2.6.4-alt1.src.rpm from sisyphus
#1600 build octave-lssa-0.1.4-alt1.src.rpm from sisyphus
#1700 removed
#2000 build octave-mapping-1.4.2-alt1.src.rpm from sisyphus
#2100 build octave-miscellaneous-1.3.0-alt2.src.rpm from sisyphus
#2200 build octave-netcdf-1.0.17-alt2.src.rpm from sisyphus
#2300 build octave-nurbs-1.4.3-alt1.src.rpm from sisyphus
#2400 build octave-ocl-1.2.2-alt1.src.rpm from sisyphus
#2500 build octave-optim-1.6.2-alt1.src.rpm from sisyphus
#2600 build octave-optiminterp-0.3.7-alt1.src.rpm from sisyphus
#2700 build 2.4.0-alt5 from /gears/o/octave-quaternion.git fetched at 2025-Mar-31 08:34:01 from sisyphus
#3000 build octave-signal-1.4.5-alt1.src.rpm from sisyphus
#3100 build octave-struct-1.0.18-alt1.src.rpm from sisyphus
#3200 build 0.2.0-alt5 from /gears/o/octave-vibes.git fetched at 2025-Mar-31 08:34:04 from sisyphus
#3300 build octave-zeromq-1.5.5-alt1.src.rpm from sisyphus
#3400 build 4.1.1-alt1 from /gears/o/octave-control.git fetched at 2025-Mar-31 08:34:08 from sisyphus
#3500 build octave-communications-1.2.7-alt1.src.rpm from sisyphus
#3600 build octave-queueing-1.2.8-alt1.src.rpm from sisyphus
#3700 build octave-fuzzy-logic-toolkit-0.6.1-alt1.src.rpm from sisyphus
#4000 build octave-level-set-0.3.0-alt6.src.rpm from sisyphus
#4100 build octave-financial-0.5.3-alt2.src.rpm from sisyphus
2025-Mar-31 10:17:44 :: created build repo
2025-Mar-31 10:17:44 :: #1400: force rebuild
2025-Mar-31 10:17:44 :: #1500: force rebuild
2025-Mar-31 10:17:44 :: #1600: force rebuild
2025-Mar-31 10:17:45 :: [aarch64] #200 octave.git 10.1.0-alt1: build start
2025-Mar-31 10:17:45 :: [i586] #200 octave.git 10.1.0-alt1: build start
2025-Mar-31 10:17:45 :: [x86_64] #200 octave.git 10.1.0-alt1: build start
2025-Mar-31 10:18:10 :: [i586] #200 octave.git 10.1.0-alt1: build OK (cached)
2025-Mar-31 10:18:10 :: [i586] #300 octave-audio-2.0.5-alt2.src.rpm: build start
2025-Mar-31 10:18:11 :: [x86_64] #200 octave.git 10.1.0-alt1: build OK (cached)
2025-Mar-31 10:18:11 :: [x86_64] #300 octave-audio-2.0.5-alt2.src.rpm: build start
2025-Mar-31 10:18:24 :: [i586] #300 octave-audio-2.0.5-alt2.src.rpm: build OK (cached)
2025-Mar-31 10:18:24 :: [i586] #400 octave-dicom.git 0.5.1-alt1: build start
2025-Mar-31 10:18:25 :: [x86_64] #300 octave-audio-2.0.5-alt2.src.rpm: build OK (cached)
2025-Mar-31 10:18:26 :: [x86_64] #400 octave-dicom.git 0.5.1-alt1: build start
2025-Mar-31 10:18:38 :: [i586] #400 octave-dicom.git 0.5.1-alt1: build OK (cached)
2025-Mar-31 10:18:38 :: [i586] #500 octave-econometrics.git 1.1.2-alt1: build start
2025-Mar-31 10:18:41 :: [x86_64] #400 octave-dicom.git 0.5.1-alt1: build OK (cached)
2025-Mar-31 10:18:41 :: [x86_64] #500 octave-econometrics.git 1.1.2-alt1: build start
2025-Mar-31 10:18:52 :: [i586] #500 octave-econometrics.git 1.1.2-alt1: build OK (cached)
2025-Mar-31 10:18:52 :: [i586] #600 octave-fits-1.0.7-alt4.src.rpm: build start
2025-Mar-31 10:18:56 :: [x86_64] #500 octave-econometrics.git 1.1.2-alt1: build OK (cached)
2025-Mar-31 10:18:56 :: [x86_64] #600 octave-fits-1.0.7-alt4.src.rpm: build start
2025-Mar-31 10:19:01 :: [aarch64] #200 octave.git 10.1.0-alt1: build OK (cached)
2025-Mar-31 10:19:01 :: [aarch64] #300 octave-audio-2.0.5-alt2.src.rpm: build start
2025-Mar-31 10:19:05 :: [i586] #600 octave-fits-1.0.7-alt4.src.rpm: build OK (cached)
2025-Mar-31 10:19:06 :: [i586] #700 octave-general-2.1.3-alt2.src.rpm: build start
2025-Mar-31 10:19:10 :: [x86_64] #600 octave-fits-1.0.7-alt4.src.rpm: build OK (cached)
2025-Mar-31 10:19:10 :: [x86_64] #700 octave-general-2.1.3-alt2.src.rpm: build start
2025-Mar-31 10:19:20 :: [i586] #700 octave-general-2.1.3-alt2.src.rpm: build OK (cached)
2025-Mar-31 10:19:20 :: [i586] #1300 octave-instrument-control-0.9.1-alt1.src.rpm: build start
2025-Mar-31 10:19:25 :: [x86_64] #700 octave-general-2.1.3-alt2.src.rpm: build OK (cached)
2025-Mar-31 10:19:25 :: [x86_64] #1300 octave-instrument-control-0.9.1-alt1.src.rpm: build start
2025-Mar-31 10:19:35 :: [i586] #1300 octave-instrument-control-0.9.1-alt1.src.rpm: build OK (cached)
2025-Mar-31 10:19:36 :: [i586] #1400 octave-interval-3.2.1-alt2.src.rpm: build start
2025-Mar-31 10:19:41 :: [x86_64] #1300 octave-instrument-control-0.9.1-alt1.src.rpm: build OK (cached)
2025-Mar-31 10:19:41 :: [x86_64] #1400 octave-interval-3.2.1-alt2.src.rpm: build start
2025-Mar-31 10:19:49 :: [aarch64] #300 octave-audio-2.0.5-alt2.src.rpm: build OK (cached)
2025-Mar-31 10:19:49 :: [aarch64] #400 octave-dicom.git 0.5.1-alt1: build start
2025-Mar-31 10:20:22 :: [aarch64] #400 octave-dicom.git 0.5.1-alt1: build OK (cached)
2025-Mar-31 10:20:22 :: [aarch64] #500 octave-econometrics.git 1.1.2-alt1: build start
2025-Mar-31 10:20:50 :: [x86_64] #1400 octave-interval-3.2.1-alt2.src.rpm: build OK
2025-Mar-31 10:20:50 :: [x86_64] #1500 octave-io-2.6.4-alt1.src.rpm: build start
2025-Mar-31 10:20:50 :: [i586] #1400 octave-interval-3.2.1-alt2.src.rpm: build OK
2025-Mar-31 10:20:50 :: [i586] #1500 octave-io-2.6.4-alt1.src.rpm: build start
2025-Mar-31 10:20:51 :: [aarch64] #500 octave-econometrics.git 1.1.2-alt1: build OK (cached)
2025-Mar-31 10:20:51 :: [aarch64] #600 octave-fits-1.0.7-alt4.src.rpm: build start
2025-Mar-31 10:21:19 :: [aarch64] #600 octave-fits-1.0.7-alt4.src.rpm: build OK (cached)
2025-Mar-31 10:21:19 :: [aarch64] #700 octave-general-2.1.3-alt2.src.rpm: build start
2025-Mar-31 10:21:48 :: [aarch64] #700 octave-general-2.1.3-alt2.src.rpm: build OK (cached)
2025-Mar-31 10:21:48 :: [aarch64] #1300 octave-instrument-control-0.9.1-alt1.src.rpm: build start
2025-Mar-31 10:21:49 :: [x86_64] #1500 octave-io-2.6.4-alt1.src.rpm: build OK
2025-Mar-31 10:21:49 :: [x86_64] #1600 octave-lssa-0.1.4-alt1.src.rpm: build start
2025-Mar-31 10:21:55 :: [i586] #1500 octave-io-2.6.4-alt1.src.rpm: build OK
2025-Mar-31 10:21:55 :: [i586] #1600 octave-lssa-0.1.4-alt1.src.rpm: build start
2025-Mar-31 10:22:18 :: [aarch64] #1300 octave-instrument-control-0.9.1-alt1.src.rpm: build OK (cached)
2025-Mar-31 10:22:18 :: [aarch64] #1400 octave-interval-3.2.1-alt2.src.rpm: build start
2025-Mar-31 10:22:46 :: [x86_64] #1600 octave-lssa-0.1.4-alt1.src.rpm: build OK
2025-Mar-31 10:22:47 :: [x86_64] #2000 octave-mapping-1.4.2-alt1.src.rpm: build start
2025-Mar-31 10:22:56 :: [i586] #1600 octave-lssa-0.1.4-alt1.src.rpm: build OK
2025-Mar-31 10:22:56 :: [i586] #2000 octave-mapping-1.4.2-alt1.src.rpm: build start
2025-Mar-31 10:24:06 :: [aarch64] #1400 octave-interval-3.2.1-alt2.src.rpm: build OK
2025-Mar-31 10:24:07 :: [aarch64] #1500 octave-io-2.6.4-alt1.src.rpm: build start
2025-Mar-31 10:25:13 :: [x86_64] #2000 octave-mapping-1.4.2-alt1.src.rpm: build OK
2025-Mar-31 10:25:13 :: [x86_64] #2100 octave-miscellaneous-1.3.0-alt2.src.rpm: build start
2025-Mar-31 10:25:15 :: [i586] #2000 octave-mapping-1.4.2-alt1.src.rpm: build OK
2025-Mar-31 10:25:15 :: [i586] #2100 octave-miscellaneous-1.3.0-alt2.src.rpm: build start
2025-Mar-31 10:25:42 :: [aarch64] #1500 octave-io-2.6.4-alt1.src.rpm: build OK
2025-Mar-31 10:25:42 :: [aarch64] #1600 octave-lssa-0.1.4-alt1.src.rpm: build start
2025-Mar-31 10:26:58 :: [aarch64] #1600 octave-lssa-0.1.4-alt1.src.rpm: build OK
2025-Mar-31 10:26:59 :: [aarch64] #2000 octave-mapping-1.4.2-alt1.src.rpm: build start
2025-Mar-31 10:27:02 :: [x86_64] #2100 octave-miscellaneous-1.3.0-alt2.src.rpm: build OK
2025-Mar-31 10:27:02 :: [x86_64] #2200 octave-netcdf-1.0.17-alt2.src.rpm: build start
2025-Mar-31 10:27:12 :: [i586] #2100 octave-miscellaneous-1.3.0-alt2.src.rpm: build OK
2025-Mar-31 10:27:12 :: [i586] #2200 octave-netcdf-1.0.17-alt2.src.rpm: build start
2025-Mar-31 10:28:34 :: [x86_64] #2200 octave-netcdf-1.0.17-alt2.src.rpm: build OK
2025-Mar-31 10:28:35 :: [x86_64] #2300 octave-nurbs-1.4.3-alt1.src.rpm: build start
2025-Mar-31 10:28:48 :: [i586] #2200 octave-netcdf-1.0.17-alt2.src.rpm: build OK
2025-Mar-31 10:28:49 :: [i586] #2300 octave-nurbs-1.4.3-alt1.src.rpm: build start
[x86_64] low_level_functions.cc: In function 'int surfderivcpts(octave_idx_type, octave_idx_type, const RowVector&, octave_idx_type, octave_idx_type, const RowVector&, const Matrix&, octave_idx_type, octave_idx_type, octave_idx_type, octave_idx_type, octave_idx_type, NDArray&)':
[x86_64] low_level_functions.cc:292:15: error: 'assert' was not declared in this scope
[x86_64]   292 |               assert (k<idxa(0) && i<idxa(2) && j-s1<idxa(3));
[x86_64] --
[x86_64]    23 | 
[x86_64] low_level_functions.cc:320:19: error: 'assert' was not declared in this scope
[x86_64]   320 |                   assert (k<idxa(0) && l<idxa(1)
[x86_64] --
[x86_64] make: Leaving directory '/usr/src/RPM/BUILD/nurbs-1.4.3/nurbs-1.4.3/src'
[x86_64] error: pkg: error running 'make' for the nurbs package
[x86_64] error: called from
[x86_64]     configure_make at line 117 column 9
2025-Mar-31 10:29:12 :: [x86_64] octave-nurbs-1.4.3-alt1.src.rpm: remote: build failed
2025-Mar-31 10:29:12 :: [x86_64] #2300 octave-nurbs-1.4.3-alt1.src.rpm: build FAILED
2025-Mar-31 10:29:12 :: [x86_64] requesting cancellation of task processing
2025-Mar-31 10:29:31 :: [aarch64] #2000 octave-mapping-1.4.2-alt1.src.rpm: build OK
2025-Mar-31 10:29:32 :: [aarch64] task processing CANCELLED
[i586] low_level_functions.cc: In function 'int surfderivcpts(octave_idx_type, octave_idx_type, const RowVector&, octave_idx_type, octave_idx_type, const RowVector&, const Matrix&, octave_idx_type, octave_idx_type, octave_idx_type, octave_idx_type, octave_idx_type, NDArray&)':
[i586] low_level_functions.cc:292:15: error: 'assert' was not declared in this scope
[i586]   292 |               assert (k<idxa(0) && i<idxa(2) && j-s1<idxa(3));
[i586] --
[i586]    23 | 
[i586] low_level_functions.cc:320:19: error: 'assert' was not declared in this scope
[i586]   320 |                   assert (k<idxa(0) && l<idxa(1)
[i586] --
[i586] make: Leaving directory '/usr/src/RPM/BUILD/nurbs-1.4.3/nurbs-1.4.3/src'
[i586] error: pkg: error running 'make' for the nurbs package
[i586] error: called from
[i586]     configure_make at line 117 column 9
2025-Mar-31 10:29:38 :: [i586] octave-nurbs-1.4.3-alt1.src.rpm: remote: build failed
2025-Mar-31 10:29:38 :: [i586] #2300 octave-nurbs-1.4.3-alt1.src.rpm: build FAILED
2025-Mar-31 10:29:12 :: [x86_64] build FAILED
2025-Mar-31 10:29:32 :: [aarch64] build FAILED
2025-Mar-31 10:29:38 :: [i586] build FAILED
2025-Mar-31 10:29:39 :: task #379725 for sisyphus FAILED


  parent reply	other threads:[~2025-03-31 10:29 UTC|newest]

Thread overview: 18+ messages / expand[flat|nested]  mbox.gz  Atom feed  top
2025-03-30 19:09 [#379725] [test-only] FAILED octave.git=10.1.0-alt1 Girar awaiter (cas)
2025-03-31  6:06 ` [#379725] [test-only] FAILED (try 2) octave.git=10.1.0-alt1 Girar awaiter (cas)
2025-03-31  8:43 ` [#379725] [test-only] FAILED (try 3) octave.git=10.1.0-alt1 srpm=octave-audio-2.0.5-alt2.src.rpm Girar awaiter (cas)
2025-03-31  9:03 ` [#379725] [test-only] FAILED (try 4) " Girar awaiter (cas)
2025-03-31  9:11 ` [#379725] [test-only] FAILED (try 5) " Girar awaiter (cas)
2025-03-31  9:14 ` [#379725] [test-only] FAILED (try 6) " Girar awaiter (cas)
2025-03-31  9:40 ` [#379725] [test-only] FAILED (try 7) " Girar awaiter (cas)
2025-03-31 10:29 ` Girar awaiter (cas) [this message]
2025-03-31 11:51 ` [#379725] [test-only] FAILED (try 9) " Girar awaiter (cas)
2025-03-31 12:13 ` [#379725] [test-only] FAILED (try 10) " Girar awaiter (cas)
2025-03-31 12:19 ` [#379725] [test-only] FAILED (try 11) " Girar awaiter (cas)
2025-03-31 12:50 ` [#379725] [test-only] FAILED (try 12) " Girar awaiter (cas)
2025-03-31 13:52 ` [#379725] [test-only] FAILED (try 13) " Girar awaiter (cas)
2025-03-31 14:25 ` [#379725] [test-only] FAILED (try 14) " Girar awaiter (cas)
2025-03-31 15:25 ` [#379725] [test-only] FAILED (try 15) " Girar awaiter (cas)
2025-04-01 15:19 ` [#379725] [test-only] FAILED (try 16) " Girar awaiter (cas)
2025-04-03  3:29 ` [#379725] SWEPT (try 17) " Girar awaiter (cas)
2025-04-03  9:29 ` [#379725] DONE (try 18) " Girar pender (cas)

Reply instructions:

You may reply publicly to this message via plain-text email
using any one of the following methods:

* Save the following mbox file, import it into your mail client,
  and reply-to-all from there: mbox

  Avoid top-posting and favor interleaved quoting:
  https://en.wikipedia.org/wiki/Posting_style#Interleaved_style

* Reply using the --to, --cc, and --in-reply-to
  switches of git-send-email(1):

  git send-email \
    --in-reply-to=girar.task.379725.8.1@gyle.mskdc.altlinux.org \
    --to=girar-builder@altlinux.org \
    --cc=cas@altlinux.org \
    --cc=devel@lists.altlinux.org \
    --cc=girar-builder-sisyphus@altlinux.org \
    --cc=sisyphus-incominger@lists.altlinux.org \
    /path/to/YOUR_REPLY

  https://kernel.org/pub/software/scm/git/docs/git-send-email.html

* If your mail client supports setting the In-Reply-To header
  via mailto: links, try the mailto: link

ALT Linux Girar Builder robot reports

This inbox may be cloned and mirrored by anyone:

	git clone --mirror http://lore.altlinux.org/sisyphus-incominger/0 sisyphus-incominger/git/0.git

	# If you have public-inbox 1.1+ installed, you may
	# initialize and index your mirror using the following commands:
	public-inbox-init -V2 sisyphus-incominger sisyphus-incominger/ http://lore.altlinux.org/sisyphus-incominger \
		sisyphus-incominger@lists.altlinux.org sisyphus-incominger@lists.altlinux.ru sisyphus-incominger@lists.altlinux.com
	public-inbox-index sisyphus-incominger

Example config snippet for mirrors.
Newsgroup available over NNTP:
	nntp://lore.altlinux.org/org.altlinux.lists.sisyphus-incominger


AGPL code for this site: git clone https://public-inbox.org/public-inbox.git