* [#379725] [test-only] FAILED (try 2) octave.git=10.1.0-alt1
2025-03-30 19:09 [#379725] [test-only] FAILED octave.git=10.1.0-alt1 Girar awaiter (cas)
@ 2025-03-31 6:06 ` Girar awaiter (cas)
2025-03-31 8:43 ` [#379725] [test-only] FAILED (try 3) octave.git=10.1.0-alt1 srpm=octave-audio-2.0.5-alt2.src.rpm Girar awaiter (cas)
` (15 subsequent siblings)
16 siblings, 0 replies; 18+ messages in thread
From: Girar awaiter (cas) @ 2025-03-31 6:06 UTC (permalink / raw)
To: Andrey Cherepanov; +Cc: sisyphus-incominger, girar-builder-sisyphus
https://git.altlinux.org/tasks/379725/logs/events.2.1.log
https://packages.altlinux.org/tasks/379725
subtask name aarch64 i586 x86_64
#200 octave 24:06 12:33 12:57
^ permalink raw reply [flat|nested] 18+ messages in thread
* [#379725] [test-only] FAILED (try 3) octave.git=10.1.0-alt1 srpm=octave-audio-2.0.5-alt2.src.rpm ...
2025-03-30 19:09 [#379725] [test-only] FAILED octave.git=10.1.0-alt1 Girar awaiter (cas)
2025-03-31 6:06 ` [#379725] [test-only] FAILED (try 2) octave.git=10.1.0-alt1 Girar awaiter (cas)
@ 2025-03-31 8:43 ` Girar awaiter (cas)
2025-03-31 9:03 ` [#379725] [test-only] FAILED (try 4) " Girar awaiter (cas)
` (14 subsequent siblings)
16 siblings, 0 replies; 18+ messages in thread
From: Girar awaiter (cas) @ 2025-03-31 8:43 UTC (permalink / raw)
To: Andrey Cherepanov; +Cc: sisyphus-incominger, girar-builder-sisyphus
https://git.altlinux.org/tasks/379725/logs/events.3.1.log
https://packages.altlinux.org/tasks/379725
subtask name aarch64 i586 x86_64
#300 octave-audio 2:04 1:17 1:13
#400 octave-dicom 2:33 1:35 1:29
#500 octave-econometrics 1:16 49 47
#600 octave-fits 1:12 48 46
#700 octave-general ? 1:12 1:07
#1000 octave-geometry ? failed failed
2025-Mar-31 08:35:12 :: test-only task #379725 for sisyphus resumed by cas:
2025-Mar-31 08:35:12 :: message: New_version_of_octave
#100 removed
#200 build 10.1.0-alt1 from /people/cas/packages/octave.git fetched at 2025-Mar-31 05:38:18
#300 build octave-audio-2.0.5-alt2.src.rpm from sisyphus
#400 build 0.5.1-alt1 from /gears/o/octave-dicom.git fetched at 2025-Mar-31 08:33:43 from sisyphus
#500 build 1.1.2-alt1 from /gears/o/octave-econometrics.git fetched at 2025-Mar-31 08:33:43 from sisyphus
#600 build octave-fits-1.0.7-alt4.src.rpm from sisyphus
#700 build octave-general-2.1.3-alt2.src.rpm from sisyphus
#1000 build octave-geometry-4.0.0-alt3.src.rpm from sisyphus
#1100 build octave-image-2.14.0-alt1.src.rpm from sisyphus
#1200 build octave-image-acquisition-0.2.2-alt6.src.rpm from sisyphus
#1300 build octave-instrument-control-0.9.1-alt1.src.rpm from sisyphus
#1400 build octave-interval-3.2.1-alt2.src.rpm from sisyphus
#1500 build octave-io-2.6.4-alt1.src.rpm from sisyphus
#1600 build octave-lssa-0.1.4-alt1.src.rpm from sisyphus
#1700 build octave-ltfat-2.3.1-alt4.src.rpm from sisyphus
#2000 build octave-mapping-1.4.2-alt1.src.rpm from sisyphus
#2100 build octave-miscellaneous-1.3.0-alt2.src.rpm from sisyphus
#2200 build octave-netcdf-1.0.17-alt2.src.rpm from sisyphus
#2300 build octave-nurbs-1.4.3-alt1.src.rpm from sisyphus
#2400 build octave-ocl-1.2.2-alt1.src.rpm from sisyphus
#2500 build octave-optim-1.6.2-alt1.src.rpm from sisyphus
#2600 build octave-optiminterp-0.3.7-alt1.src.rpm from sisyphus
#2700 build 2.4.0-alt5 from /gears/o/octave-quaternion.git fetched at 2025-Mar-31 08:34:01 from sisyphus
#3000 build octave-signal-1.4.5-alt1.src.rpm from sisyphus
#3100 build octave-struct-1.0.18-alt1.src.rpm from sisyphus
#3200 build 0.2.0-alt5 from /gears/o/octave-vibes.git fetched at 2025-Mar-31 08:34:04 from sisyphus
#3300 build octave-zeromq-1.5.5-alt1.src.rpm from sisyphus
#3400 build 4.1.1-alt1 from /gears/o/octave-control.git fetched at 2025-Mar-31 08:34:08 from sisyphus
#3500 build octave-communications-1.2.7-alt1.src.rpm from sisyphus
#3600 build octave-queueing-1.2.8-alt1.src.rpm from sisyphus
#3700 build octave-fuzzy-logic-toolkit-0.6.1-alt1.src.rpm from sisyphus
#4000 build octave-level-set-0.3.0-alt6.src.rpm from sisyphus
#4100 build octave-financial-0.5.3-alt2.src.rpm from sisyphus
2025-Mar-31 08:35:12 :: created build repo
2025-Mar-31 08:35:14 :: [aarch64] #200 octave.git 10.1.0-alt1: build start
2025-Mar-31 08:35:14 :: [x86_64] #200 octave.git 10.1.0-alt1: build start
2025-Mar-31 08:35:14 :: [i586] #200 octave.git 10.1.0-alt1: build start
2025-Mar-31 08:35:38 :: [i586] #200 octave.git 10.1.0-alt1: build OK (cached)
2025-Mar-31 08:35:38 :: [i586] #300 octave-audio-2.0.5-alt2.src.rpm: build start
2025-Mar-31 08:35:40 :: [x86_64] #200 octave.git 10.1.0-alt1: build OK (cached)
2025-Mar-31 08:35:41 :: [x86_64] #300 octave-audio-2.0.5-alt2.src.rpm: build start
2025-Mar-31 08:36:01 :: [aarch64] #200 octave.git 10.1.0-alt1: build OK (cached)
2025-Mar-31 08:36:01 :: [aarch64] #300 octave-audio-2.0.5-alt2.src.rpm: build start
2025-Mar-31 08:36:54 :: [x86_64] #300 octave-audio-2.0.5-alt2.src.rpm: build OK
2025-Mar-31 08:36:54 :: [x86_64] #400 octave-dicom.git 0.5.1-alt1: build start
2025-Mar-31 08:36:55 :: [i586] #300 octave-audio-2.0.5-alt2.src.rpm: build OK
2025-Mar-31 08:36:55 :: [i586] #400 octave-dicom.git 0.5.1-alt1: build start
2025-Mar-31 08:38:05 :: [aarch64] #300 octave-audio-2.0.5-alt2.src.rpm: build OK
2025-Mar-31 08:38:05 :: [aarch64] #400 octave-dicom.git 0.5.1-alt1: build start
2025-Mar-31 08:38:23 :: [x86_64] #400 octave-dicom.git 0.5.1-alt1: build OK
2025-Mar-31 08:38:24 :: [x86_64] #500 octave-econometrics.git 1.1.2-alt1: build start
2025-Mar-31 08:38:30 :: [i586] #400 octave-dicom.git 0.5.1-alt1: build OK
2025-Mar-31 08:38:31 :: [i586] #500 octave-econometrics.git 1.1.2-alt1: build start
2025-Mar-31 08:39:11 :: [x86_64] #500 octave-econometrics.git 1.1.2-alt1: build OK
2025-Mar-31 08:39:11 :: [x86_64] #600 octave-fits-1.0.7-alt4.src.rpm: build start
2025-Mar-31 08:39:20 :: [i586] #500 octave-econometrics.git 1.1.2-alt1: build OK
2025-Mar-31 08:39:20 :: [i586] #600 octave-fits-1.0.7-alt4.src.rpm: build start
2025-Mar-31 08:39:57 :: [x86_64] #600 octave-fits-1.0.7-alt4.src.rpm: build OK
2025-Mar-31 08:39:57 :: [x86_64] #700 octave-general-2.1.3-alt2.src.rpm: build start
2025-Mar-31 08:40:08 :: [i586] #600 octave-fits-1.0.7-alt4.src.rpm: build OK
2025-Mar-31 08:40:08 :: [i586] #700 octave-general-2.1.3-alt2.src.rpm: build start
2025-Mar-31 08:40:38 :: [aarch64] #400 octave-dicom.git 0.5.1-alt1: build OK
2025-Mar-31 08:40:38 :: [aarch64] #500 octave-econometrics.git 1.1.2-alt1: build start
2025-Mar-31 08:41:04 :: [x86_64] #700 octave-general-2.1.3-alt2.src.rpm: build OK
2025-Mar-31 08:41:04 :: [x86_64] #1000 octave-geometry-4.0.0-alt3.src.rpm: build start
2025-Mar-31 08:41:20 :: [i586] #700 octave-general-2.1.3-alt2.src.rpm: build OK
2025-Mar-31 08:41:20 :: [i586] #1000 octave-geometry-4.0.0-alt3.src.rpm: build start
2025-Mar-31 08:41:54 :: [aarch64] #500 octave-econometrics.git 1.1.2-alt1: build OK
2025-Mar-31 08:41:54 :: [aarch64] #600 octave-fits-1.0.7-alt4.src.rpm: build start
[x86_64] find-requires: running scripts (cpp,debuginfo,files,lib,pam,perl,pkgconfig,pkgconfiglib,python,python3,rpmlib,shebang,shell,static,symlinks,systemd-services)
[x86_64] lib.req: ERROR: /usr/src/tmp/octave-geometry-buildroot/usr/lib64/octave/packages/geometry-4.0.0/x86_64-alt-linux-gnu-api-v60/clipper.mex: library liboctmex.so.1 not found
[x86_64] find-requires: ERROR: /usr/lib/rpm/lib.req failed
[x86_64] error: /bin/sh failed
[x86_64] error: Failed to find Requires
[x86_64] RPM build errors:
2025-Mar-31 08:41:56 :: [x86_64] octave-geometry-4.0.0-alt3.src.rpm: remote: build failed
2025-Mar-31 08:41:56 :: [x86_64] #1000 octave-geometry-4.0.0-alt3.src.rpm: build FAILED
2025-Mar-31 08:41:56 :: [x86_64] requesting cancellation of task processing
[i586] find-requires: running scripts (cpp,debuginfo,files,lib,pam,perl,pkgconfig,pkgconfiglib,python,python3,rpmlib,shebang,shell,static,symlinks,systemd-services)
[i586] lib.req: ERROR: /usr/src/tmp/octave-geometry-buildroot/usr/lib/octave/packages/geometry-4.0.0/i586-alt-linux-gnu-api-v60/clipper.mex: library liboctmex.so.1 not found
[i586] find-requires: ERROR: /usr/lib/rpm/lib.req failed
[i586] error: /bin/sh failed
[i586] error: Failed to find Requires
[i586] RPM build errors:
2025-Mar-31 08:42:16 :: [i586] octave-geometry-4.0.0-alt3.src.rpm: remote: build failed
2025-Mar-31 08:42:16 :: [i586] #1000 octave-geometry-4.0.0-alt3.src.rpm: build FAILED
2025-Mar-31 08:43:06 :: [aarch64] #600 octave-fits-1.0.7-alt4.src.rpm: build OK
2025-Mar-31 08:43:06 :: [aarch64] task processing CANCELLED
2025-Mar-31 08:41:56 :: [x86_64] build FAILED
2025-Mar-31 08:42:16 :: [i586] build FAILED
2025-Mar-31 08:43:06 :: [aarch64] build FAILED
2025-Mar-31 08:43:06 :: task #379725 for sisyphus FAILED
^ permalink raw reply [flat|nested] 18+ messages in thread
* [#379725] [test-only] FAILED (try 4) octave.git=10.1.0-alt1 srpm=octave-audio-2.0.5-alt2.src.rpm ...
2025-03-30 19:09 [#379725] [test-only] FAILED octave.git=10.1.0-alt1 Girar awaiter (cas)
2025-03-31 6:06 ` [#379725] [test-only] FAILED (try 2) octave.git=10.1.0-alt1 Girar awaiter (cas)
2025-03-31 8:43 ` [#379725] [test-only] FAILED (try 3) octave.git=10.1.0-alt1 srpm=octave-audio-2.0.5-alt2.src.rpm Girar awaiter (cas)
@ 2025-03-31 9:03 ` Girar awaiter (cas)
2025-03-31 9:11 ` [#379725] [test-only] FAILED (try 5) " Girar awaiter (cas)
` (13 subsequent siblings)
16 siblings, 0 replies; 18+ messages in thread
From: Girar awaiter (cas) @ 2025-03-31 9:03 UTC (permalink / raw)
To: Andrey Cherepanov; +Cc: sisyphus-incominger, girar-builder-sisyphus
https://git.altlinux.org/tasks/379725/logs/events.4.1.log
https://packages.altlinux.org/tasks/379725
subtask name aarch64 i586 x86_64
#700 octave-general 1:53 1:12 1:08
#740 octave-geometry ? failed failed
2025-Mar-31 08:59:13 :: test-only task #379725 for sisyphus resumed by cas:
2025-Mar-31 08:59:13 :: message: New_version_of_octave
#100 removed
#200 build 10.1.0-alt1 from /people/cas/packages/octave.git fetched at 2025-Mar-31 05:38:18
#300 build octave-audio-2.0.5-alt2.src.rpm from sisyphus
#400 build 0.5.1-alt1 from /gears/o/octave-dicom.git fetched at 2025-Mar-31 08:33:43 from sisyphus
#500 build 1.1.2-alt1 from /gears/o/octave-econometrics.git fetched at 2025-Mar-31 08:33:43 from sisyphus
#600 build octave-fits-1.0.7-alt4.src.rpm from sisyphus
#700 build octave-general-2.1.3-alt2.src.rpm from sisyphus
#740 build octave-geometry-4.1.0-alt1.src.rpm
#1000 removed
#1100 build octave-image-2.14.0-alt1.src.rpm from sisyphus
#1200 build octave-image-acquisition-0.2.2-alt6.src.rpm from sisyphus
#1300 build octave-instrument-control-0.9.1-alt1.src.rpm from sisyphus
#1400 build octave-interval-3.2.1-alt2.src.rpm from sisyphus
#1500 build octave-io-2.6.4-alt1.src.rpm from sisyphus
#1600 build octave-lssa-0.1.4-alt1.src.rpm from sisyphus
#1700 build octave-ltfat-2.3.1-alt4.src.rpm from sisyphus
#2000 build octave-mapping-1.4.2-alt1.src.rpm from sisyphus
#2100 build octave-miscellaneous-1.3.0-alt2.src.rpm from sisyphus
#2200 build octave-netcdf-1.0.17-alt2.src.rpm from sisyphus
#2300 build octave-nurbs-1.4.3-alt1.src.rpm from sisyphus
#2400 build octave-ocl-1.2.2-alt1.src.rpm from sisyphus
#2500 build octave-optim-1.6.2-alt1.src.rpm from sisyphus
#2600 build octave-optiminterp-0.3.7-alt1.src.rpm from sisyphus
#2700 build 2.4.0-alt5 from /gears/o/octave-quaternion.git fetched at 2025-Mar-31 08:34:01 from sisyphus
#3000 build octave-signal-1.4.5-alt1.src.rpm from sisyphus
#3100 build octave-struct-1.0.18-alt1.src.rpm from sisyphus
#3200 build 0.2.0-alt5 from /gears/o/octave-vibes.git fetched at 2025-Mar-31 08:34:04 from sisyphus
#3300 build octave-zeromq-1.5.5-alt1.src.rpm from sisyphus
#3400 build 4.1.1-alt1 from /gears/o/octave-control.git fetched at 2025-Mar-31 08:34:08 from sisyphus
#3500 build octave-communications-1.2.7-alt1.src.rpm from sisyphus
#3600 build octave-queueing-1.2.8-alt1.src.rpm from sisyphus
#3700 build octave-fuzzy-logic-toolkit-0.6.1-alt1.src.rpm from sisyphus
#4000 build octave-level-set-0.3.0-alt6.src.rpm from sisyphus
#4100 build octave-financial-0.5.3-alt2.src.rpm from sisyphus
2025-Mar-31 08:59:14 :: created build repo
2025-Mar-31 08:59:15 :: #700: force rebuild
2025-Mar-31 08:59:15 :: [i586] #200 octave.git 10.1.0-alt1: build start
2025-Mar-31 08:59:15 :: [x86_64] #200 octave.git 10.1.0-alt1: build start
2025-Mar-31 08:59:15 :: [aarch64] #200 octave.git 10.1.0-alt1: build start
2025-Mar-31 08:59:39 :: [i586] #200 octave.git 10.1.0-alt1: build OK (cached)
2025-Mar-31 08:59:40 :: [i586] #300 octave-audio-2.0.5-alt2.src.rpm: build start
2025-Mar-31 08:59:40 :: [x86_64] #200 octave.git 10.1.0-alt1: build OK (cached)
2025-Mar-31 08:59:40 :: [x86_64] #300 octave-audio-2.0.5-alt2.src.rpm: build start
2025-Mar-31 08:59:53 :: [i586] #300 octave-audio-2.0.5-alt2.src.rpm: build OK (cached)
2025-Mar-31 08:59:53 :: [i586] #400 octave-dicom.git 0.5.1-alt1: build start
2025-Mar-31 08:59:55 :: [x86_64] #300 octave-audio-2.0.5-alt2.src.rpm: build OK (cached)
2025-Mar-31 08:59:55 :: [x86_64] #400 octave-dicom.git 0.5.1-alt1: build start
2025-Mar-31 09:00:01 :: [aarch64] #200 octave.git 10.1.0-alt1: build OK (cached)
2025-Mar-31 09:00:01 :: [aarch64] #300 octave-audio-2.0.5-alt2.src.rpm: build start
2025-Mar-31 09:00:07 :: [i586] #400 octave-dicom.git 0.5.1-alt1: build OK (cached)
2025-Mar-31 09:00:08 :: [i586] #500 octave-econometrics.git 1.1.2-alt1: build start
2025-Mar-31 09:00:09 :: [x86_64] #400 octave-dicom.git 0.5.1-alt1: build OK (cached)
2025-Mar-31 09:00:10 :: [x86_64] #500 octave-econometrics.git 1.1.2-alt1: build start
2025-Mar-31 09:00:21 :: [i586] #500 octave-econometrics.git 1.1.2-alt1: build OK (cached)
2025-Mar-31 09:00:21 :: [i586] #600 octave-fits-1.0.7-alt4.src.rpm: build start
2025-Mar-31 09:00:24 :: [x86_64] #500 octave-econometrics.git 1.1.2-alt1: build OK (cached)
2025-Mar-31 09:00:24 :: [x86_64] #600 octave-fits-1.0.7-alt4.src.rpm: build start
2025-Mar-31 09:00:26 :: [aarch64] #300 octave-audio-2.0.5-alt2.src.rpm: build OK (cached)
2025-Mar-31 09:00:26 :: [aarch64] #400 octave-dicom.git 0.5.1-alt1: build start
2025-Mar-31 09:00:35 :: [i586] #600 octave-fits-1.0.7-alt4.src.rpm: build OK (cached)
2025-Mar-31 09:00:35 :: [i586] #700 octave-general-2.1.3-alt2.src.rpm: build start
2025-Mar-31 09:00:38 :: [x86_64] #600 octave-fits-1.0.7-alt4.src.rpm: build OK (cached)
2025-Mar-31 09:00:38 :: [x86_64] #700 octave-general-2.1.3-alt2.src.rpm: build start
2025-Mar-31 09:00:53 :: [aarch64] #400 octave-dicom.git 0.5.1-alt1: build OK (cached)
2025-Mar-31 09:00:54 :: [aarch64] #500 octave-econometrics.git 1.1.2-alt1: build start
2025-Mar-31 09:01:19 :: [aarch64] #500 octave-econometrics.git 1.1.2-alt1: build OK (cached)
2025-Mar-31 09:01:19 :: [aarch64] #600 octave-fits-1.0.7-alt4.src.rpm: build start
2025-Mar-31 09:01:44 :: [aarch64] #600 octave-fits-1.0.7-alt4.src.rpm: build OK (cached)
2025-Mar-31 09:01:44 :: [aarch64] #700 octave-general-2.1.3-alt2.src.rpm: build start
2025-Mar-31 09:01:46 :: [x86_64] #700 octave-general-2.1.3-alt2.src.rpm: build OK
2025-Mar-31 09:01:46 :: [x86_64] #740 octave-geometry-4.1.0-alt1.src.rpm: build start
2025-Mar-31 09:01:47 :: [i586] #700 octave-general-2.1.3-alt2.src.rpm: build OK
2025-Mar-31 09:01:48 :: [i586] #740 octave-geometry-4.1.0-alt1.src.rpm: build start
[x86_64] find-requires: running scripts (cpp,debuginfo,files,lib,pam,perl,pkgconfig,pkgconfiglib,python,python3,rpmlib,shebang,shell,static,symlinks,systemd-services)
[x86_64] lib.req: ERROR: /usr/src/tmp/octave-geometry-buildroot/usr/lib64/octave/packages/geometry-4.1.0/x86_64-alt-linux-gnu-api-v60/clipper.mex: library liboctmex.so.1 not found
[x86_64] find-requires: ERROR: /usr/lib/rpm/lib.req failed
[x86_64] error: /bin/sh failed
[x86_64] error: Failed to find Requires
[x86_64] RPM build errors:
2025-Mar-31 09:02:38 :: [x86_64] octave-geometry-4.1.0-alt1.src.rpm: remote: build failed
2025-Mar-31 09:02:38 :: [x86_64] #740 octave-geometry-4.1.0-alt1.src.rpm: build FAILED
2025-Mar-31 09:02:38 :: [x86_64] requesting cancellation of task processing
[i586] find-requires: running scripts (cpp,debuginfo,files,lib,pam,perl,pkgconfig,pkgconfiglib,python,python3,rpmlib,shebang,shell,static,symlinks,systemd-services)
[i586] lib.req: ERROR: /usr/src/tmp/octave-geometry-buildroot/usr/lib/octave/packages/geometry-4.1.0/i586-alt-linux-gnu-api-v60/clipper.mex: library liboctmex.so.1 not found
[i586] find-requires: ERROR: /usr/lib/rpm/lib.req failed
[i586] error: /bin/sh failed
[i586] error: Failed to find Requires
[i586] RPM build errors:
2025-Mar-31 09:02:44 :: [i586] octave-geometry-4.1.0-alt1.src.rpm: remote: build failed
2025-Mar-31 09:02:44 :: [i586] #740 octave-geometry-4.1.0-alt1.src.rpm: build FAILED
2025-Mar-31 09:03:37 :: [aarch64] #700 octave-general-2.1.3-alt2.src.rpm: build OK
2025-Mar-31 09:03:37 :: [aarch64] task processing CANCELLED
2025-Mar-31 09:02:38 :: [x86_64] build FAILED
2025-Mar-31 09:02:44 :: [i586] build FAILED
2025-Mar-31 09:03:37 :: [aarch64] build FAILED
2025-Mar-31 09:03:37 :: task #379725 for sisyphus FAILED
^ permalink raw reply [flat|nested] 18+ messages in thread
* [#379725] [test-only] FAILED (try 5) octave.git=10.1.0-alt1 srpm=octave-audio-2.0.5-alt2.src.rpm ...
2025-03-30 19:09 [#379725] [test-only] FAILED octave.git=10.1.0-alt1 Girar awaiter (cas)
` (2 preceding siblings ...)
2025-03-31 9:03 ` [#379725] [test-only] FAILED (try 4) " Girar awaiter (cas)
@ 2025-03-31 9:11 ` Girar awaiter (cas)
2025-03-31 9:14 ` [#379725] [test-only] FAILED (try 6) " Girar awaiter (cas)
` (12 subsequent siblings)
16 siblings, 0 replies; 18+ messages in thread
From: Girar awaiter (cas) @ 2025-03-31 9:11 UTC (permalink / raw)
To: Andrey Cherepanov; +Cc: sisyphus-incominger, girar-builder-sisyphus
https://git.altlinux.org/tasks/379725/logs/events.5.1.log
https://packages.altlinux.org/tasks/379725
subtask name aarch64 i586 x86_64
#1100 octave-image ? failed failed
2025-Mar-31 09:08:31 :: test-only task #379725 for sisyphus resumed by cas:
2025-Mar-31 09:08:31 :: message: New_version_of_octave
#100 removed
#200 build 10.1.0-alt1 from /people/cas/packages/octave.git fetched at 2025-Mar-31 05:38:18
#300 build octave-audio-2.0.5-alt2.src.rpm from sisyphus
#400 build 0.5.1-alt1 from /gears/o/octave-dicom.git fetched at 2025-Mar-31 08:33:43 from sisyphus
#500 build 1.1.2-alt1 from /gears/o/octave-econometrics.git fetched at 2025-Mar-31 08:33:43 from sisyphus
#600 build octave-fits-1.0.7-alt4.src.rpm from sisyphus
#700 build octave-general-2.1.3-alt2.src.rpm from sisyphus
#740 removed
#1000 removed
#1100 build octave-image-2.14.0-alt1.src.rpm from sisyphus
#1200 build octave-image-acquisition-0.2.2-alt6.src.rpm from sisyphus
#1300 build octave-instrument-control-0.9.1-alt1.src.rpm from sisyphus
#1400 build octave-interval-3.2.1-alt2.src.rpm from sisyphus
#1500 build octave-io-2.6.4-alt1.src.rpm from sisyphus
#1600 build octave-lssa-0.1.4-alt1.src.rpm from sisyphus
#1700 build octave-ltfat-2.3.1-alt4.src.rpm from sisyphus
#2000 build octave-mapping-1.4.2-alt1.src.rpm from sisyphus
#2100 build octave-miscellaneous-1.3.0-alt2.src.rpm from sisyphus
#2200 build octave-netcdf-1.0.17-alt2.src.rpm from sisyphus
#2300 build octave-nurbs-1.4.3-alt1.src.rpm from sisyphus
#2400 build octave-ocl-1.2.2-alt1.src.rpm from sisyphus
#2500 build octave-optim-1.6.2-alt1.src.rpm from sisyphus
#2600 build octave-optiminterp-0.3.7-alt1.src.rpm from sisyphus
#2700 build 2.4.0-alt5 from /gears/o/octave-quaternion.git fetched at 2025-Mar-31 08:34:01 from sisyphus
#3000 build octave-signal-1.4.5-alt1.src.rpm from sisyphus
#3100 build octave-struct-1.0.18-alt1.src.rpm from sisyphus
#3200 build 0.2.0-alt5 from /gears/o/octave-vibes.git fetched at 2025-Mar-31 08:34:04 from sisyphus
#3300 build octave-zeromq-1.5.5-alt1.src.rpm from sisyphus
#3400 build 4.1.1-alt1 from /gears/o/octave-control.git fetched at 2025-Mar-31 08:34:08 from sisyphus
#3500 build octave-communications-1.2.7-alt1.src.rpm from sisyphus
#3600 build octave-queueing-1.2.8-alt1.src.rpm from sisyphus
#3700 build octave-fuzzy-logic-toolkit-0.6.1-alt1.src.rpm from sisyphus
#4000 build octave-level-set-0.3.0-alt6.src.rpm from sisyphus
#4100 build octave-financial-0.5.3-alt2.src.rpm from sisyphus
2025-Mar-31 09:08:32 :: created build repo
2025-Mar-31 09:08:33 :: [aarch64] #200 octave.git 10.1.0-alt1: build start
2025-Mar-31 09:08:33 :: [i586] #200 octave.git 10.1.0-alt1: build start
2025-Mar-31 09:08:33 :: [x86_64] #200 octave.git 10.1.0-alt1: build start
2025-Mar-31 09:08:57 :: [i586] #200 octave.git 10.1.0-alt1: build OK (cached)
2025-Mar-31 09:08:57 :: [i586] #300 octave-audio-2.0.5-alt2.src.rpm: build start
2025-Mar-31 09:08:59 :: [x86_64] #200 octave.git 10.1.0-alt1: build OK (cached)
2025-Mar-31 09:08:59 :: [x86_64] #300 octave-audio-2.0.5-alt2.src.rpm: build start
2025-Mar-31 09:09:10 :: [i586] #300 octave-audio-2.0.5-alt2.src.rpm: build OK (cached)
2025-Mar-31 09:09:11 :: [i586] #400 octave-dicom.git 0.5.1-alt1: build start
2025-Mar-31 09:09:13 :: [x86_64] #300 octave-audio-2.0.5-alt2.src.rpm: build OK (cached)
2025-Mar-31 09:09:14 :: [x86_64] #400 octave-dicom.git 0.5.1-alt1: build start
2025-Mar-31 09:09:20 :: [aarch64] #200 octave.git 10.1.0-alt1: build OK (cached)
2025-Mar-31 09:09:20 :: [aarch64] #300 octave-audio-2.0.5-alt2.src.rpm: build start
2025-Mar-31 09:09:24 :: [i586] #400 octave-dicom.git 0.5.1-alt1: build OK (cached)
2025-Mar-31 09:09:25 :: [i586] #500 octave-econometrics.git 1.1.2-alt1: build start
2025-Mar-31 09:09:28 :: [x86_64] #400 octave-dicom.git 0.5.1-alt1: build OK (cached)
2025-Mar-31 09:09:29 :: [x86_64] #500 octave-econometrics.git 1.1.2-alt1: build start
2025-Mar-31 09:09:38 :: [i586] #500 octave-econometrics.git 1.1.2-alt1: build OK (cached)
2025-Mar-31 09:09:38 :: [i586] #600 octave-fits-1.0.7-alt4.src.rpm: build start
2025-Mar-31 09:09:43 :: [x86_64] #500 octave-econometrics.git 1.1.2-alt1: build OK (cached)
2025-Mar-31 09:09:43 :: [x86_64] #600 octave-fits-1.0.7-alt4.src.rpm: build start
2025-Mar-31 09:09:45 :: [aarch64] #300 octave-audio-2.0.5-alt2.src.rpm: build OK (cached)
2025-Mar-31 09:09:46 :: [aarch64] #400 octave-dicom.git 0.5.1-alt1: build start
2025-Mar-31 09:09:51 :: [i586] #600 octave-fits-1.0.7-alt4.src.rpm: build OK (cached)
2025-Mar-31 09:09:52 :: [i586] #700 octave-general-2.1.3-alt2.src.rpm: build start
2025-Mar-31 09:09:57 :: [x86_64] #600 octave-fits-1.0.7-alt4.src.rpm: build OK (cached)
2025-Mar-31 09:09:57 :: [x86_64] #700 octave-general-2.1.3-alt2.src.rpm: build start
2025-Mar-31 09:10:05 :: [i586] #700 octave-general-2.1.3-alt2.src.rpm: build OK (cached)
2025-Mar-31 09:10:06 :: [i586] #1100 octave-image-2.14.0-alt1.src.rpm: build start
2025-Mar-31 09:10:12 :: [x86_64] #700 octave-general-2.1.3-alt2.src.rpm: build OK (cached)
2025-Mar-31 09:10:12 :: [x86_64] #1100 octave-image-2.14.0-alt1.src.rpm: build start
2025-Mar-31 09:10:12 :: [aarch64] #400 octave-dicom.git 0.5.1-alt1: build OK (cached)
2025-Mar-31 09:10:13 :: [aarch64] #500 octave-econometrics.git 1.1.2-alt1: build start
2025-Mar-31 09:10:38 :: [aarch64] #500 octave-econometrics.git 1.1.2-alt1: build OK (cached)
2025-Mar-31 09:10:38 :: [aarch64] #600 octave-fits-1.0.7-alt4.src.rpm: build start
2025-Mar-31 09:11:03 :: [aarch64] #600 octave-fits-1.0.7-alt4.src.rpm: build OK (cached)
2025-Mar-31 09:11:04 :: [aarch64] #700 octave-general-2.1.3-alt2.src.rpm: build start
[i586] strel.cc: In member function 'octave_image_pkg::strel octave_image_pkg::strel::operator()(const octave_idx_type&) const':
[i586] strel.cc:148:3: error: 'assert' was not declared in this scope
[i586] 148 | assert (i >= 0 && i < octave_idx_type (decomposition.size ()));
[i586] --
[i586] strel.cc: In member function 'void octave_image_pkg::strel::validate_origin()':
[i586] strel.cc:335:3: error: 'assert' was not declared in this scope
[i586] 335 | assert (ndims == origin.numel ());
[i586] --
[i586] make: Leaving directory '/usr/src/RPM/BUILD/image-2.14.0/image-2.14.0/src'
[i586] error: pkg: error running 'make' for the image package
[i586] error: called from
[i586] configure_make at line 117 column 9
2025-Mar-31 09:11:05 :: [i586] octave-image-2.14.0-alt1.src.rpm: remote: build failed
2025-Mar-31 09:11:05 :: [i586] #1100 octave-image-2.14.0-alt1.src.rpm: build FAILED
2025-Mar-31 09:11:05 :: [i586] requesting cancellation of task processing
[x86_64] strel.cc: In member function 'octave_image_pkg::strel octave_image_pkg::strel::operator()(const octave_idx_type&) const':
[x86_64] strel.cc:148:3: error: 'assert' was not declared in this scope
[x86_64] 148 | assert (i >= 0 && i < octave_idx_type (decomposition.size ()));
[x86_64] --
[x86_64] strel.cc: In member function 'void octave_image_pkg::strel::validate_origin()':
[x86_64] strel.cc:335:3: error: 'assert' was not declared in this scope
[x86_64] 335 | assert (ndims == origin.numel ());
[x86_64] --
[x86_64] make: Leaving directory '/usr/src/RPM/BUILD/image-2.14.0/image-2.14.0/src'
[x86_64] error: pkg: error running 'make' for the image package
[x86_64] error: called from
[x86_64] configure_make at line 117 column 9
2025-Mar-31 09:11:07 :: [x86_64] octave-image-2.14.0-alt1.src.rpm: remote: build failed
2025-Mar-31 09:11:07 :: [x86_64] #1100 octave-image-2.14.0-alt1.src.rpm: build FAILED
2025-Mar-31 09:11:31 :: [aarch64] #700 octave-general-2.1.3-alt2.src.rpm: build OK (cached)
2025-Mar-31 09:11:32 :: [aarch64] task processing CANCELLED
2025-Mar-31 09:11:06 :: [i586] build FAILED
2025-Mar-31 09:11:07 :: [x86_64] build FAILED
2025-Mar-31 09:11:32 :: [aarch64] build FAILED
2025-Mar-31 09:11:32 :: task #379725 for sisyphus FAILED
^ permalink raw reply [flat|nested] 18+ messages in thread
* [#379725] [test-only] FAILED (try 6) octave.git=10.1.0-alt1 srpm=octave-audio-2.0.5-alt2.src.rpm ...
2025-03-30 19:09 [#379725] [test-only] FAILED octave.git=10.1.0-alt1 Girar awaiter (cas)
` (3 preceding siblings ...)
2025-03-31 9:11 ` [#379725] [test-only] FAILED (try 5) " Girar awaiter (cas)
@ 2025-03-31 9:14 ` Girar awaiter (cas)
2025-03-31 9:40 ` [#379725] [test-only] FAILED (try 7) " Girar awaiter (cas)
` (11 subsequent siblings)
16 siblings, 0 replies; 18+ messages in thread
From: Girar awaiter (cas) @ 2025-03-31 9:14 UTC (permalink / raw)
To: Andrey Cherepanov; +Cc: sisyphus-incominger, girar-builder-sisyphus
https://git.altlinux.org/tasks/379725/logs/events.6.1.log
https://packages.altlinux.org/tasks/379725
subtask name aarch64 i586 x86_64
#1200 octave-image-acquisition ? failed failed
2025-Mar-31 09:12:27 :: test-only task #379725 for sisyphus resumed by cas:
2025-Mar-31 09:12:27 :: message: New_version_of_octave
#100 removed
#200 build 10.1.0-alt1 from /people/cas/packages/octave.git fetched at 2025-Mar-31 05:38:18
#300 build octave-audio-2.0.5-alt2.src.rpm from sisyphus
#400 build 0.5.1-alt1 from /gears/o/octave-dicom.git fetched at 2025-Mar-31 08:33:43 from sisyphus
#500 build 1.1.2-alt1 from /gears/o/octave-econometrics.git fetched at 2025-Mar-31 08:33:43 from sisyphus
#600 build octave-fits-1.0.7-alt4.src.rpm from sisyphus
#700 build octave-general-2.1.3-alt2.src.rpm from sisyphus
#740 removed
#1000 removed
#1100 removed
#1200 build octave-image-acquisition-0.2.2-alt6.src.rpm from sisyphus
#1300 build octave-instrument-control-0.9.1-alt1.src.rpm from sisyphus
#1400 build octave-interval-3.2.1-alt2.src.rpm from sisyphus
#1500 build octave-io-2.6.4-alt1.src.rpm from sisyphus
#1600 build octave-lssa-0.1.4-alt1.src.rpm from sisyphus
#1700 build octave-ltfat-2.3.1-alt4.src.rpm from sisyphus
#2000 build octave-mapping-1.4.2-alt1.src.rpm from sisyphus
#2100 build octave-miscellaneous-1.3.0-alt2.src.rpm from sisyphus
#2200 build octave-netcdf-1.0.17-alt2.src.rpm from sisyphus
#2300 build octave-nurbs-1.4.3-alt1.src.rpm from sisyphus
#2400 build octave-ocl-1.2.2-alt1.src.rpm from sisyphus
#2500 build octave-optim-1.6.2-alt1.src.rpm from sisyphus
#2600 build octave-optiminterp-0.3.7-alt1.src.rpm from sisyphus
#2700 build 2.4.0-alt5 from /gears/o/octave-quaternion.git fetched at 2025-Mar-31 08:34:01 from sisyphus
#3000 build octave-signal-1.4.5-alt1.src.rpm from sisyphus
#3100 build octave-struct-1.0.18-alt1.src.rpm from sisyphus
#3200 build 0.2.0-alt5 from /gears/o/octave-vibes.git fetched at 2025-Mar-31 08:34:04 from sisyphus
#3300 build octave-zeromq-1.5.5-alt1.src.rpm from sisyphus
#3400 build 4.1.1-alt1 from /gears/o/octave-control.git fetched at 2025-Mar-31 08:34:08 from sisyphus
#3500 build octave-communications-1.2.7-alt1.src.rpm from sisyphus
#3600 build octave-queueing-1.2.8-alt1.src.rpm from sisyphus
#3700 build octave-fuzzy-logic-toolkit-0.6.1-alt1.src.rpm from sisyphus
#4000 build octave-level-set-0.3.0-alt6.src.rpm from sisyphus
#4100 build octave-financial-0.5.3-alt2.src.rpm from sisyphus
2025-Mar-31 09:12:27 :: created build repo
2025-Mar-31 09:12:28 :: [x86_64] #200 octave.git 10.1.0-alt1: build start
2025-Mar-31 09:12:28 :: [i586] #200 octave.git 10.1.0-alt1: build start
2025-Mar-31 09:12:28 :: [aarch64] #200 octave.git 10.1.0-alt1: build start
2025-Mar-31 09:12:52 :: [i586] #200 octave.git 10.1.0-alt1: build OK (cached)
2025-Mar-31 09:12:52 :: [i586] #300 octave-audio-2.0.5-alt2.src.rpm: build start
2025-Mar-31 09:12:54 :: [x86_64] #200 octave.git 10.1.0-alt1: build OK (cached)
2025-Mar-31 09:12:54 :: [x86_64] #300 octave-audio-2.0.5-alt2.src.rpm: build start
2025-Mar-31 09:13:05 :: [i586] #300 octave-audio-2.0.5-alt2.src.rpm: build OK (cached)
2025-Mar-31 09:13:06 :: [i586] #400 octave-dicom.git 0.5.1-alt1: build start
2025-Mar-31 09:13:08 :: [x86_64] #300 octave-audio-2.0.5-alt2.src.rpm: build OK (cached)
2025-Mar-31 09:13:08 :: [x86_64] #400 octave-dicom.git 0.5.1-alt1: build start
2025-Mar-31 09:13:14 :: [aarch64] #200 octave.git 10.1.0-alt1: build OK (cached)
2025-Mar-31 09:13:14 :: [aarch64] #300 octave-audio-2.0.5-alt2.src.rpm: build start
2025-Mar-31 09:13:20 :: [i586] #400 octave-dicom.git 0.5.1-alt1: build OK (cached)
2025-Mar-31 09:13:20 :: [i586] #500 octave-econometrics.git 1.1.2-alt1: build start
2025-Mar-31 09:13:23 :: [x86_64] #400 octave-dicom.git 0.5.1-alt1: build OK (cached)
2025-Mar-31 09:13:23 :: [x86_64] #500 octave-econometrics.git 1.1.2-alt1: build start
2025-Mar-31 09:13:33 :: [i586] #500 octave-econometrics.git 1.1.2-alt1: build OK (cached)
2025-Mar-31 09:13:33 :: [i586] #600 octave-fits-1.0.7-alt4.src.rpm: build start
2025-Mar-31 09:13:37 :: [x86_64] #500 octave-econometrics.git 1.1.2-alt1: build OK (cached)
2025-Mar-31 09:13:38 :: [x86_64] #600 octave-fits-1.0.7-alt4.src.rpm: build start
2025-Mar-31 09:13:40 :: [aarch64] #300 octave-audio-2.0.5-alt2.src.rpm: build OK (cached)
2025-Mar-31 09:13:40 :: [aarch64] #400 octave-dicom.git 0.5.1-alt1: build start
2025-Mar-31 09:13:47 :: [i586] #600 octave-fits-1.0.7-alt4.src.rpm: build OK (cached)
2025-Mar-31 09:13:47 :: [i586] #700 octave-general-2.1.3-alt2.src.rpm: build start
2025-Mar-31 09:13:52 :: [x86_64] #600 octave-fits-1.0.7-alt4.src.rpm: build OK (cached)
2025-Mar-31 09:13:52 :: [x86_64] #700 octave-general-2.1.3-alt2.src.rpm: build start
2025-Mar-31 09:14:01 :: [i586] #700 octave-general-2.1.3-alt2.src.rpm: build OK (cached)
2025-Mar-31 09:14:01 :: [i586] #1200 octave-image-acquisition-0.2.2-alt6.src.rpm: build start
2025-Mar-31 09:14:06 :: [x86_64] #700 octave-general-2.1.3-alt2.src.rpm: build OK (cached)
2025-Mar-31 09:14:06 :: [aarch64] #400 octave-dicom.git 0.5.1-alt1: build OK (cached)
2025-Mar-31 09:14:07 :: [x86_64] #1200 octave-image-acquisition-0.2.2-alt6.src.rpm: build start
2025-Mar-31 09:14:07 :: [aarch64] #500 octave-econometrics.git 1.1.2-alt1: build start
2025-Mar-31 09:14:32 :: [aarch64] #500 octave-econometrics.git 1.1.2-alt1: build OK (cached)
2025-Mar-31 09:14:32 :: [aarch64] #600 octave-fits-1.0.7-alt4.src.rpm: build start
[i586] cl_v4l2_handler.cc: In member function 'octave_value_list v4l2_handler::capture(int, int)':
[i586] cl_v4l2_handler.cc:765:7: error: 'assert' was not declared in this scope
[i586] 765 | assert(img.numel() == int(buf.bytesused));
[i586] --
[i586] 17 |
[i586] cl_v4l2_handler.cc:789:7: error: 'assert' was not declared in this scope
[i586] 789 | assert(img.numel()*2 == int(buf.bytesused));
[i586] cl_v4l2_handler.cc:789:7: note: 'assert' is defined in header '<cassert>'; this is probably fixable by adding '#include <cassert>'
[i586] cl_v4l2_handler.cc:803:7: error: 'assert' was not declared in this scope
[i586] 803 | assert(img.numel() == int(buf.bytesused));
[i586] cl_v4l2_handler.cc:803:7: note: 'assert' is defined in header '<cassert>'; this is probably fixable by adding '#include <cassert>'
[i586] cl_v4l2_handler.cc:818:7: error: 'assert' was not declared in this scope
[i586] 818 | assert ((y.numel() + cb.numel() + cr.numel()) == int(buf.bytesused));
[i586] cl_v4l2_handler.cc:818:7: note: 'assert' is defined in header '<cassert>'; this is probably fixable by adding '#include <cassert>'
[i586] cl_v4l2_handler.cc:845:7: error: 'assert' was not declared in this scope
[i586] 845 | assert ((y.numel() + c1.numel() + c2.numel()) == int(buf.bytesused));
[i586] --
[i586] make: Leaving directory '/usr/src/RPM/BUILD/image-acquisition-0.2.2/image-acquisition-0.2.2/src'
[i586] error: pkg: error running 'make' for the image-acquisition package
[i586] error: called from
[i586] configure_make at line 117 column 9
2025-Mar-31 09:14:44 :: [i586] octave-image-acquisition-0.2.2-alt6.src.rpm: remote: build failed
2025-Mar-31 09:14:44 :: [i586] #1200 octave-image-acquisition-0.2.2-alt6.src.rpm: build FAILED
2025-Mar-31 09:14:44 :: [i586] requesting cancellation of task processing
[x86_64] cl_v4l2_handler.cc: In member function 'octave_value_list v4l2_handler::capture(int, int)':
[x86_64] cl_v4l2_handler.cc:765:7: error: 'assert' was not declared in this scope
[x86_64] 765 | assert(img.numel() == int(buf.bytesused));
[x86_64] --
[x86_64] 17 |
[x86_64] cl_v4l2_handler.cc:789:7: error: 'assert' was not declared in this scope
[x86_64] 789 | assert(img.numel()*2 == int(buf.bytesused));
[x86_64] cl_v4l2_handler.cc:789:7: note: 'assert' is defined in header '<cassert>'; this is probably fixable by adding '#include <cassert>'
[x86_64] cl_v4l2_handler.cc:803:7: error: 'assert' was not declared in this scope
[x86_64] 803 | assert(img.numel() == int(buf.bytesused));
[x86_64] cl_v4l2_handler.cc:803:7: note: 'assert' is defined in header '<cassert>'; this is probably fixable by adding '#include <cassert>'
[x86_64] cl_v4l2_handler.cc:818:7: error: 'assert' was not declared in this scope
[x86_64] 818 | assert ((y.numel() + cb.numel() + cr.numel()) == int(buf.bytesused));
[x86_64] cl_v4l2_handler.cc:818:7: note: 'assert' is defined in header '<cassert>'; this is probably fixable by adding '#include <cassert>'
[x86_64] cl_v4l2_handler.cc:845:7: error: 'assert' was not declared in this scope
[x86_64] 845 | assert ((y.numel() + c1.numel() + c2.numel()) == int(buf.bytesused));
[x86_64] --
[x86_64] make: Leaving directory '/usr/src/RPM/BUILD/image-acquisition-0.2.2/image-acquisition-0.2.2/src'
[x86_64] error: pkg: error running 'make' for the image-acquisition package
[x86_64] error: called from
[x86_64] configure_make at line 117 column 9
2025-Mar-31 09:14:47 :: [x86_64] octave-image-acquisition-0.2.2-alt6.src.rpm: remote: build failed
2025-Mar-31 09:14:47 :: [x86_64] #1200 octave-image-acquisition-0.2.2-alt6.src.rpm: build FAILED
2025-Mar-31 09:14:57 :: [aarch64] #600 octave-fits-1.0.7-alt4.src.rpm: build OK (cached)
2025-Mar-31 09:14:57 :: [aarch64] task processing CANCELLED
2025-Mar-31 09:14:44 :: [i586] build FAILED
2025-Mar-31 09:14:47 :: [x86_64] build FAILED
2025-Mar-31 09:14:57 :: [aarch64] build FAILED
2025-Mar-31 09:14:57 :: task #379725 for sisyphus FAILED
^ permalink raw reply [flat|nested] 18+ messages in thread
* [#379725] [test-only] FAILED (try 7) octave.git=10.1.0-alt1 srpm=octave-audio-2.0.5-alt2.src.rpm ...
2025-03-30 19:09 [#379725] [test-only] FAILED octave.git=10.1.0-alt1 Girar awaiter (cas)
` (4 preceding siblings ...)
2025-03-31 9:14 ` [#379725] [test-only] FAILED (try 6) " Girar awaiter (cas)
@ 2025-03-31 9:40 ` Girar awaiter (cas)
2025-03-31 10:29 ` [#379725] [test-only] FAILED (try 8) " Girar awaiter (cas)
` (10 subsequent siblings)
16 siblings, 0 replies; 18+ messages in thread
From: Girar awaiter (cas) @ 2025-03-31 9:40 UTC (permalink / raw)
To: Andrey Cherepanov; +Cc: sisyphus-incominger, girar-builder-sisyphus
https://git.altlinux.org/tasks/379725/logs/events.7.1.log
https://packages.altlinux.org/tasks/379725
subtask name aarch64 i586 x86_64
#700 octave-general 1:59 1:13 1:07
#1300 octave-instrument-control 5:04 2:37 2:40
#1400 octave-interval ? 1:14 1:07
#1500 octave-io ? 1:02 57
#1600 octave-lssa ? 49 48
#1700 octave-ltfat ? failed failed
2025-Mar-31 09:30:29 :: test-only task #379725 for sisyphus resumed by cas:
2025-Mar-31 09:30:29 :: message: New_version_of_octave
#100 removed
#200 build 10.1.0-alt1 from /people/cas/packages/octave.git fetched at 2025-Mar-31 05:38:18
#300 build octave-audio-2.0.5-alt2.src.rpm from sisyphus
#400 build 0.5.1-alt1 from /gears/o/octave-dicom.git fetched at 2025-Mar-31 08:33:43 from sisyphus
#500 build 1.1.2-alt1 from /gears/o/octave-econometrics.git fetched at 2025-Mar-31 08:33:43 from sisyphus
#600 build octave-fits-1.0.7-alt4.src.rpm from sisyphus
#700 build octave-general-2.1.3-alt2.src.rpm from sisyphus
#740 removed
#1000 removed
#1100 removed
#1200 removed
#1300 build octave-instrument-control-0.9.1-alt1.src.rpm from sisyphus
#1400 build octave-interval-3.2.1-alt2.src.rpm from sisyphus
#1500 build octave-io-2.6.4-alt1.src.rpm from sisyphus
#1600 build octave-lssa-0.1.4-alt1.src.rpm from sisyphus
#1700 build octave-ltfat-2.3.1-alt4.src.rpm from sisyphus
#2000 build octave-mapping-1.4.2-alt1.src.rpm from sisyphus
#2100 build octave-miscellaneous-1.3.0-alt2.src.rpm from sisyphus
#2200 build octave-netcdf-1.0.17-alt2.src.rpm from sisyphus
#2300 build octave-nurbs-1.4.3-alt1.src.rpm from sisyphus
#2400 build octave-ocl-1.2.2-alt1.src.rpm from sisyphus
#2500 build octave-optim-1.6.2-alt1.src.rpm from sisyphus
#2600 build octave-optiminterp-0.3.7-alt1.src.rpm from sisyphus
#2700 build 2.4.0-alt5 from /gears/o/octave-quaternion.git fetched at 2025-Mar-31 08:34:01 from sisyphus
#3000 build octave-signal-1.4.5-alt1.src.rpm from sisyphus
#3100 build octave-struct-1.0.18-alt1.src.rpm from sisyphus
#3200 build 0.2.0-alt5 from /gears/o/octave-vibes.git fetched at 2025-Mar-31 08:34:04 from sisyphus
#3300 build octave-zeromq-1.5.5-alt1.src.rpm from sisyphus
#3400 build 4.1.1-alt1 from /gears/o/octave-control.git fetched at 2025-Mar-31 08:34:08 from sisyphus
#3500 build octave-communications-1.2.7-alt1.src.rpm from sisyphus
#3600 build octave-queueing-1.2.8-alt1.src.rpm from sisyphus
#3700 build octave-fuzzy-logic-toolkit-0.6.1-alt1.src.rpm from sisyphus
#4000 build octave-level-set-0.3.0-alt6.src.rpm from sisyphus
#4100 build octave-financial-0.5.3-alt2.src.rpm from sisyphus
2025-Mar-31 09:30:30 :: created build repo
2025-Mar-31 09:30:30 :: #700: force rebuild
2025-Mar-31 09:30:31 :: [i586] #200 octave.git 10.1.0-alt1: build start
2025-Mar-31 09:30:31 :: [aarch64] #200 octave.git 10.1.0-alt1: build start
2025-Mar-31 09:30:31 :: [x86_64] #200 octave.git 10.1.0-alt1: build start
2025-Mar-31 09:30:55 :: [i586] #200 octave.git 10.1.0-alt1: build OK (cached)
2025-Mar-31 09:30:55 :: [i586] #300 octave-audio-2.0.5-alt2.src.rpm: build start
2025-Mar-31 09:30:57 :: [x86_64] #200 octave.git 10.1.0-alt1: build OK (cached)
2025-Mar-31 09:30:58 :: [x86_64] #300 octave-audio-2.0.5-alt2.src.rpm: build start
2025-Mar-31 09:31:08 :: [i586] #300 octave-audio-2.0.5-alt2.src.rpm: build OK (cached)
2025-Mar-31 09:31:09 :: [i586] #400 octave-dicom.git 0.5.1-alt1: build start
2025-Mar-31 09:31:12 :: [x86_64] #300 octave-audio-2.0.5-alt2.src.rpm: build OK (cached)
2025-Mar-31 09:31:12 :: [x86_64] #400 octave-dicom.git 0.5.1-alt1: build start
2025-Mar-31 09:31:18 :: [aarch64] #200 octave.git 10.1.0-alt1: build OK (cached)
2025-Mar-31 09:31:18 :: [aarch64] #300 octave-audio-2.0.5-alt2.src.rpm: build start
2025-Mar-31 09:31:23 :: [i586] #400 octave-dicom.git 0.5.1-alt1: build OK (cached)
2025-Mar-31 09:31:23 :: [i586] #500 octave-econometrics.git 1.1.2-alt1: build start
2025-Mar-31 09:31:27 :: [x86_64] #400 octave-dicom.git 0.5.1-alt1: build OK (cached)
2025-Mar-31 09:31:27 :: [x86_64] #500 octave-econometrics.git 1.1.2-alt1: build start
2025-Mar-31 09:31:36 :: [i586] #500 octave-econometrics.git 1.1.2-alt1: build OK (cached)
2025-Mar-31 09:31:37 :: [i586] #600 octave-fits-1.0.7-alt4.src.rpm: build start
2025-Mar-31 09:31:42 :: [x86_64] #500 octave-econometrics.git 1.1.2-alt1: build OK (cached)
2025-Mar-31 09:31:42 :: [x86_64] #600 octave-fits-1.0.7-alt4.src.rpm: build start
2025-Mar-31 09:31:45 :: [aarch64] #300 octave-audio-2.0.5-alt2.src.rpm: build OK (cached)
2025-Mar-31 09:31:45 :: [aarch64] #400 octave-dicom.git 0.5.1-alt1: build start
2025-Mar-31 09:31:50 :: [i586] #600 octave-fits-1.0.7-alt4.src.rpm: build OK (cached)
2025-Mar-31 09:31:50 :: [i586] #700 octave-general-2.1.3-alt2.src.rpm: build start
2025-Mar-31 09:31:56 :: [x86_64] #600 octave-fits-1.0.7-alt4.src.rpm: build OK (cached)
2025-Mar-31 09:31:57 :: [x86_64] #700 octave-general-2.1.3-alt2.src.rpm: build start
2025-Mar-31 09:32:12 :: [aarch64] #400 octave-dicom.git 0.5.1-alt1: build OK (cached)
2025-Mar-31 09:32:12 :: [aarch64] #500 octave-econometrics.git 1.1.2-alt1: build start
2025-Mar-31 09:32:38 :: [aarch64] #500 octave-econometrics.git 1.1.2-alt1: build OK (cached)
2025-Mar-31 09:32:38 :: [aarch64] #600 octave-fits-1.0.7-alt4.src.rpm: build start
2025-Mar-31 09:33:03 :: [i586] #700 octave-general-2.1.3-alt2.src.rpm: build OK
2025-Mar-31 09:33:03 :: [i586] #1300 octave-instrument-control-0.9.1-alt1.src.rpm: build start
2025-Mar-31 09:33:04 :: [x86_64] #700 octave-general-2.1.3-alt2.src.rpm: build OK
2025-Mar-31 09:33:04 :: [x86_64] #1300 octave-instrument-control-0.9.1-alt1.src.rpm: build start
2025-Mar-31 09:33:04 :: [aarch64] #600 octave-fits-1.0.7-alt4.src.rpm: build OK (cached)
2025-Mar-31 09:33:04 :: [aarch64] #700 octave-general-2.1.3-alt2.src.rpm: build start
2025-Mar-31 09:35:03 :: [aarch64] #700 octave-general-2.1.3-alt2.src.rpm: build OK
2025-Mar-31 09:35:03 :: [aarch64] #1300 octave-instrument-control-0.9.1-alt1.src.rpm: build start
2025-Mar-31 09:35:40 :: [i586] #1300 octave-instrument-control-0.9.1-alt1.src.rpm: build OK
2025-Mar-31 09:35:40 :: [i586] #1400 octave-interval-3.2.1-alt2.src.rpm: build start
2025-Mar-31 09:35:44 :: [x86_64] #1300 octave-instrument-control-0.9.1-alt1.src.rpm: build OK
2025-Mar-31 09:35:44 :: [x86_64] #1400 octave-interval-3.2.1-alt2.src.rpm: build start
2025-Mar-31 09:36:51 :: [x86_64] #1400 octave-interval-3.2.1-alt2.src.rpm: build OK
2025-Mar-31 09:36:51 :: [x86_64] #1500 octave-io-2.6.4-alt1.src.rpm: build start
2025-Mar-31 09:36:54 :: [i586] #1400 octave-interval-3.2.1-alt2.src.rpm: build OK
2025-Mar-31 09:36:54 :: [i586] #1500 octave-io-2.6.4-alt1.src.rpm: build start
2025-Mar-31 09:37:48 :: [x86_64] #1500 octave-io-2.6.4-alt1.src.rpm: build OK
2025-Mar-31 09:37:48 :: [x86_64] #1600 octave-lssa-0.1.4-alt1.src.rpm: build start
2025-Mar-31 09:37:56 :: [i586] #1500 octave-io-2.6.4-alt1.src.rpm: build OK
2025-Mar-31 09:37:57 :: [i586] #1600 octave-lssa-0.1.4-alt1.src.rpm: build start
2025-Mar-31 09:38:36 :: [x86_64] #1600 octave-lssa-0.1.4-alt1.src.rpm: build OK
2025-Mar-31 09:38:36 :: [x86_64] #1700 octave-ltfat-2.3.1-alt4.src.rpm: build start
2025-Mar-31 09:38:46 :: [i586] #1600 octave-lssa-0.1.4-alt1.src.rpm: build OK
2025-Mar-31 09:38:47 :: [i586] #1700 octave-ltfat-2.3.1-alt4.src.rpm: build start
[x86_64] /usr/include/octave-10.1.0/octave/../octave/MSparse.cc:255:28: error: 'const class MSparse<std::complex<double> >' has no member named 'rows'
[x86_64] 255 | octave_idx_type a_nr = a.rows ();
[x86_64] /usr/include/octave-10.1.0/octave/../octave/MSparse.cc:256:28: error: 'const class MSparse<std::complex<double> >' has no member named 'cols'
[x86_64] 256 | octave_idx_type a_nc = a.cols ();
[x86_64] /usr/include/octave-10.1.0/octave/../octave/MSparse.cc:258:28: error: 'const class MSparse<std::complex<double> >' has no member named 'rows'
[x86_64] 258 | octave_idx_type b_nr = b.rows ();
[x86_64] /usr/include/octave-10.1.0/octave/../octave/MSparse.cc:259:28: error: 'const class MSparse<std::complex<double> >' has no member named 'cols'
[x86_64] 259 | octave_idx_type b_nc = b.cols ();
[x86_64] /usr/include/octave-10.1.0/octave/../octave/MSparse.cc:263:13: error: 'const class MSparse<std::complex<double> >' has no member named 'elem'
[x86_64] 263 | if (a.elem (0, 0) == 0.)
[x86_64] /usr/include/octave-10.1.0/octave/../octave/MSparse.cc:270:45: error: 'const class MSparse<std::complex<double> >' has no member named 'data'
[x86_64] 270 | r = MSparse<T> (b_nr, b_nc, op (a.data (0), 0.));
[x86_64] /usr/include/octave-10.1.0/octave/../octave/MSparse.cc:276:42: error: 'const class MSparse<std::complex<double> >' has no member named 'cidx'
[x86_64] 276 | for (octave_idx_type i = b.cidx (j) ; i < b.cidx (j+1) ; i++)
[x86_64] /usr/include/octave-10.1.0/octave/../octave/MSparse.cc:276:59: error: 'const class MSparse<std::complex<double> >' has no member named 'cidx'
[x86_64] 276 | for (octave_idx_type i = b.cidx (j) ; i < b.cidx (j+1) ; i++)
[x86_64] /usr/include/octave-10.1.0/octave/../octave/MSparse.cc:279:21: error: 'class MSparse<std::complex<double> >' has no member named 'data'
[x86_64] 279 | r.data (idxj + b.ridx (i)) = op (a.data (0), b.data (i));
[x86_64] /usr/include/octave-10.1.0/octave/../octave/MSparse.cc:279:36: error: 'const class MSparse<std::complex<double> >' has no member named 'ridx'
[x86_64] 279 | r.data (idxj + b.ridx (i)) = op (a.data (0), b.data (i));
2025-Mar-31 09:39:16 :: [x86_64] octave-ltfat-2.3.1-alt4.src.rpm: remote: build failed
2025-Mar-31 09:39:16 :: [x86_64] #1700 octave-ltfat-2.3.1-alt4.src.rpm: build FAILED
2025-Mar-31 09:39:16 :: [x86_64] requesting cancellation of task processing
[i586] /usr/include/octave-10.1.0/octave/../octave/MSparse.cc:255:28: error: 'const class MSparse<std::complex<double> >' has no member named 'rows'
[i586] 255 | octave_idx_type a_nr = a.rows ();
[i586] /usr/include/octave-10.1.0/octave/../octave/MSparse.cc:256:28: error: 'const class MSparse<std::complex<double> >' has no member named 'cols'
[i586] 256 | octave_idx_type a_nc = a.cols ();
[i586] /usr/include/octave-10.1.0/octave/../octave/MSparse.cc:258:28: error: 'const class MSparse<std::complex<double> >' has no member named 'rows'
[i586] 258 | octave_idx_type b_nr = b.rows ();
[i586] /usr/include/octave-10.1.0/octave/../octave/MSparse.cc:259:28: error: 'const class MSparse<std::complex<double> >' has no member named 'cols'
[i586] 259 | octave_idx_type b_nc = b.cols ();
[i586] /usr/include/octave-10.1.0/octave/../octave/MSparse.cc:263:13: error: 'const class MSparse<std::complex<double> >' has no member named 'elem'
[i586] 263 | if (a.elem (0, 0) == 0.)
[i586] /usr/include/octave-10.1.0/octave/../octave/MSparse.cc:270:45: error: 'const class MSparse<std::complex<double> >' has no member named 'data'
[i586] 270 | r = MSparse<T> (b_nr, b_nc, op (a.data (0), 0.));
[i586] /usr/include/octave-10.1.0/octave/../octave/MSparse.cc:276:42: error: 'const class MSparse<std::complex<double> >' has no member named 'cidx'
[i586] 276 | for (octave_idx_type i = b.cidx (j) ; i < b.cidx (j+1) ; i++)
[i586] /usr/include/octave-10.1.0/octave/../octave/MSparse.cc:276:59: error: 'const class MSparse<std::complex<double> >' has no member named 'cidx'
[i586] 276 | for (octave_idx_type i = b.cidx (j) ; i < b.cidx (j+1) ; i++)
[i586] /usr/include/octave-10.1.0/octave/../octave/MSparse.cc:279:21: error: 'class MSparse<std::complex<double> >' has no member named 'data'
[i586] 279 | r.data (idxj + b.ridx (i)) = op (a.data (0), b.data (i));
[i586] /usr/include/octave-10.1.0/octave/../octave/MSparse.cc:279:36: error: 'const class MSparse<std::complex<double> >' has no member named 'ridx'
[i586] 279 | r.data (idxj + b.ridx (i)) = op (a.data (0), b.data (i));
2025-Mar-31 09:39:29 :: [i586] octave-ltfat-2.3.1-alt4.src.rpm: remote: build failed
2025-Mar-31 09:39:29 :: [i586] #1700 octave-ltfat-2.3.1-alt4.src.rpm: build FAILED
2025-Mar-31 09:40:07 :: [aarch64] #1300 octave-instrument-control-0.9.1-alt1.src.rpm: build OK
2025-Mar-31 09:40:08 :: [aarch64] task processing CANCELLED
2025-Mar-31 09:39:16 :: [x86_64] build FAILED
2025-Mar-31 09:39:29 :: [i586] build FAILED
2025-Mar-31 09:40:08 :: [aarch64] build FAILED
2025-Mar-31 09:40:08 :: task #379725 for sisyphus FAILED
^ permalink raw reply [flat|nested] 18+ messages in thread
* [#379725] [test-only] FAILED (try 8) octave.git=10.1.0-alt1 srpm=octave-audio-2.0.5-alt2.src.rpm ...
2025-03-30 19:09 [#379725] [test-only] FAILED octave.git=10.1.0-alt1 Girar awaiter (cas)
` (5 preceding siblings ...)
2025-03-31 9:40 ` [#379725] [test-only] FAILED (try 7) " Girar awaiter (cas)
@ 2025-03-31 10:29 ` Girar awaiter (cas)
2025-03-31 11:51 ` [#379725] [test-only] FAILED (try 9) " Girar awaiter (cas)
` (9 subsequent siblings)
16 siblings, 0 replies; 18+ messages in thread
From: Girar awaiter (cas) @ 2025-03-31 10:29 UTC (permalink / raw)
To: Andrey Cherepanov; +Cc: sisyphus-incominger, girar-builder-sisyphus
https://git.altlinux.org/tasks/379725/logs/events.8.1.log
https://packages.altlinux.org/tasks/379725
subtask name aarch64 i586 x86_64
#1400 octave-interval 1:48 1:14 1:09
#1500 octave-io 1:35 1:05 59
#1600 octave-lssa 1:16 1:01 57
#2000 octave-mapping 2:32 2:19 2:26
#2100 octave-miscellaneous ? 1:57 1:49
#2200 octave-netcdf ? 1:36 1:32
#2300 octave-nurbs ? failed failed
2025-Mar-31 10:17:43 :: test-only task #379725 for sisyphus resumed by cas:
2025-Mar-31 10:17:43 :: message: New_version_of_octave
#100 removed
#200 build 10.1.0-alt1 from /people/cas/packages/octave.git fetched at 2025-Mar-31 05:38:18
#300 build octave-audio-2.0.5-alt2.src.rpm from sisyphus
#400 build 0.5.1-alt1 from /gears/o/octave-dicom.git fetched at 2025-Mar-31 08:33:43 from sisyphus
#500 build 1.1.2-alt1 from /gears/o/octave-econometrics.git fetched at 2025-Mar-31 08:33:43 from sisyphus
#600 build octave-fits-1.0.7-alt4.src.rpm from sisyphus
#700 build octave-general-2.1.3-alt2.src.rpm from sisyphus
#740 removed
#1000 removed
#1100 removed
#1200 removed
#1300 build octave-instrument-control-0.9.1-alt1.src.rpm from sisyphus
#1400 build octave-interval-3.2.1-alt2.src.rpm from sisyphus
#1500 build octave-io-2.6.4-alt1.src.rpm from sisyphus
#1600 build octave-lssa-0.1.4-alt1.src.rpm from sisyphus
#1700 removed
#2000 build octave-mapping-1.4.2-alt1.src.rpm from sisyphus
#2100 build octave-miscellaneous-1.3.0-alt2.src.rpm from sisyphus
#2200 build octave-netcdf-1.0.17-alt2.src.rpm from sisyphus
#2300 build octave-nurbs-1.4.3-alt1.src.rpm from sisyphus
#2400 build octave-ocl-1.2.2-alt1.src.rpm from sisyphus
#2500 build octave-optim-1.6.2-alt1.src.rpm from sisyphus
#2600 build octave-optiminterp-0.3.7-alt1.src.rpm from sisyphus
#2700 build 2.4.0-alt5 from /gears/o/octave-quaternion.git fetched at 2025-Mar-31 08:34:01 from sisyphus
#3000 build octave-signal-1.4.5-alt1.src.rpm from sisyphus
#3100 build octave-struct-1.0.18-alt1.src.rpm from sisyphus
#3200 build 0.2.0-alt5 from /gears/o/octave-vibes.git fetched at 2025-Mar-31 08:34:04 from sisyphus
#3300 build octave-zeromq-1.5.5-alt1.src.rpm from sisyphus
#3400 build 4.1.1-alt1 from /gears/o/octave-control.git fetched at 2025-Mar-31 08:34:08 from sisyphus
#3500 build octave-communications-1.2.7-alt1.src.rpm from sisyphus
#3600 build octave-queueing-1.2.8-alt1.src.rpm from sisyphus
#3700 build octave-fuzzy-logic-toolkit-0.6.1-alt1.src.rpm from sisyphus
#4000 build octave-level-set-0.3.0-alt6.src.rpm from sisyphus
#4100 build octave-financial-0.5.3-alt2.src.rpm from sisyphus
2025-Mar-31 10:17:44 :: created build repo
2025-Mar-31 10:17:44 :: #1400: force rebuild
2025-Mar-31 10:17:44 :: #1500: force rebuild
2025-Mar-31 10:17:44 :: #1600: force rebuild
2025-Mar-31 10:17:45 :: [aarch64] #200 octave.git 10.1.0-alt1: build start
2025-Mar-31 10:17:45 :: [i586] #200 octave.git 10.1.0-alt1: build start
2025-Mar-31 10:17:45 :: [x86_64] #200 octave.git 10.1.0-alt1: build start
2025-Mar-31 10:18:10 :: [i586] #200 octave.git 10.1.0-alt1: build OK (cached)
2025-Mar-31 10:18:10 :: [i586] #300 octave-audio-2.0.5-alt2.src.rpm: build start
2025-Mar-31 10:18:11 :: [x86_64] #200 octave.git 10.1.0-alt1: build OK (cached)
2025-Mar-31 10:18:11 :: [x86_64] #300 octave-audio-2.0.5-alt2.src.rpm: build start
2025-Mar-31 10:18:24 :: [i586] #300 octave-audio-2.0.5-alt2.src.rpm: build OK (cached)
2025-Mar-31 10:18:24 :: [i586] #400 octave-dicom.git 0.5.1-alt1: build start
2025-Mar-31 10:18:25 :: [x86_64] #300 octave-audio-2.0.5-alt2.src.rpm: build OK (cached)
2025-Mar-31 10:18:26 :: [x86_64] #400 octave-dicom.git 0.5.1-alt1: build start
2025-Mar-31 10:18:38 :: [i586] #400 octave-dicom.git 0.5.1-alt1: build OK (cached)
2025-Mar-31 10:18:38 :: [i586] #500 octave-econometrics.git 1.1.2-alt1: build start
2025-Mar-31 10:18:41 :: [x86_64] #400 octave-dicom.git 0.5.1-alt1: build OK (cached)
2025-Mar-31 10:18:41 :: [x86_64] #500 octave-econometrics.git 1.1.2-alt1: build start
2025-Mar-31 10:18:52 :: [i586] #500 octave-econometrics.git 1.1.2-alt1: build OK (cached)
2025-Mar-31 10:18:52 :: [i586] #600 octave-fits-1.0.7-alt4.src.rpm: build start
2025-Mar-31 10:18:56 :: [x86_64] #500 octave-econometrics.git 1.1.2-alt1: build OK (cached)
2025-Mar-31 10:18:56 :: [x86_64] #600 octave-fits-1.0.7-alt4.src.rpm: build start
2025-Mar-31 10:19:01 :: [aarch64] #200 octave.git 10.1.0-alt1: build OK (cached)
2025-Mar-31 10:19:01 :: [aarch64] #300 octave-audio-2.0.5-alt2.src.rpm: build start
2025-Mar-31 10:19:05 :: [i586] #600 octave-fits-1.0.7-alt4.src.rpm: build OK (cached)
2025-Mar-31 10:19:06 :: [i586] #700 octave-general-2.1.3-alt2.src.rpm: build start
2025-Mar-31 10:19:10 :: [x86_64] #600 octave-fits-1.0.7-alt4.src.rpm: build OK (cached)
2025-Mar-31 10:19:10 :: [x86_64] #700 octave-general-2.1.3-alt2.src.rpm: build start
2025-Mar-31 10:19:20 :: [i586] #700 octave-general-2.1.3-alt2.src.rpm: build OK (cached)
2025-Mar-31 10:19:20 :: [i586] #1300 octave-instrument-control-0.9.1-alt1.src.rpm: build start
2025-Mar-31 10:19:25 :: [x86_64] #700 octave-general-2.1.3-alt2.src.rpm: build OK (cached)
2025-Mar-31 10:19:25 :: [x86_64] #1300 octave-instrument-control-0.9.1-alt1.src.rpm: build start
2025-Mar-31 10:19:35 :: [i586] #1300 octave-instrument-control-0.9.1-alt1.src.rpm: build OK (cached)
2025-Mar-31 10:19:36 :: [i586] #1400 octave-interval-3.2.1-alt2.src.rpm: build start
2025-Mar-31 10:19:41 :: [x86_64] #1300 octave-instrument-control-0.9.1-alt1.src.rpm: build OK (cached)
2025-Mar-31 10:19:41 :: [x86_64] #1400 octave-interval-3.2.1-alt2.src.rpm: build start
2025-Mar-31 10:19:49 :: [aarch64] #300 octave-audio-2.0.5-alt2.src.rpm: build OK (cached)
2025-Mar-31 10:19:49 :: [aarch64] #400 octave-dicom.git 0.5.1-alt1: build start
2025-Mar-31 10:20:22 :: [aarch64] #400 octave-dicom.git 0.5.1-alt1: build OK (cached)
2025-Mar-31 10:20:22 :: [aarch64] #500 octave-econometrics.git 1.1.2-alt1: build start
2025-Mar-31 10:20:50 :: [x86_64] #1400 octave-interval-3.2.1-alt2.src.rpm: build OK
2025-Mar-31 10:20:50 :: [x86_64] #1500 octave-io-2.6.4-alt1.src.rpm: build start
2025-Mar-31 10:20:50 :: [i586] #1400 octave-interval-3.2.1-alt2.src.rpm: build OK
2025-Mar-31 10:20:50 :: [i586] #1500 octave-io-2.6.4-alt1.src.rpm: build start
2025-Mar-31 10:20:51 :: [aarch64] #500 octave-econometrics.git 1.1.2-alt1: build OK (cached)
2025-Mar-31 10:20:51 :: [aarch64] #600 octave-fits-1.0.7-alt4.src.rpm: build start
2025-Mar-31 10:21:19 :: [aarch64] #600 octave-fits-1.0.7-alt4.src.rpm: build OK (cached)
2025-Mar-31 10:21:19 :: [aarch64] #700 octave-general-2.1.3-alt2.src.rpm: build start
2025-Mar-31 10:21:48 :: [aarch64] #700 octave-general-2.1.3-alt2.src.rpm: build OK (cached)
2025-Mar-31 10:21:48 :: [aarch64] #1300 octave-instrument-control-0.9.1-alt1.src.rpm: build start
2025-Mar-31 10:21:49 :: [x86_64] #1500 octave-io-2.6.4-alt1.src.rpm: build OK
2025-Mar-31 10:21:49 :: [x86_64] #1600 octave-lssa-0.1.4-alt1.src.rpm: build start
2025-Mar-31 10:21:55 :: [i586] #1500 octave-io-2.6.4-alt1.src.rpm: build OK
2025-Mar-31 10:21:55 :: [i586] #1600 octave-lssa-0.1.4-alt1.src.rpm: build start
2025-Mar-31 10:22:18 :: [aarch64] #1300 octave-instrument-control-0.9.1-alt1.src.rpm: build OK (cached)
2025-Mar-31 10:22:18 :: [aarch64] #1400 octave-interval-3.2.1-alt2.src.rpm: build start
2025-Mar-31 10:22:46 :: [x86_64] #1600 octave-lssa-0.1.4-alt1.src.rpm: build OK
2025-Mar-31 10:22:47 :: [x86_64] #2000 octave-mapping-1.4.2-alt1.src.rpm: build start
2025-Mar-31 10:22:56 :: [i586] #1600 octave-lssa-0.1.4-alt1.src.rpm: build OK
2025-Mar-31 10:22:56 :: [i586] #2000 octave-mapping-1.4.2-alt1.src.rpm: build start
2025-Mar-31 10:24:06 :: [aarch64] #1400 octave-interval-3.2.1-alt2.src.rpm: build OK
2025-Mar-31 10:24:07 :: [aarch64] #1500 octave-io-2.6.4-alt1.src.rpm: build start
2025-Mar-31 10:25:13 :: [x86_64] #2000 octave-mapping-1.4.2-alt1.src.rpm: build OK
2025-Mar-31 10:25:13 :: [x86_64] #2100 octave-miscellaneous-1.3.0-alt2.src.rpm: build start
2025-Mar-31 10:25:15 :: [i586] #2000 octave-mapping-1.4.2-alt1.src.rpm: build OK
2025-Mar-31 10:25:15 :: [i586] #2100 octave-miscellaneous-1.3.0-alt2.src.rpm: build start
2025-Mar-31 10:25:42 :: [aarch64] #1500 octave-io-2.6.4-alt1.src.rpm: build OK
2025-Mar-31 10:25:42 :: [aarch64] #1600 octave-lssa-0.1.4-alt1.src.rpm: build start
2025-Mar-31 10:26:58 :: [aarch64] #1600 octave-lssa-0.1.4-alt1.src.rpm: build OK
2025-Mar-31 10:26:59 :: [aarch64] #2000 octave-mapping-1.4.2-alt1.src.rpm: build start
2025-Mar-31 10:27:02 :: [x86_64] #2100 octave-miscellaneous-1.3.0-alt2.src.rpm: build OK
2025-Mar-31 10:27:02 :: [x86_64] #2200 octave-netcdf-1.0.17-alt2.src.rpm: build start
2025-Mar-31 10:27:12 :: [i586] #2100 octave-miscellaneous-1.3.0-alt2.src.rpm: build OK
2025-Mar-31 10:27:12 :: [i586] #2200 octave-netcdf-1.0.17-alt2.src.rpm: build start
2025-Mar-31 10:28:34 :: [x86_64] #2200 octave-netcdf-1.0.17-alt2.src.rpm: build OK
2025-Mar-31 10:28:35 :: [x86_64] #2300 octave-nurbs-1.4.3-alt1.src.rpm: build start
2025-Mar-31 10:28:48 :: [i586] #2200 octave-netcdf-1.0.17-alt2.src.rpm: build OK
2025-Mar-31 10:28:49 :: [i586] #2300 octave-nurbs-1.4.3-alt1.src.rpm: build start
[x86_64] low_level_functions.cc: In function 'int surfderivcpts(octave_idx_type, octave_idx_type, const RowVector&, octave_idx_type, octave_idx_type, const RowVector&, const Matrix&, octave_idx_type, octave_idx_type, octave_idx_type, octave_idx_type, octave_idx_type, NDArray&)':
[x86_64] low_level_functions.cc:292:15: error: 'assert' was not declared in this scope
[x86_64] 292 | assert (k<idxa(0) && i<idxa(2) && j-s1<idxa(3));
[x86_64] --
[x86_64] 23 |
[x86_64] low_level_functions.cc:320:19: error: 'assert' was not declared in this scope
[x86_64] 320 | assert (k<idxa(0) && l<idxa(1)
[x86_64] --
[x86_64] make: Leaving directory '/usr/src/RPM/BUILD/nurbs-1.4.3/nurbs-1.4.3/src'
[x86_64] error: pkg: error running 'make' for the nurbs package
[x86_64] error: called from
[x86_64] configure_make at line 117 column 9
2025-Mar-31 10:29:12 :: [x86_64] octave-nurbs-1.4.3-alt1.src.rpm: remote: build failed
2025-Mar-31 10:29:12 :: [x86_64] #2300 octave-nurbs-1.4.3-alt1.src.rpm: build FAILED
2025-Mar-31 10:29:12 :: [x86_64] requesting cancellation of task processing
2025-Mar-31 10:29:31 :: [aarch64] #2000 octave-mapping-1.4.2-alt1.src.rpm: build OK
2025-Mar-31 10:29:32 :: [aarch64] task processing CANCELLED
[i586] low_level_functions.cc: In function 'int surfderivcpts(octave_idx_type, octave_idx_type, const RowVector&, octave_idx_type, octave_idx_type, const RowVector&, const Matrix&, octave_idx_type, octave_idx_type, octave_idx_type, octave_idx_type, octave_idx_type, NDArray&)':
[i586] low_level_functions.cc:292:15: error: 'assert' was not declared in this scope
[i586] 292 | assert (k<idxa(0) && i<idxa(2) && j-s1<idxa(3));
[i586] --
[i586] 23 |
[i586] low_level_functions.cc:320:19: error: 'assert' was not declared in this scope
[i586] 320 | assert (k<idxa(0) && l<idxa(1)
[i586] --
[i586] make: Leaving directory '/usr/src/RPM/BUILD/nurbs-1.4.3/nurbs-1.4.3/src'
[i586] error: pkg: error running 'make' for the nurbs package
[i586] error: called from
[i586] configure_make at line 117 column 9
2025-Mar-31 10:29:38 :: [i586] octave-nurbs-1.4.3-alt1.src.rpm: remote: build failed
2025-Mar-31 10:29:38 :: [i586] #2300 octave-nurbs-1.4.3-alt1.src.rpm: build FAILED
2025-Mar-31 10:29:12 :: [x86_64] build FAILED
2025-Mar-31 10:29:32 :: [aarch64] build FAILED
2025-Mar-31 10:29:38 :: [i586] build FAILED
2025-Mar-31 10:29:39 :: task #379725 for sisyphus FAILED
^ permalink raw reply [flat|nested] 18+ messages in thread
* [#379725] [test-only] FAILED (try 9) octave.git=10.1.0-alt1 srpm=octave-audio-2.0.5-alt2.src.rpm ...
2025-03-30 19:09 [#379725] [test-only] FAILED octave.git=10.1.0-alt1 Girar awaiter (cas)
` (6 preceding siblings ...)
2025-03-31 10:29 ` [#379725] [test-only] FAILED (try 8) " Girar awaiter (cas)
@ 2025-03-31 11:51 ` Girar awaiter (cas)
2025-03-31 12:13 ` [#379725] [test-only] FAILED (try 10) " Girar awaiter (cas)
` (8 subsequent siblings)
16 siblings, 0 replies; 18+ messages in thread
From: Girar awaiter (cas) @ 2025-03-31 11:51 UTC (permalink / raw)
To: Andrey Cherepanov; +Cc: sisyphus-incominger, girar-builder-sisyphus
https://git.altlinux.org/tasks/379725/logs/events.9.1.log
https://packages.altlinux.org/tasks/379725
subtask name aarch64 i586 x86_64
#2100 octave-miscellaneous 1:39 1:04 1:00
#2200 octave-netcdf ? 57 55
#2400 octave-ocl ? failed failed
2025-Mar-31 11:43:54 :: test-only task #379725 for sisyphus resumed by cas:
2025-Mar-31 11:43:54 :: message: New_version_of_octave
#100 removed
#200 build 10.1.0-alt1 from /people/cas/packages/octave.git fetched at 2025-Mar-31 05:38:18
#300 build octave-audio-2.0.5-alt2.src.rpm from sisyphus
#400 build 0.5.1-alt1 from /gears/o/octave-dicom.git fetched at 2025-Mar-31 08:33:43 from sisyphus
#500 build 1.1.2-alt1 from /gears/o/octave-econometrics.git fetched at 2025-Mar-31 08:33:43 from sisyphus
#600 build octave-fits-1.0.7-alt4.src.rpm from sisyphus
#700 build octave-general-2.1.3-alt2.src.rpm from sisyphus
#740 removed
#1000 removed
#1100 removed
#1200 removed
#1300 build octave-instrument-control-0.9.1-alt1.src.rpm from sisyphus
#1400 build octave-interval-3.2.1-alt2.src.rpm from sisyphus
#1500 build octave-io-2.6.4-alt1.src.rpm from sisyphus
#1600 build octave-lssa-0.1.4-alt1.src.rpm from sisyphus
#1700 removed
#2000 build octave-mapping-1.4.2-alt1.src.rpm from sisyphus
#2100 build octave-miscellaneous-1.3.0-alt2.src.rpm from sisyphus
#2200 build octave-netcdf-1.0.17-alt2.src.rpm from sisyphus
#2300 removed
#2400 build octave-ocl-1.2.2-alt1.src.rpm from sisyphus
#2500 build octave-optim-1.6.2-alt1.src.rpm from sisyphus
#2600 build octave-optiminterp-0.3.7-alt1.src.rpm from sisyphus
#2700 build 2.4.0-alt5 from /gears/o/octave-quaternion.git fetched at 2025-Mar-31 08:34:01 from sisyphus
#3000 build octave-signal-1.4.5-alt1.src.rpm from sisyphus
#3100 build octave-struct-1.0.18-alt1.src.rpm from sisyphus
#3200 build 0.2.0-alt5 from /gears/o/octave-vibes.git fetched at 2025-Mar-31 08:34:04 from sisyphus
#3300 build octave-zeromq-1.5.5-alt1.src.rpm from sisyphus
#3400 build 4.1.1-alt1 from /gears/o/octave-control.git fetched at 2025-Mar-31 08:34:08 from sisyphus
#3500 build octave-communications-1.2.7-alt1.src.rpm from sisyphus
#3600 build octave-queueing-1.2.8-alt1.src.rpm from sisyphus
#3700 build octave-fuzzy-logic-toolkit-0.6.1-alt1.src.rpm from sisyphus
#4000 build octave-level-set-0.3.0-alt6.src.rpm from sisyphus
#4100 build octave-financial-0.5.3-alt2.src.rpm from sisyphus
2025-Mar-31 11:43:54 :: created build repo
2025-Mar-31 11:44:05 :: #2100: force rebuild
2025-Mar-31 11:44:05 :: #2200: force rebuild
2025-Mar-31 11:44:16 :: [aarch64] #200 octave.git 10.1.0-alt1: build start
2025-Mar-31 11:44:16 :: [i586] #200 octave.git 10.1.0-alt1: build start
2025-Mar-31 11:44:16 :: [x86_64] #200 octave.git 10.1.0-alt1: build start
2025-Mar-31 11:44:40 :: [i586] #200 octave.git 10.1.0-alt1: build OK (cached)
2025-Mar-31 11:44:42 :: [x86_64] #200 octave.git 10.1.0-alt1: build OK (cached)
2025-Mar-31 11:44:50 :: [i586] #300 octave-audio-2.0.5-alt2.src.rpm: build start
2025-Mar-31 11:44:52 :: [x86_64] #300 octave-audio-2.0.5-alt2.src.rpm: build start
2025-Mar-31 11:45:03 :: [aarch64] #200 octave.git 10.1.0-alt1: build OK (cached)
2025-Mar-31 11:45:03 :: [i586] #300 octave-audio-2.0.5-alt2.src.rpm: build OK (cached)
2025-Mar-31 11:45:06 :: [x86_64] #300 octave-audio-2.0.5-alt2.src.rpm: build OK (cached)
2025-Mar-31 11:45:13 :: [aarch64] #300 octave-audio-2.0.5-alt2.src.rpm: build start
2025-Mar-31 11:45:14 :: [i586] #400 octave-dicom.git 0.5.1-alt1: build start
2025-Mar-31 11:45:17 :: [x86_64] #400 octave-dicom.git 0.5.1-alt1: build start
2025-Mar-31 11:45:28 :: [i586] #400 octave-dicom.git 0.5.1-alt1: build OK (cached)
2025-Mar-31 11:45:32 :: [x86_64] #400 octave-dicom.git 0.5.1-alt1: build OK (cached)
2025-Mar-31 11:45:38 :: [i586] #500 octave-econometrics.git 1.1.2-alt1: build start
2025-Mar-31 11:45:38 :: [aarch64] #300 octave-audio-2.0.5-alt2.src.rpm: build OK (cached)
2025-Mar-31 11:45:42 :: [x86_64] #500 octave-econometrics.git 1.1.2-alt1: build start
2025-Mar-31 11:45:48 :: [aarch64] #400 octave-dicom.git 0.5.1-alt1: build start
2025-Mar-31 11:45:51 :: [i586] #500 octave-econometrics.git 1.1.2-alt1: build OK (cached)
2025-Mar-31 11:45:56 :: [x86_64] #500 octave-econometrics.git 1.1.2-alt1: build OK (cached)
2025-Mar-31 11:46:02 :: [i586] #600 octave-fits-1.0.7-alt4.src.rpm: build start
2025-Mar-31 11:46:06 :: [x86_64] #600 octave-fits-1.0.7-alt4.src.rpm: build start
2025-Mar-31 11:46:15 :: [aarch64] #400 octave-dicom.git 0.5.1-alt1: build OK (cached)
2025-Mar-31 11:46:15 :: [i586] #600 octave-fits-1.0.7-alt4.src.rpm: build OK (cached)
2025-Mar-31 11:46:20 :: [i586] #700 octave-general-2.1.3-alt2.src.rpm: build start
2025-Mar-31 11:46:20 :: [aarch64] #500 octave-econometrics.git 1.1.2-alt1: build start
2025-Mar-31 11:46:20 :: [x86_64] #600 octave-fits-1.0.7-alt4.src.rpm: build OK (cached)
2025-Mar-31 11:46:20 :: [x86_64] #700 octave-general-2.1.3-alt2.src.rpm: build start
2025-Mar-31 11:46:34 :: [i586] #700 octave-general-2.1.3-alt2.src.rpm: build OK (cached)
2025-Mar-31 11:46:34 :: [i586] #1300 octave-instrument-control-0.9.1-alt1.src.rpm: build start
2025-Mar-31 11:46:35 :: [x86_64] #700 octave-general-2.1.3-alt2.src.rpm: build OK (cached)
2025-Mar-31 11:46:35 :: [x86_64] #1300 octave-instrument-control-0.9.1-alt1.src.rpm: build start
2025-Mar-31 11:46:46 :: [aarch64] #500 octave-econometrics.git 1.1.2-alt1: build OK (cached)
2025-Mar-31 11:46:46 :: [aarch64] #600 octave-fits-1.0.7-alt4.src.rpm: build start
2025-Mar-31 11:46:49 :: [i586] #1300 octave-instrument-control-0.9.1-alt1.src.rpm: build OK (cached)
2025-Mar-31 11:46:49 :: [i586] #1400 octave-interval-3.2.1-alt2.src.rpm: build start
2025-Mar-31 11:46:51 :: [x86_64] #1300 octave-instrument-control-0.9.1-alt1.src.rpm: build OK (cached)
2025-Mar-31 11:46:51 :: [x86_64] #1400 octave-interval-3.2.1-alt2.src.rpm: build start
2025-Mar-31 11:47:03 :: [i586] #1400 octave-interval-3.2.1-alt2.src.rpm: build OK (cached)
2025-Mar-31 11:47:03 :: [i586] #1500 octave-io-2.6.4-alt1.src.rpm: build start
2025-Mar-31 11:47:05 :: [x86_64] #1400 octave-interval-3.2.1-alt2.src.rpm: build OK (cached)
2025-Mar-31 11:47:05 :: [x86_64] #1500 octave-io-2.6.4-alt1.src.rpm: build start
2025-Mar-31 11:47:11 :: [aarch64] #600 octave-fits-1.0.7-alt4.src.rpm: build OK (cached)
2025-Mar-31 11:47:11 :: [aarch64] #700 octave-general-2.1.3-alt2.src.rpm: build start
2025-Mar-31 11:47:16 :: [i586] #1500 octave-io-2.6.4-alt1.src.rpm: build OK (cached)
2025-Mar-31 11:47:16 :: [i586] #1600 octave-lssa-0.1.4-alt1.src.rpm: build start
2025-Mar-31 11:47:19 :: [x86_64] #1500 octave-io-2.6.4-alt1.src.rpm: build OK (cached)
2025-Mar-31 11:47:19 :: [x86_64] #1600 octave-lssa-0.1.4-alt1.src.rpm: build start
2025-Mar-31 11:47:30 :: [i586] #1600 octave-lssa-0.1.4-alt1.src.rpm: build OK (cached)
2025-Mar-31 11:47:30 :: [i586] #2000 octave-mapping-1.4.2-alt1.src.rpm: build start
2025-Mar-31 11:47:33 :: [x86_64] #1600 octave-lssa-0.1.4-alt1.src.rpm: build OK (cached)
2025-Mar-31 11:47:34 :: [x86_64] #2000 octave-mapping-1.4.2-alt1.src.rpm: build start
2025-Mar-31 11:47:37 :: [aarch64] #700 octave-general-2.1.3-alt2.src.rpm: build OK (cached)
2025-Mar-31 11:47:38 :: [aarch64] #1300 octave-instrument-control-0.9.1-alt1.src.rpm: build start
2025-Mar-31 11:47:43 :: [i586] #2000 octave-mapping-1.4.2-alt1.src.rpm: build OK (cached)
2025-Mar-31 11:47:44 :: [i586] #2100 octave-miscellaneous-1.3.0-alt2.src.rpm: build start
2025-Mar-31 11:47:48 :: [x86_64] #2000 octave-mapping-1.4.2-alt1.src.rpm: build OK (cached)
2025-Mar-31 11:47:48 :: [x86_64] #2100 octave-miscellaneous-1.3.0-alt2.src.rpm: build start
2025-Mar-31 11:48:06 :: [aarch64] #1300 octave-instrument-control-0.9.1-alt1.src.rpm: build OK (cached)
2025-Mar-31 11:48:06 :: [aarch64] #1400 octave-interval-3.2.1-alt2.src.rpm: build start
2025-Mar-31 11:48:31 :: [aarch64] #1400 octave-interval-3.2.1-alt2.src.rpm: build OK (cached)
2025-Mar-31 11:48:32 :: [aarch64] #1500 octave-io-2.6.4-alt1.src.rpm: build start
2025-Mar-31 11:48:48 :: [x86_64] #2100 octave-miscellaneous-1.3.0-alt2.src.rpm: build OK
2025-Mar-31 11:48:48 :: [x86_64] #2200 octave-netcdf-1.0.17-alt2.src.rpm: build start
2025-Mar-31 11:48:48 :: [i586] #2100 octave-miscellaneous-1.3.0-alt2.src.rpm: build OK
2025-Mar-31 11:48:49 :: [i586] #2200 octave-netcdf-1.0.17-alt2.src.rpm: build start
2025-Mar-31 11:48:57 :: [aarch64] #1500 octave-io-2.6.4-alt1.src.rpm: build OK (cached)
2025-Mar-31 11:48:57 :: [aarch64] #1600 octave-lssa-0.1.4-alt1.src.rpm: build start
2025-Mar-31 11:49:23 :: [aarch64] #1600 octave-lssa-0.1.4-alt1.src.rpm: build OK (cached)
2025-Mar-31 11:49:23 :: [aarch64] #2000 octave-mapping-1.4.2-alt1.src.rpm: build start
2025-Mar-31 11:49:43 :: [x86_64] #2200 octave-netcdf-1.0.17-alt2.src.rpm: build OK
2025-Mar-31 11:49:43 :: [x86_64] #2400 octave-ocl-1.2.2-alt1.src.rpm: build start
2025-Mar-31 11:49:46 :: [i586] #2200 octave-netcdf-1.0.17-alt2.src.rpm: build OK
2025-Mar-31 11:49:47 :: [i586] #2400 octave-ocl-1.2.2-alt1.src.rpm: build start
2025-Mar-31 11:49:48 :: [aarch64] #2000 octave-mapping-1.4.2-alt1.src.rpm: build OK (cached)
2025-Mar-31 11:49:49 :: [aarch64] #2100 octave-miscellaneous-1.3.0-alt2.src.rpm: build start
[x86_64] make: Leaving directory '/usr/src/RPM/BUILD/ocl-1.2.2/ocl-1.2.2/src'
[x86_64] error: pkg: error running 'make' for the ocl package
[x86_64] error: called from
[x86_64] configure_make at line 117 column 9
2025-Mar-31 11:50:24 :: [x86_64] octave-ocl-1.2.2-alt1.src.rpm: remote: build failed
2025-Mar-31 11:50:24 :: [x86_64] #2400 octave-ocl-1.2.2-alt1.src.rpm: build FAILED
2025-Mar-31 11:50:24 :: [x86_64] requesting cancellation of task processing
[i586] make: Leaving directory '/usr/src/RPM/BUILD/ocl-1.2.2/ocl-1.2.2/src'
[i586] error: pkg: error running 'make' for the ocl package
[i586] error: called from
[i586] configure_make at line 117 column 9
2025-Mar-31 11:50:30 :: [i586] octave-ocl-1.2.2-alt1.src.rpm: remote: build failed
2025-Mar-31 11:50:30 :: [i586] #2400 octave-ocl-1.2.2-alt1.src.rpm: build FAILED
2025-Mar-31 11:51:28 :: [aarch64] #2100 octave-miscellaneous-1.3.0-alt2.src.rpm: build OK
2025-Mar-31 11:51:28 :: [aarch64] task processing CANCELLED
2025-Mar-31 11:50:24 :: [x86_64] build FAILED
2025-Mar-31 11:50:30 :: [i586] build FAILED
2025-Mar-31 11:51:28 :: [aarch64] build FAILED
2025-Mar-31 11:51:28 :: task #379725 for sisyphus FAILED
^ permalink raw reply [flat|nested] 18+ messages in thread
* [#379725] [test-only] FAILED (try 10) octave.git=10.1.0-alt1 srpm=octave-audio-2.0.5-alt2.src.rpm ...
2025-03-30 19:09 [#379725] [test-only] FAILED octave.git=10.1.0-alt1 Girar awaiter (cas)
` (7 preceding siblings ...)
2025-03-31 11:51 ` [#379725] [test-only] FAILED (try 9) " Girar awaiter (cas)
@ 2025-03-31 12:13 ` Girar awaiter (cas)
2025-03-31 12:19 ` [#379725] [test-only] FAILED (try 11) " Girar awaiter (cas)
` (7 subsequent siblings)
16 siblings, 0 replies; 18+ messages in thread
From: Girar awaiter (cas) @ 2025-03-31 12:13 UTC (permalink / raw)
To: Andrey Cherepanov; +Cc: sisyphus-incominger, girar-builder-sisyphus
https://git.altlinux.org/tasks/379725/logs/events.10.1.log
https://packages.altlinux.org/tasks/379725
subtask name aarch64 i586 x86_64
#2200 octave-netcdf ? 59 54
#2500 octave-optim ? failed failed
2025-Mar-31 12:08:17 :: test-only task #379725 for sisyphus resumed by cas:
2025-Mar-31 12:08:17 :: message: New_version_of_octave
#100 removed
#200 build 10.1.0-alt1 from /people/cas/packages/octave.git fetched at 2025-Mar-31 05:38:18
#300 build octave-audio-2.0.5-alt2.src.rpm from sisyphus
#400 build 0.5.1-alt1 from /gears/o/octave-dicom.git fetched at 2025-Mar-31 08:33:43 from sisyphus
#500 build 1.1.2-alt1 from /gears/o/octave-econometrics.git fetched at 2025-Mar-31 08:33:43 from sisyphus
#600 build octave-fits-1.0.7-alt4.src.rpm from sisyphus
#700 build octave-general-2.1.3-alt2.src.rpm from sisyphus
#740 removed
#1000 removed
#1100 removed
#1200 removed
#1300 build octave-instrument-control-0.9.1-alt1.src.rpm from sisyphus
#1400 build octave-interval-3.2.1-alt2.src.rpm from sisyphus
#1500 build octave-io-2.6.4-alt1.src.rpm from sisyphus
#1600 build octave-lssa-0.1.4-alt1.src.rpm from sisyphus
#1700 removed
#2000 build octave-mapping-1.4.2-alt1.src.rpm from sisyphus
#2100 build octave-miscellaneous-1.3.0-alt2.src.rpm from sisyphus
#2200 build octave-netcdf-1.0.17-alt2.src.rpm from sisyphus
#2300 removed
#2400 removed
#2500 build octave-optim-1.6.2-alt1.src.rpm from sisyphus
#2600 build octave-optiminterp-0.3.7-alt1.src.rpm from sisyphus
#2700 build 2.4.0-alt5 from /gears/o/octave-quaternion.git fetched at 2025-Mar-31 08:34:01 from sisyphus
#3000 build octave-signal-1.4.5-alt1.src.rpm from sisyphus
#3100 build octave-struct-1.0.18-alt1.src.rpm from sisyphus
#3200 build 0.2.0-alt5 from /gears/o/octave-vibes.git fetched at 2025-Mar-31 08:34:04 from sisyphus
#3300 build octave-zeromq-1.5.5-alt1.src.rpm from sisyphus
#3400 build 4.1.1-alt1 from /gears/o/octave-control.git fetched at 2025-Mar-31 08:34:08 from sisyphus
#3500 build octave-communications-1.2.7-alt1.src.rpm from sisyphus
#3600 build octave-queueing-1.2.8-alt1.src.rpm from sisyphus
#3700 build octave-fuzzy-logic-toolkit-0.6.1-alt1.src.rpm from sisyphus
#4000 build octave-level-set-0.3.0-alt6.src.rpm from sisyphus
#4100 build octave-financial-0.5.3-alt2.src.rpm from sisyphus
2025-Mar-31 12:08:18 :: created build repo
2025-Mar-31 12:08:19 :: #2200: force rebuild
2025-Mar-31 12:08:19 :: [i586] #200 octave.git 10.1.0-alt1: build start
2025-Mar-31 12:08:19 :: [x86_64] #200 octave.git 10.1.0-alt1: build start
2025-Mar-31 12:08:19 :: [aarch64] #200 octave.git 10.1.0-alt1: build start
2025-Mar-31 12:08:47 :: [i586] #200 octave.git 10.1.0-alt1: build OK (cached)
2025-Mar-31 12:08:47 :: [i586] #300 octave-audio-2.0.5-alt2.src.rpm: build start
2025-Mar-31 12:08:49 :: [x86_64] #200 octave.git 10.1.0-alt1: build OK (cached)
2025-Mar-31 12:08:50 :: [x86_64] #300 octave-audio-2.0.5-alt2.src.rpm: build start
2025-Mar-31 12:09:01 :: [i586] #300 octave-audio-2.0.5-alt2.src.rpm: build OK (cached)
2025-Mar-31 12:09:01 :: [i586] #400 octave-dicom.git 0.5.1-alt1: build start
2025-Mar-31 12:09:04 :: [x86_64] #300 octave-audio-2.0.5-alt2.src.rpm: build OK (cached)
2025-Mar-31 12:09:04 :: [x86_64] #400 octave-dicom.git 0.5.1-alt1: build start
2025-Mar-31 12:09:08 :: [aarch64] #200 octave.git 10.1.0-alt1: build OK (cached)
2025-Mar-31 12:09:08 :: [aarch64] #300 octave-audio-2.0.5-alt2.src.rpm: build start
2025-Mar-31 12:09:15 :: [i586] #400 octave-dicom.git 0.5.1-alt1: build OK (cached)
2025-Mar-31 12:09:15 :: [i586] #500 octave-econometrics.git 1.1.2-alt1: build start
2025-Mar-31 12:09:19 :: [x86_64] #400 octave-dicom.git 0.5.1-alt1: build OK (cached)
2025-Mar-31 12:09:19 :: [x86_64] #500 octave-econometrics.git 1.1.2-alt1: build start
2025-Mar-31 12:09:29 :: [i586] #500 octave-econometrics.git 1.1.2-alt1: build OK (cached)
2025-Mar-31 12:09:29 :: [i586] #600 octave-fits-1.0.7-alt4.src.rpm: build start
2025-Mar-31 12:09:33 :: [x86_64] #500 octave-econometrics.git 1.1.2-alt1: build OK (cached)
2025-Mar-31 12:09:33 :: [x86_64] #600 octave-fits-1.0.7-alt4.src.rpm: build start
2025-Mar-31 12:09:34 :: [aarch64] #300 octave-audio-2.0.5-alt2.src.rpm: build OK (cached)
2025-Mar-31 12:09:34 :: [aarch64] #400 octave-dicom.git 0.5.1-alt1: build start
2025-Mar-31 12:09:42 :: [i586] #600 octave-fits-1.0.7-alt4.src.rpm: build OK (cached)
2025-Mar-31 12:09:43 :: [i586] #700 octave-general-2.1.3-alt2.src.rpm: build start
2025-Mar-31 12:09:47 :: [x86_64] #600 octave-fits-1.0.7-alt4.src.rpm: build OK (cached)
2025-Mar-31 12:09:48 :: [x86_64] #700 octave-general-2.1.3-alt2.src.rpm: build start
2025-Mar-31 12:09:57 :: [i586] #700 octave-general-2.1.3-alt2.src.rpm: build OK (cached)
2025-Mar-31 12:09:57 :: [i586] #1300 octave-instrument-control-0.9.1-alt1.src.rpm: build start
2025-Mar-31 12:10:02 :: [aarch64] #400 octave-dicom.git 0.5.1-alt1: build OK (cached)
2025-Mar-31 12:10:02 :: [x86_64] #700 octave-general-2.1.3-alt2.src.rpm: build OK (cached)
2025-Mar-31 12:10:02 :: [x86_64] #1300 octave-instrument-control-0.9.1-alt1.src.rpm: build start
2025-Mar-31 12:10:02 :: [aarch64] #500 octave-econometrics.git 1.1.2-alt1: build start
2025-Mar-31 12:10:12 :: [i586] #1300 octave-instrument-control-0.9.1-alt1.src.rpm: build OK (cached)
2025-Mar-31 12:10:12 :: [i586] #1400 octave-interval-3.2.1-alt2.src.rpm: build start
2025-Mar-31 12:10:18 :: [x86_64] #1300 octave-instrument-control-0.9.1-alt1.src.rpm: build OK (cached)
2025-Mar-31 12:10:18 :: [x86_64] #1400 octave-interval-3.2.1-alt2.src.rpm: build start
2025-Mar-31 12:10:26 :: [i586] #1400 octave-interval-3.2.1-alt2.src.rpm: build OK (cached)
2025-Mar-31 12:10:26 :: [i586] #1500 octave-io-2.6.4-alt1.src.rpm: build start
2025-Mar-31 12:10:28 :: [aarch64] #500 octave-econometrics.git 1.1.2-alt1: build OK (cached)
2025-Mar-31 12:10:29 :: [aarch64] #600 octave-fits-1.0.7-alt4.src.rpm: build start
2025-Mar-31 12:10:32 :: [x86_64] #1400 octave-interval-3.2.1-alt2.src.rpm: build OK (cached)
2025-Mar-31 12:10:33 :: [x86_64] #1500 octave-io-2.6.4-alt1.src.rpm: build start
2025-Mar-31 12:10:39 :: [i586] #1500 octave-io-2.6.4-alt1.src.rpm: build OK (cached)
2025-Mar-31 12:10:40 :: [i586] #1600 octave-lssa-0.1.4-alt1.src.rpm: build start
2025-Mar-31 12:10:47 :: [x86_64] #1500 octave-io-2.6.4-alt1.src.rpm: build OK (cached)
2025-Mar-31 12:10:47 :: [x86_64] #1600 octave-lssa-0.1.4-alt1.src.rpm: build start
2025-Mar-31 12:10:53 :: [i586] #1600 octave-lssa-0.1.4-alt1.src.rpm: build OK (cached)
2025-Mar-31 12:10:53 :: [i586] #2000 octave-mapping-1.4.2-alt1.src.rpm: build start
2025-Mar-31 12:10:54 :: [aarch64] #600 octave-fits-1.0.7-alt4.src.rpm: build OK (cached)
2025-Mar-31 12:10:55 :: [aarch64] #700 octave-general-2.1.3-alt2.src.rpm: build start
2025-Mar-31 12:11:01 :: [x86_64] #1600 octave-lssa-0.1.4-alt1.src.rpm: build OK (cached)
2025-Mar-31 12:11:01 :: [x86_64] #2000 octave-mapping-1.4.2-alt1.src.rpm: build start
2025-Mar-31 12:11:07 :: [i586] #2000 octave-mapping-1.4.2-alt1.src.rpm: build OK (cached)
2025-Mar-31 12:11:07 :: [i586] #2100 octave-miscellaneous-1.3.0-alt2.src.rpm: build start
2025-Mar-31 12:11:16 :: [x86_64] #2000 octave-mapping-1.4.2-alt1.src.rpm: build OK (cached)
2025-Mar-31 12:11:16 :: [x86_64] #2100 octave-miscellaneous-1.3.0-alt2.src.rpm: build start
2025-Mar-31 12:11:21 :: [i586] #2100 octave-miscellaneous-1.3.0-alt2.src.rpm: build OK (cached)
2025-Mar-31 12:11:21 :: [i586] #2200 octave-netcdf-1.0.17-alt2.src.rpm: build start
2025-Mar-31 12:11:22 :: [aarch64] #700 octave-general-2.1.3-alt2.src.rpm: build OK (cached)
2025-Mar-31 12:11:23 :: [aarch64] #1300 octave-instrument-control-0.9.1-alt1.src.rpm: build start
2025-Mar-31 12:11:30 :: [x86_64] #2100 octave-miscellaneous-1.3.0-alt2.src.rpm: build OK (cached)
2025-Mar-31 12:11:31 :: [x86_64] #2200 octave-netcdf-1.0.17-alt2.src.rpm: build start
2025-Mar-31 12:11:52 :: [aarch64] #1300 octave-instrument-control-0.9.1-alt1.src.rpm: build OK (cached)
2025-Mar-31 12:11:53 :: [aarch64] #1400 octave-interval-3.2.1-alt2.src.rpm: build start
2025-Mar-31 12:12:19 :: [aarch64] #1400 octave-interval-3.2.1-alt2.src.rpm: build OK (cached)
2025-Mar-31 12:12:20 :: [i586] #2200 octave-netcdf-1.0.17-alt2.src.rpm: build OK
2025-Mar-31 12:12:20 :: [aarch64] #1500 octave-io-2.6.4-alt1.src.rpm: build start
2025-Mar-31 12:12:20 :: [i586] #2500 octave-optim-1.6.2-alt1.src.rpm: build start
2025-Mar-31 12:12:25 :: [x86_64] #2200 octave-netcdf-1.0.17-alt2.src.rpm: build OK
2025-Mar-31 12:12:26 :: [x86_64] #2500 octave-optim-1.6.2-alt1.src.rpm: build start
2025-Mar-31 12:12:47 :: [aarch64] #1500 octave-io-2.6.4-alt1.src.rpm: build OK (cached)
2025-Mar-31 12:12:47 :: [aarch64] #1600 octave-lssa-0.1.4-alt1.src.rpm: build start
2025-Mar-31 12:13:13 :: [aarch64] #1600 octave-lssa-0.1.4-alt1.src.rpm: build OK (cached)
2025-Mar-31 12:13:14 :: [aarch64] #2000 octave-mapping-1.4.2-alt1.src.rpm: build start
[i586] __max_nargin_optim__.cc: In function 'octave_value_list F__max_nargin_optim__(const octave_value_list&, int)':
[i586] __max_nargin_optim__.cc:77:55: error: 'class octave::tree_parameter_list' has no member named 'length'
[i586] 77 | (fcn.user_function_value ()->parameter_list ()->length ());
[i586] --
[i586] make: Leaving directory '/usr/src/RPM/BUILD/optim-1.6.2/optim-1.6.2/src'
[i586] error: pkg: error running 'make' for the optim package
[i586] error: called from
[i586] configure_make at line 117 column 9
2025-Mar-31 12:13:26 :: [i586] octave-optim-1.6.2-alt1.src.rpm: remote: build failed
2025-Mar-31 12:13:26 :: [i586] #2500 octave-optim-1.6.2-alt1.src.rpm: build FAILED
2025-Mar-31 12:13:26 :: [i586] requesting cancellation of task processing
[x86_64] __max_nargin_optim__.cc: In function 'octave_value_list F__max_nargin_optim__(const octave_value_list&, int)':
[x86_64] __max_nargin_optim__.cc:77:55: error: 'class octave::tree_parameter_list' has no member named 'length'
[x86_64] 77 | (fcn.user_function_value ()->parameter_list ()->length ());
[x86_64] --
[x86_64] make: Leaving directory '/usr/src/RPM/BUILD/optim-1.6.2/optim-1.6.2/src'
[x86_64] error: pkg: error running 'make' for the optim package
[x86_64] error: called from
[x86_64] configure_make at line 117 column 9
2025-Mar-31 12:13:26 :: [x86_64] octave-optim-1.6.2-alt1.src.rpm: remote: build failed
2025-Mar-31 12:13:26 :: [x86_64] #2500 octave-optim-1.6.2-alt1.src.rpm: build FAILED
2025-Mar-31 12:13:40 :: [aarch64] #2000 octave-mapping-1.4.2-alt1.src.rpm: build OK (cached)
2025-Mar-31 12:13:40 :: [aarch64] task processing CANCELLED
2025-Mar-31 12:13:26 :: [i586] build FAILED
2025-Mar-31 12:13:26 :: [x86_64] build FAILED
2025-Mar-31 12:13:40 :: [aarch64] build FAILED
2025-Mar-31 12:13:41 :: task #379725 for sisyphus FAILED
^ permalink raw reply [flat|nested] 18+ messages in thread
* [#379725] [test-only] FAILED (try 11) octave.git=10.1.0-alt1 srpm=octave-audio-2.0.5-alt2.src.rpm ...
2025-03-30 19:09 [#379725] [test-only] FAILED octave.git=10.1.0-alt1 Girar awaiter (cas)
` (8 preceding siblings ...)
2025-03-31 12:13 ` [#379725] [test-only] FAILED (try 10) " Girar awaiter (cas)
@ 2025-03-31 12:19 ` Girar awaiter (cas)
2025-03-31 12:50 ` [#379725] [test-only] FAILED (try 12) " Girar awaiter (cas)
` (6 subsequent siblings)
16 siblings, 0 replies; 18+ messages in thread
From: Girar awaiter (cas) @ 2025-03-31 12:19 UTC (permalink / raw)
To: Andrey Cherepanov; +Cc: sisyphus-incominger, girar-builder-sisyphus
https://git.altlinux.org/tasks/379725/logs/events.11.1.log
https://packages.altlinux.org/tasks/379725
subtask name aarch64 i586 x86_64
#2100 octave-miscellaneous 1:52 1:11 1:08
#2200 octave-netcdf 1:26 58 54
#2600 octave-optiminterp 1:24 55 53
#2700 octave-quaternion ? 50 47
#3000 octave-signal ? failed failed
2025-Mar-31 12:14:18 :: test-only swift task #379725 for sisyphus resumed by cas:
2025-Mar-31 12:14:18 :: message: New_version_of_octave
#100 removed
#200 build 10.1.0-alt1 from /people/cas/packages/octave.git fetched at 2025-Mar-31 05:38:18
#300 build octave-audio-2.0.5-alt2.src.rpm from sisyphus
#400 build 0.5.1-alt1 from /gears/o/octave-dicom.git fetched at 2025-Mar-31 08:33:43 from sisyphus
#500 build 1.1.2-alt1 from /gears/o/octave-econometrics.git fetched at 2025-Mar-31 08:33:43 from sisyphus
#600 build octave-fits-1.0.7-alt4.src.rpm from sisyphus
#700 build octave-general-2.1.3-alt2.src.rpm from sisyphus
#740 removed
#1000 removed
#1100 removed
#1200 removed
#1300 build octave-instrument-control-0.9.1-alt1.src.rpm from sisyphus
#1400 build octave-interval-3.2.1-alt2.src.rpm from sisyphus
#1500 build octave-io-2.6.4-alt1.src.rpm from sisyphus
#1600 build octave-lssa-0.1.4-alt1.src.rpm from sisyphus
#1700 removed
#2000 build octave-mapping-1.4.2-alt1.src.rpm from sisyphus
#2100 build octave-miscellaneous-1.3.0-alt2.src.rpm from sisyphus
#2200 build octave-netcdf-1.0.17-alt2.src.rpm from sisyphus
#2300 removed
#2400 removed
#2500 removed
#2600 build octave-optiminterp-0.3.7-alt1.src.rpm from sisyphus
#2700 build 2.4.0-alt5 from /gears/o/octave-quaternion.git fetched at 2025-Mar-31 08:34:01 from sisyphus
#3000 build octave-signal-1.4.5-alt1.src.rpm from sisyphus
#3100 build octave-struct-1.0.18-alt1.src.rpm from sisyphus
#3200 build 0.2.0-alt5 from /gears/o/octave-vibes.git fetched at 2025-Mar-31 08:34:04 from sisyphus
#3300 build octave-zeromq-1.5.5-alt1.src.rpm from sisyphus
#3400 build 4.1.1-alt1 from /gears/o/octave-control.git fetched at 2025-Mar-31 08:34:08 from sisyphus
#3500 build octave-communications-1.2.7-alt1.src.rpm from sisyphus
#3600 build octave-queueing-1.2.8-alt1.src.rpm from sisyphus
#3700 build octave-fuzzy-logic-toolkit-0.6.1-alt1.src.rpm from sisyphus
#4000 build octave-level-set-0.3.0-alt6.src.rpm from sisyphus
#4100 build octave-financial-0.5.3-alt2.src.rpm from sisyphus
2025-Mar-31 12:14:18 :: created build repo
2025-Mar-31 12:14:19 :: #2100: force rebuild
2025-Mar-31 12:14:19 :: #2200: force rebuild
2025-Mar-31 12:14:19 :: [aarch64] #200 octave.git 10.1.0-alt1: build start
2025-Mar-31 12:14:19 :: [x86_64] #200 octave.git 10.1.0-alt1: build start
2025-Mar-31 12:14:19 :: [i586] #200 octave.git 10.1.0-alt1: build start
2025-Mar-31 12:14:21 :: [i586] #200 octave.git 10.1.0-alt1: build swiftly SKIPPED
2025-Mar-31 12:14:21 :: [x86_64] #200 octave.git 10.1.0-alt1: build swiftly SKIPPED
2025-Mar-31 12:14:21 :: [i586] #300 octave-audio-2.0.5-alt2.src.rpm: build start
2025-Mar-31 12:14:21 :: [x86_64] #300 octave-audio-2.0.5-alt2.src.rpm: build start
2025-Mar-31 12:14:21 :: [aarch64] #200 octave.git 10.1.0-alt1: build swiftly SKIPPED
2025-Mar-31 12:14:21 :: [i586] #300 octave-audio-2.0.5-alt2.src.rpm: build swiftly SKIPPED
2025-Mar-31 12:14:21 :: [x86_64] #300 octave-audio-2.0.5-alt2.src.rpm: build swiftly SKIPPED
2025-Mar-31 12:14:21 :: [aarch64] #300 octave-audio-2.0.5-alt2.src.rpm: build start
2025-Mar-31 12:14:21 :: [i586] #400 octave-dicom.git 0.5.1-alt1: build start
2025-Mar-31 12:14:21 :: [x86_64] #400 octave-dicom.git 0.5.1-alt1: build start
2025-Mar-31 12:14:22 :: [aarch64] #300 octave-audio-2.0.5-alt2.src.rpm: build swiftly SKIPPED
2025-Mar-31 12:14:22 :: [i586] #400 octave-dicom.git 0.5.1-alt1: build swiftly SKIPPED
2025-Mar-31 12:14:22 :: [x86_64] #400 octave-dicom.git 0.5.1-alt1: build swiftly SKIPPED
2025-Mar-31 12:14:22 :: [aarch64] #400 octave-dicom.git 0.5.1-alt1: build start
2025-Mar-31 12:14:22 :: [i586] #500 octave-econometrics.git 1.1.2-alt1: build start
2025-Mar-31 12:14:22 :: [x86_64] #500 octave-econometrics.git 1.1.2-alt1: build start
2025-Mar-31 12:14:22 :: [i586] #500 octave-econometrics.git 1.1.2-alt1: build swiftly SKIPPED
2025-Mar-31 12:14:22 :: [aarch64] #400 octave-dicom.git 0.5.1-alt1: build swiftly SKIPPED
2025-Mar-31 12:14:22 :: [x86_64] #500 octave-econometrics.git 1.1.2-alt1: build swiftly SKIPPED
2025-Mar-31 12:14:22 :: [i586] #600 octave-fits-1.0.7-alt4.src.rpm: build start
2025-Mar-31 12:14:23 :: [aarch64] #500 octave-econometrics.git 1.1.2-alt1: build start
2025-Mar-31 12:14:23 :: [x86_64] #600 octave-fits-1.0.7-alt4.src.rpm: build start
2025-Mar-31 12:14:23 :: [i586] #600 octave-fits-1.0.7-alt4.src.rpm: build swiftly SKIPPED
2025-Mar-31 12:14:23 :: [aarch64] #500 octave-econometrics.git 1.1.2-alt1: build swiftly SKIPPED
2025-Mar-31 12:14:23 :: [x86_64] #600 octave-fits-1.0.7-alt4.src.rpm: build swiftly SKIPPED
2025-Mar-31 12:14:23 :: [i586] #700 octave-general-2.1.3-alt2.src.rpm: build start
2025-Mar-31 12:14:23 :: [i586] #700 octave-general-2.1.3-alt2.src.rpm: build swiftly SKIPPED
2025-Mar-31 12:14:23 :: [aarch64] #600 octave-fits-1.0.7-alt4.src.rpm: build start
2025-Mar-31 12:14:23 :: [x86_64] #700 octave-general-2.1.3-alt2.src.rpm: build start
2025-Mar-31 12:14:23 :: [aarch64] #600 octave-fits-1.0.7-alt4.src.rpm: build swiftly SKIPPED
2025-Mar-31 12:14:23 :: [x86_64] #700 octave-general-2.1.3-alt2.src.rpm: build swiftly SKIPPED
2025-Mar-31 12:14:23 :: [i586] #1300 octave-instrument-control-0.9.1-alt1.src.rpm: build start
2025-Mar-31 12:14:24 :: [aarch64] #700 octave-general-2.1.3-alt2.src.rpm: build start
2025-Mar-31 12:14:24 :: [x86_64] #1300 octave-instrument-control-0.9.1-alt1.src.rpm: build start
2025-Mar-31 12:14:24 :: [i586] #1300 octave-instrument-control-0.9.1-alt1.src.rpm: build swiftly SKIPPED
2025-Mar-31 12:14:24 :: [aarch64] #700 octave-general-2.1.3-alt2.src.rpm: build swiftly SKIPPED
2025-Mar-31 12:14:24 :: [x86_64] #1300 octave-instrument-control-0.9.1-alt1.src.rpm: build swiftly SKIPPED
2025-Mar-31 12:14:24 :: [i586] #1400 octave-interval-3.2.1-alt2.src.rpm: build start
2025-Mar-31 12:14:24 :: [aarch64] #1300 octave-instrument-control-0.9.1-alt1.src.rpm: build start
2025-Mar-31 12:14:24 :: [i586] #1400 octave-interval-3.2.1-alt2.src.rpm: build swiftly SKIPPED
2025-Mar-31 12:14:24 :: [x86_64] #1400 octave-interval-3.2.1-alt2.src.rpm: build start
2025-Mar-31 12:14:24 :: [x86_64] #1400 octave-interval-3.2.1-alt2.src.rpm: build swiftly SKIPPED
2025-Mar-31 12:14:25 :: [aarch64] #1300 octave-instrument-control-0.9.1-alt1.src.rpm: build swiftly SKIPPED
2025-Mar-31 12:14:25 :: [i586] #1500 octave-io-2.6.4-alt1.src.rpm: build start
2025-Mar-31 12:14:25 :: [i586] #1500 octave-io-2.6.4-alt1.src.rpm: build swiftly SKIPPED
2025-Mar-31 12:14:25 :: [x86_64] #1500 octave-io-2.6.4-alt1.src.rpm: build start
2025-Mar-31 12:14:25 :: [aarch64] #1400 octave-interval-3.2.1-alt2.src.rpm: build start
2025-Mar-31 12:14:25 :: [x86_64] #1500 octave-io-2.6.4-alt1.src.rpm: build swiftly SKIPPED
2025-Mar-31 12:14:25 :: [i586] #1600 octave-lssa-0.1.4-alt1.src.rpm: build start
2025-Mar-31 12:14:25 :: [aarch64] #1400 octave-interval-3.2.1-alt2.src.rpm: build swiftly SKIPPED
2025-Mar-31 12:14:25 :: [i586] #1600 octave-lssa-0.1.4-alt1.src.rpm: build swiftly SKIPPED
2025-Mar-31 12:14:25 :: [x86_64] #1600 octave-lssa-0.1.4-alt1.src.rpm: build start
2025-Mar-31 12:14:25 :: [x86_64] #1600 octave-lssa-0.1.4-alt1.src.rpm: build swiftly SKIPPED
2025-Mar-31 12:14:26 :: [aarch64] #1500 octave-io-2.6.4-alt1.src.rpm: build start
2025-Mar-31 12:14:26 :: [i586] #2000 octave-mapping-1.4.2-alt1.src.rpm: build start
2025-Mar-31 12:14:26 :: [aarch64] #1500 octave-io-2.6.4-alt1.src.rpm: build swiftly SKIPPED
2025-Mar-31 12:14:26 :: [i586] #2000 octave-mapping-1.4.2-alt1.src.rpm: build swiftly SKIPPED
2025-Mar-31 12:14:26 :: [x86_64] #2000 octave-mapping-1.4.2-alt1.src.rpm: build start
2025-Mar-31 12:14:26 :: [x86_64] #2000 octave-mapping-1.4.2-alt1.src.rpm: build swiftly SKIPPED
2025-Mar-31 12:14:26 :: [aarch64] #1600 octave-lssa-0.1.4-alt1.src.rpm: build start
2025-Mar-31 12:14:26 :: [i586] #2100 octave-miscellaneous-1.3.0-alt2.src.rpm: build start
2025-Mar-31 12:14:26 :: [aarch64] #1600 octave-lssa-0.1.4-alt1.src.rpm: build swiftly SKIPPED
2025-Mar-31 12:14:26 :: [x86_64] #2100 octave-miscellaneous-1.3.0-alt2.src.rpm: build start
2025-Mar-31 12:14:27 :: [aarch64] #2000 octave-mapping-1.4.2-alt1.src.rpm: build start
2025-Mar-31 12:14:27 :: [aarch64] #2000 octave-mapping-1.4.2-alt1.src.rpm: build swiftly SKIPPED
2025-Mar-31 12:14:27 :: [aarch64] #2100 octave-miscellaneous-1.3.0-alt2.src.rpm: build start
2025-Mar-31 12:15:34 :: [x86_64] #2100 octave-miscellaneous-1.3.0-alt2.src.rpm: build OK
2025-Mar-31 12:15:35 :: [x86_64] #2200 octave-netcdf-1.0.17-alt2.src.rpm: build start
2025-Mar-31 12:15:37 :: [i586] #2100 octave-miscellaneous-1.3.0-alt2.src.rpm: build OK
2025-Mar-31 12:15:37 :: [i586] #2200 octave-netcdf-1.0.17-alt2.src.rpm: build start
2025-Mar-31 12:16:19 :: [aarch64] #2100 octave-miscellaneous-1.3.0-alt2.src.rpm: build OK
2025-Mar-31 12:16:19 :: [aarch64] #2200 octave-netcdf-1.0.17-alt2.src.rpm: build start
2025-Mar-31 12:16:29 :: [x86_64] #2200 octave-netcdf-1.0.17-alt2.src.rpm: build OK
2025-Mar-31 12:16:29 :: [x86_64] #2600 octave-optiminterp-0.3.7-alt1.src.rpm: build start
2025-Mar-31 12:16:35 :: [i586] #2200 octave-netcdf-1.0.17-alt2.src.rpm: build OK
2025-Mar-31 12:16:35 :: [i586] #2600 octave-optiminterp-0.3.7-alt1.src.rpm: build start
2025-Mar-31 12:17:22 :: [x86_64] #2600 octave-optiminterp-0.3.7-alt1.src.rpm: build OK
2025-Mar-31 12:17:22 :: [x86_64] #2700 octave-quaternion.git 2.4.0-alt5: build start
2025-Mar-31 12:17:30 :: [i586] #2600 octave-optiminterp-0.3.7-alt1.src.rpm: build OK
2025-Mar-31 12:17:30 :: [i586] #2700 octave-quaternion.git 2.4.0-alt5: build start
2025-Mar-31 12:17:45 :: [aarch64] #2200 octave-netcdf-1.0.17-alt2.src.rpm: build OK
2025-Mar-31 12:17:46 :: [aarch64] #2600 octave-optiminterp-0.3.7-alt1.src.rpm: build start
2025-Mar-31 12:18:09 :: [x86_64] #2700 octave-quaternion.git 2.4.0-alt5: build OK
2025-Mar-31 12:18:09 :: [x86_64] #3000 octave-signal-1.4.5-alt1.src.rpm: build start
2025-Mar-31 12:18:20 :: [i586] #2700 octave-quaternion.git 2.4.0-alt5: build OK
2025-Mar-31 12:18:20 :: [i586] #3000 octave-signal-1.4.5-alt1.src.rpm: build start
[x86_64] remez.cc: In function 'int Search(int, int*, int, double*)':
[x86_64] remez.cc:389:3: error: 'assert' was not declared in this scope
[x86_64] 389 | assert(extra >= 0);
[x86_64] --
[x86_64] remez.cc: In function 'int remez(double*, int, int, const double*, const double*, const double*, int, int)':
[x86_64] remez.cc:704:29: error: 'assert' was not declared in this scope
[x86_64] 704 | for(i=0; i <= r; i++) assert(Ext[i]<gridsize);
[x86_64] --
[x86_64] make: Leaving directory '/usr/src/RPM/BUILD/signal-1.4.5/signal-1.4.5/src'
[x86_64] error: pkg: error running 'make' for the signal package
[x86_64] error: called from
[x86_64] configure_make at line 117 column 9
2025-Mar-31 12:18:48 :: [x86_64] octave-signal-1.4.5-alt1.src.rpm: remote: build failed
2025-Mar-31 12:18:48 :: [x86_64] #3000 octave-signal-1.4.5-alt1.src.rpm: build FAILED
2025-Mar-31 12:18:48 :: [x86_64] requesting cancellation of task processing
[i586] remez.cc: In function 'int Search(int, int*, int, double*)':
[i586] remez.cc:389:3: error: 'assert' was not declared in this scope
[i586] 389 | assert(extra >= 0);
[i586] --
[i586] remez.cc: In function 'int remez(double*, int, int, const double*, const double*, const double*, int, int)':
[i586] remez.cc:704:29: error: 'assert' was not declared in this scope
[i586] 704 | for(i=0; i <= r; i++) assert(Ext[i]<gridsize);
[i586] --
[i586] make: Leaving directory '/usr/src/RPM/BUILD/signal-1.4.5/signal-1.4.5/src'
[i586] error: pkg: error running 'make' for the signal package
[i586] error: called from
[i586] configure_make at line 117 column 9
2025-Mar-31 12:19:00 :: [i586] octave-signal-1.4.5-alt1.src.rpm: remote: build failed
2025-Mar-31 12:19:00 :: [i586] #3000 octave-signal-1.4.5-alt1.src.rpm: build FAILED
2025-Mar-31 12:19:10 :: [aarch64] #2600 octave-optiminterp-0.3.7-alt1.src.rpm: build OK
2025-Mar-31 12:19:11 :: [aarch64] task processing CANCELLED
2025-Mar-31 12:18:48 :: [x86_64] build FAILED
2025-Mar-31 12:19:00 :: [i586] build FAILED
2025-Mar-31 12:19:11 :: [aarch64] build FAILED
2025-Mar-31 12:19:11 :: task #379725 for sisyphus FAILED
^ permalink raw reply [flat|nested] 18+ messages in thread
* [#379725] [test-only] FAILED (try 12) octave.git=10.1.0-alt1 srpm=octave-audio-2.0.5-alt2.src.rpm ...
2025-03-30 19:09 [#379725] [test-only] FAILED octave.git=10.1.0-alt1 Girar awaiter (cas)
` (9 preceding siblings ...)
2025-03-31 12:19 ` [#379725] [test-only] FAILED (try 11) " Girar awaiter (cas)
@ 2025-03-31 12:50 ` Girar awaiter (cas)
2025-03-31 13:52 ` [#379725] [test-only] FAILED (try 13) " Girar awaiter (cas)
` (5 subsequent siblings)
16 siblings, 0 replies; 18+ messages in thread
From: Girar awaiter (cas) @ 2025-03-31 12:50 UTC (permalink / raw)
To: Andrey Cherepanov; +Cc: sisyphus-incominger, girar-builder-sisyphus
https://git.altlinux.org/tasks/379725/logs/events.12.1.log
https://packages.altlinux.org/tasks/379725
subtask name aarch64 i586 x86_64
#2700 octave-quaternion 1:29 57 53
#3100 octave-struct 1:42 1:05 1:01
#3200 octave-vibes 1:16 50 49
#3300 octave-zeromq 2:41 1:34 1:31
#3400 octave-control 3:31 2:08 1:52
#3500 octave-communications 3:31 2:08 1:59
#3600 octave-queueing 1:47 1:00 55
#3700 octave-fuzzy-logic-toolkit 1:26 55 51
#4000 octave-level-set 1:51 1:10 1:05
#4100 octave-financial 1:41 1:02 58
^ permalink raw reply [flat|nested] 18+ messages in thread
* [#379725] [test-only] FAILED (try 13) octave.git=10.1.0-alt1 srpm=octave-audio-2.0.5-alt2.src.rpm ...
2025-03-30 19:09 [#379725] [test-only] FAILED octave.git=10.1.0-alt1 Girar awaiter (cas)
` (10 preceding siblings ...)
2025-03-31 12:50 ` [#379725] [test-only] FAILED (try 12) " Girar awaiter (cas)
@ 2025-03-31 13:52 ` Girar awaiter (cas)
2025-03-31 14:25 ` [#379725] [test-only] FAILED (try 14) " Girar awaiter (cas)
` (4 subsequent siblings)
16 siblings, 0 replies; 18+ messages in thread
From: Girar awaiter (cas) @ 2025-03-31 13:52 UTC (permalink / raw)
To: Andrey Cherepanov; +Cc: sisyphus-incominger, girar-builder-sisyphus
https://git.altlinux.org/tasks/379725/logs/events.13.1.log
https://packages.altlinux.org/tasks/379725
subtask name aarch64 i586 x86_64
#4200 octave-octproj 2:09 1:07 1:01
#4300 octave-signal failed failed failed
2025-Mar-31 13:47:03 :: test-only swift task #379725 for sisyphus resumed by cas:
2025-Mar-31 13:47:03 :: message: New_version_of_octave
#100 removed
#200 build 10.1.0-alt1 from /people/cas/packages/octave.git fetched at 2025-Mar-31 05:38:18
#300 build octave-audio-2.0.5-alt2.src.rpm from sisyphus
#400 build 0.5.1-alt1 from /gears/o/octave-dicom.git fetched at 2025-Mar-31 08:33:43 from sisyphus
#500 build 1.1.2-alt1 from /gears/o/octave-econometrics.git fetched at 2025-Mar-31 08:33:43 from sisyphus
#600 build octave-fits-1.0.7-alt4.src.rpm from sisyphus
#700 build octave-general-2.1.3-alt2.src.rpm from sisyphus
#740 removed
#1000 removed
#1100 removed
#1200 removed
#1300 build octave-instrument-control-0.9.1-alt1.src.rpm from sisyphus
#1400 build octave-interval-3.2.1-alt2.src.rpm from sisyphus
#1500 build octave-io-2.6.4-alt1.src.rpm from sisyphus
#1600 build octave-lssa-0.1.4-alt1.src.rpm from sisyphus
#1700 removed
#2000 build octave-mapping-1.4.2-alt1.src.rpm from sisyphus
#2100 build octave-miscellaneous-1.3.0-alt2.src.rpm from sisyphus
#2200 build octave-netcdf-1.0.17-alt2.src.rpm from sisyphus
#2300 removed
#2400 removed
#2500 removed
#2600 build octave-optiminterp-0.3.7-alt1.src.rpm from sisyphus
#2700 build 2.4.0-alt5 from /gears/o/octave-quaternion.git fetched at 2025-Mar-31 08:34:01 from sisyphus
#3000 removed
#3100 build octave-struct-1.0.18-alt1.src.rpm from sisyphus
#3200 build 0.2.0-alt5 from /gears/o/octave-vibes.git fetched at 2025-Mar-31 08:34:04 from sisyphus
#3300 build octave-zeromq-1.5.5-alt1.src.rpm from sisyphus
#3400 build 4.1.1-alt1 from /gears/o/octave-control.git fetched at 2025-Mar-31 08:34:08 from sisyphus
#3500 build octave-communications-1.2.7-alt1.src.rpm from sisyphus
#3600 build octave-queueing-1.2.8-alt1.src.rpm from sisyphus
#3700 build octave-fuzzy-logic-toolkit-0.6.1-alt1.src.rpm from sisyphus
#4000 build octave-level-set-0.3.0-alt6.src.rpm from sisyphus
#4100 build octave-financial-0.5.3-alt2.src.rpm from sisyphus
#4200 build octave-octproj-3.0.2-alt1.src.rpm
#4300 build octave-signal-1.4.6-alt1.src.rpm
#4400 build octave-nurbs-1.4.4-alt1.src.rpm
#4500 build octave-msh-1.0.12-alt1.src.rpm
2025-Mar-31 13:47:04 :: created build repo
2025-Mar-31 13:47:05 :: [i586] #200 octave.git 10.1.0-alt1: build start
2025-Mar-31 13:47:05 :: [aarch64] #200 octave.git 10.1.0-alt1: build start
2025-Mar-31 13:47:05 :: [x86_64] #200 octave.git 10.1.0-alt1: build start
2025-Mar-31 13:47:06 :: [x86_64] #200 octave.git 10.1.0-alt1: build swiftly SKIPPED
2025-Mar-31 13:47:06 :: [i586] #200 octave.git 10.1.0-alt1: build swiftly SKIPPED
2025-Mar-31 13:47:06 :: [x86_64] #300 octave-audio-2.0.5-alt2.src.rpm: build start
2025-Mar-31 13:47:06 :: [i586] #300 octave-audio-2.0.5-alt2.src.rpm: build start
2025-Mar-31 13:47:06 :: [x86_64] #300 octave-audio-2.0.5-alt2.src.rpm: build swiftly SKIPPED
2025-Mar-31 13:47:07 :: [i586] #300 octave-audio-2.0.5-alt2.src.rpm: build swiftly SKIPPED
2025-Mar-31 13:47:07 :: [x86_64] #400 octave-dicom.git 0.5.1-alt1: build start
2025-Mar-31 13:47:07 :: [i586] #400 octave-dicom.git 0.5.1-alt1: build start
2025-Mar-31 13:47:07 :: [x86_64] #400 octave-dicom.git 0.5.1-alt1: build swiftly SKIPPED
2025-Mar-31 13:47:07 :: [i586] #400 octave-dicom.git 0.5.1-alt1: build swiftly SKIPPED
2025-Mar-31 13:47:07 :: [x86_64] #500 octave-econometrics.git 1.1.2-alt1: build start
2025-Mar-31 13:47:07 :: [i586] #500 octave-econometrics.git 1.1.2-alt1: build start
2025-Mar-31 13:47:07 :: [x86_64] #500 octave-econometrics.git 1.1.2-alt1: build swiftly SKIPPED
2025-Mar-31 13:47:07 :: [i586] #500 octave-econometrics.git 1.1.2-alt1: build swiftly SKIPPED
2025-Mar-31 13:47:07 :: [x86_64] #600 octave-fits-1.0.7-alt4.src.rpm: build start
2025-Mar-31 13:47:08 :: [aarch64] #200 octave.git 10.1.0-alt1: build swiftly SKIPPED
2025-Mar-31 13:47:08 :: [i586] #600 octave-fits-1.0.7-alt4.src.rpm: build start
2025-Mar-31 13:47:08 :: [x86_64] #600 octave-fits-1.0.7-alt4.src.rpm: build swiftly SKIPPED
2025-Mar-31 13:47:08 :: [i586] #600 octave-fits-1.0.7-alt4.src.rpm: build swiftly SKIPPED
2025-Mar-31 13:47:08 :: [aarch64] #300 octave-audio-2.0.5-alt2.src.rpm: build start
2025-Mar-31 13:47:08 :: [x86_64] #700 octave-general-2.1.3-alt2.src.rpm: build start
2025-Mar-31 13:47:08 :: [i586] #700 octave-general-2.1.3-alt2.src.rpm: build start
2025-Mar-31 13:47:08 :: [x86_64] #700 octave-general-2.1.3-alt2.src.rpm: build swiftly SKIPPED
2025-Mar-31 13:47:08 :: [aarch64] #300 octave-audio-2.0.5-alt2.src.rpm: build swiftly SKIPPED
2025-Mar-31 13:47:08 :: [i586] #700 octave-general-2.1.3-alt2.src.rpm: build swiftly SKIPPED
2025-Mar-31 13:47:08 :: [x86_64] #1300 octave-instrument-control-0.9.1-alt1.src.rpm: build start
2025-Mar-31 13:47:08 :: [aarch64] #400 octave-dicom.git 0.5.1-alt1: build start
2025-Mar-31 13:47:08 :: [i586] #1300 octave-instrument-control-0.9.1-alt1.src.rpm: build start
2025-Mar-31 13:47:09 :: [x86_64] #1300 octave-instrument-control-0.9.1-alt1.src.rpm: build swiftly SKIPPED
2025-Mar-31 13:47:09 :: [i586] #1300 octave-instrument-control-0.9.1-alt1.src.rpm: build swiftly SKIPPED
2025-Mar-31 13:47:09 :: [aarch64] #400 octave-dicom.git 0.5.1-alt1: build swiftly SKIPPED
2025-Mar-31 13:47:09 :: [x86_64] #1400 octave-interval-3.2.1-alt2.src.rpm: build start
2025-Mar-31 13:47:09 :: [i586] #1400 octave-interval-3.2.1-alt2.src.rpm: build start
2025-Mar-31 13:47:09 :: [x86_64] #1400 octave-interval-3.2.1-alt2.src.rpm: build swiftly SKIPPED
2025-Mar-31 13:47:09 :: [aarch64] #500 octave-econometrics.git 1.1.2-alt1: build start
2025-Mar-31 13:47:09 :: [i586] #1400 octave-interval-3.2.1-alt2.src.rpm: build swiftly SKIPPED
2025-Mar-31 13:47:09 :: [x86_64] #1500 octave-io-2.6.4-alt1.src.rpm: build start
2025-Mar-31 13:47:09 :: [aarch64] #500 octave-econometrics.git 1.1.2-alt1: build swiftly SKIPPED
2025-Mar-31 13:47:09 :: [x86_64] #1500 octave-io-2.6.4-alt1.src.rpm: build swiftly SKIPPED
2025-Mar-31 13:47:09 :: [i586] #1500 octave-io-2.6.4-alt1.src.rpm: build start
2025-Mar-31 13:47:09 :: [aarch64] #600 octave-fits-1.0.7-alt4.src.rpm: build start
2025-Mar-31 13:47:10 :: [i586] #1500 octave-io-2.6.4-alt1.src.rpm: build swiftly SKIPPED
2025-Mar-31 13:47:10 :: [x86_64] #1600 octave-lssa-0.1.4-alt1.src.rpm: build start
2025-Mar-31 13:47:10 :: [aarch64] #600 octave-fits-1.0.7-alt4.src.rpm: build swiftly SKIPPED
2025-Mar-31 13:47:10 :: [x86_64] #1600 octave-lssa-0.1.4-alt1.src.rpm: build swiftly SKIPPED
2025-Mar-31 13:47:10 :: [i586] #1600 octave-lssa-0.1.4-alt1.src.rpm: build start
2025-Mar-31 13:47:10 :: [aarch64] #700 octave-general-2.1.3-alt2.src.rpm: build start
2025-Mar-31 13:47:10 :: [i586] #1600 octave-lssa-0.1.4-alt1.src.rpm: build swiftly SKIPPED
2025-Mar-31 13:47:10 :: [x86_64] #2000 octave-mapping-1.4.2-alt1.src.rpm: build start
2025-Mar-31 13:47:10 :: [aarch64] #700 octave-general-2.1.3-alt2.src.rpm: build swiftly SKIPPED
2025-Mar-31 13:47:10 :: [x86_64] #2000 octave-mapping-1.4.2-alt1.src.rpm: build swiftly SKIPPED
2025-Mar-31 13:47:10 :: [i586] #2000 octave-mapping-1.4.2-alt1.src.rpm: build start
2025-Mar-31 13:47:10 :: [aarch64] #1300 octave-instrument-control-0.9.1-alt1.src.rpm: build start
2025-Mar-31 13:47:10 :: [i586] #2000 octave-mapping-1.4.2-alt1.src.rpm: build swiftly SKIPPED
2025-Mar-31 13:47:10 :: [x86_64] #2100 octave-miscellaneous-1.3.0-alt2.src.rpm: build start
2025-Mar-31 13:47:11 :: [x86_64] #2100 octave-miscellaneous-1.3.0-alt2.src.rpm: build swiftly SKIPPED
2025-Mar-31 13:47:11 :: [i586] #2100 octave-miscellaneous-1.3.0-alt2.src.rpm: build start
2025-Mar-31 13:47:11 :: [i586] #2100 octave-miscellaneous-1.3.0-alt2.src.rpm: build swiftly SKIPPED
2025-Mar-31 13:47:11 :: [x86_64] #2200 octave-netcdf-1.0.17-alt2.src.rpm: build start
2025-Mar-31 13:47:11 :: [aarch64] #1300 octave-instrument-control-0.9.1-alt1.src.rpm: build swiftly SKIPPED
2025-Mar-31 13:47:11 :: [x86_64] #2200 octave-netcdf-1.0.17-alt2.src.rpm: build swiftly SKIPPED
2025-Mar-31 13:47:11 :: [i586] #2200 octave-netcdf-1.0.17-alt2.src.rpm: build start
2025-Mar-31 13:47:11 :: [aarch64] #1400 octave-interval-3.2.1-alt2.src.rpm: build start
2025-Mar-31 13:47:11 :: [i586] #2200 octave-netcdf-1.0.17-alt2.src.rpm: build swiftly SKIPPED
2025-Mar-31 13:47:11 :: [x86_64] #2600 octave-optiminterp-0.3.7-alt1.src.rpm: build start
2025-Mar-31 13:47:11 :: [x86_64] #2600 octave-optiminterp-0.3.7-alt1.src.rpm: build swiftly SKIPPED
2025-Mar-31 13:47:11 :: [i586] #2600 octave-optiminterp-0.3.7-alt1.src.rpm: build start
2025-Mar-31 13:47:12 :: [aarch64] #1400 octave-interval-3.2.1-alt2.src.rpm: build swiftly SKIPPED
2025-Mar-31 13:47:12 :: [i586] #2600 octave-optiminterp-0.3.7-alt1.src.rpm: build swiftly SKIPPED
2025-Mar-31 13:47:12 :: [x86_64] #2700 octave-quaternion.git 2.4.0-alt5: build start
2025-Mar-31 13:47:12 :: [x86_64] #2700 octave-quaternion.git 2.4.0-alt5: build swiftly SKIPPED
2025-Mar-31 13:47:12 :: [aarch64] #1500 octave-io-2.6.4-alt1.src.rpm: build start
2025-Mar-31 13:47:12 :: [i586] #2700 octave-quaternion.git 2.4.0-alt5: build start
2025-Mar-31 13:47:12 :: [x86_64] #3100 octave-struct-1.0.18-alt1.src.rpm: build start
2025-Mar-31 13:47:12 :: [i586] #2700 octave-quaternion.git 2.4.0-alt5: build swiftly SKIPPED
2025-Mar-31 13:47:12 :: [aarch64] #1500 octave-io-2.6.4-alt1.src.rpm: build swiftly SKIPPED
2025-Mar-31 13:47:12 :: [x86_64] #3100 octave-struct-1.0.18-alt1.src.rpm: build swiftly SKIPPED
2025-Mar-31 13:47:12 :: [i586] #3100 octave-struct-1.0.18-alt1.src.rpm: build start
2025-Mar-31 13:47:12 :: [aarch64] #1600 octave-lssa-0.1.4-alt1.src.rpm: build start
2025-Mar-31 13:47:12 :: [i586] #3100 octave-struct-1.0.18-alt1.src.rpm: build swiftly SKIPPED
2025-Mar-31 13:47:12 :: [x86_64] #3200 octave-vibes.git 0.2.0-alt5: build start
2025-Mar-31 13:47:12 :: [aarch64] #1600 octave-lssa-0.1.4-alt1.src.rpm: build swiftly SKIPPED
2025-Mar-31 13:47:12 :: [x86_64] #3200 octave-vibes.git 0.2.0-alt5: build swiftly SKIPPED
2025-Mar-31 13:47:13 :: [i586] #3200 octave-vibes.git 0.2.0-alt5: build start
2025-Mar-31 13:47:13 :: [aarch64] #2000 octave-mapping-1.4.2-alt1.src.rpm: build start
2025-Mar-31 13:47:13 :: [i586] #3200 octave-vibes.git 0.2.0-alt5: build swiftly SKIPPED
2025-Mar-31 13:47:13 :: [x86_64] #3300 octave-zeromq-1.5.5-alt1.src.rpm: build start
2025-Mar-31 13:47:13 :: [x86_64] #3300 octave-zeromq-1.5.5-alt1.src.rpm: build swiftly SKIPPED
2025-Mar-31 13:47:13 :: [i586] #3300 octave-zeromq-1.5.5-alt1.src.rpm: build start
2025-Mar-31 13:47:13 :: [x86_64] #3400 octave-control.git 4.1.1-alt1: build start
2025-Mar-31 13:47:13 :: [i586] #3300 octave-zeromq-1.5.5-alt1.src.rpm: build swiftly SKIPPED
2025-Mar-31 13:47:13 :: [aarch64] #2000 octave-mapping-1.4.2-alt1.src.rpm: build swiftly SKIPPED
2025-Mar-31 13:47:13 :: [x86_64] #3400 octave-control.git 4.1.1-alt1: build swiftly SKIPPED
2025-Mar-31 13:47:13 :: [i586] #3400 octave-control.git 4.1.1-alt1: build start
2025-Mar-31 13:47:13 :: [aarch64] #2100 octave-miscellaneous-1.3.0-alt2.src.rpm: build start
2025-Mar-31 13:47:14 :: [i586] #3400 octave-control.git 4.1.1-alt1: build swiftly SKIPPED
2025-Mar-31 13:47:14 :: [x86_64] #3500 octave-communications-1.2.7-alt1.src.rpm: build start
2025-Mar-31 13:47:14 :: [aarch64] #2100 octave-miscellaneous-1.3.0-alt2.src.rpm: build swiftly SKIPPED
2025-Mar-31 13:47:14 :: [x86_64] #3500 octave-communications-1.2.7-alt1.src.rpm: build swiftly SKIPPED
2025-Mar-31 13:47:14 :: [i586] #3500 octave-communications-1.2.7-alt1.src.rpm: build start
2025-Mar-31 13:47:14 :: [aarch64] #2200 octave-netcdf-1.0.17-alt2.src.rpm: build start
2025-Mar-31 13:47:14 :: [i586] #3500 octave-communications-1.2.7-alt1.src.rpm: build swiftly SKIPPED
2025-Mar-31 13:47:14 :: [x86_64] #3600 octave-queueing-1.2.8-alt1.src.rpm: build start
2025-Mar-31 13:47:14 :: [x86_64] #3600 octave-queueing-1.2.8-alt1.src.rpm: build swiftly SKIPPED
2025-Mar-31 13:47:14 :: [aarch64] #2200 octave-netcdf-1.0.17-alt2.src.rpm: build swiftly SKIPPED
2025-Mar-31 13:47:14 :: [i586] #3600 octave-queueing-1.2.8-alt1.src.rpm: build start
2025-Mar-31 13:47:14 :: [i586] #3600 octave-queueing-1.2.8-alt1.src.rpm: build swiftly SKIPPED
2025-Mar-31 13:47:14 :: [x86_64] #3700 octave-fuzzy-logic-toolkit-0.6.1-alt1.src.rpm: build start
2025-Mar-31 13:47:14 :: [aarch64] #2600 octave-optiminterp-0.3.7-alt1.src.rpm: build start
2025-Mar-31 13:47:15 :: [i586] #3700 octave-fuzzy-logic-toolkit-0.6.1-alt1.src.rpm: build start
2025-Mar-31 13:47:15 :: [x86_64] #3700 octave-fuzzy-logic-toolkit-0.6.1-alt1.src.rpm: build swiftly SKIPPED
2025-Mar-31 13:47:15 :: [aarch64] #2600 octave-optiminterp-0.3.7-alt1.src.rpm: build swiftly SKIPPED
2025-Mar-31 13:47:15 :: [i586] #3700 octave-fuzzy-logic-toolkit-0.6.1-alt1.src.rpm: build swiftly SKIPPED
2025-Mar-31 13:47:15 :: [x86_64] #4000 octave-level-set-0.3.0-alt6.src.rpm: build start
2025-Mar-31 13:47:15 :: [aarch64] #2700 octave-quaternion.git 2.4.0-alt5: build start
2025-Mar-31 13:47:15 :: [i586] #4000 octave-level-set-0.3.0-alt6.src.rpm: build start
2025-Mar-31 13:47:15 :: [x86_64] #4000 octave-level-set-0.3.0-alt6.src.rpm: build swiftly SKIPPED
2025-Mar-31 13:47:15 :: [aarch64] #2700 octave-quaternion.git 2.4.0-alt5: build swiftly SKIPPED
2025-Mar-31 13:47:15 :: [i586] #4000 octave-level-set-0.3.0-alt6.src.rpm: build swiftly SKIPPED
2025-Mar-31 13:47:15 :: [x86_64] #4100 octave-financial-0.5.3-alt2.src.rpm: build start
2025-Mar-31 13:47:15 :: [aarch64] #3100 octave-struct-1.0.18-alt1.src.rpm: build start
2025-Mar-31 13:47:15 :: [x86_64] #4100 octave-financial-0.5.3-alt2.src.rpm: build swiftly SKIPPED
2025-Mar-31 13:47:15 :: [i586] #4100 octave-financial-0.5.3-alt2.src.rpm: build start
2025-Mar-31 13:47:16 :: [aarch64] #3100 octave-struct-1.0.18-alt1.src.rpm: build swiftly SKIPPED
2025-Mar-31 13:47:16 :: [i586] #4100 octave-financial-0.5.3-alt2.src.rpm: build swiftly SKIPPED
2025-Mar-31 13:47:16 :: [x86_64] #4200 octave-octproj-3.0.2-alt1.src.rpm: build start
2025-Mar-31 13:47:16 :: [aarch64] #3200 octave-vibes.git 0.2.0-alt5: build start
2025-Mar-31 13:47:16 :: [i586] #4200 octave-octproj-3.0.2-alt1.src.rpm: build start
2025-Mar-31 13:47:16 :: [aarch64] #3200 octave-vibes.git 0.2.0-alt5: build swiftly SKIPPED
2025-Mar-31 13:47:16 :: [aarch64] #3300 octave-zeromq-1.5.5-alt1.src.rpm: build start
2025-Mar-31 13:47:17 :: [aarch64] #3300 octave-zeromq-1.5.5-alt1.src.rpm: build swiftly SKIPPED
2025-Mar-31 13:47:17 :: [aarch64] #3400 octave-control.git 4.1.1-alt1: build start
2025-Mar-31 13:47:17 :: [aarch64] #3400 octave-control.git 4.1.1-alt1: build swiftly SKIPPED
2025-Mar-31 13:47:17 :: [aarch64] #3500 octave-communications-1.2.7-alt1.src.rpm: build start
2025-Mar-31 13:47:18 :: [aarch64] #3500 octave-communications-1.2.7-alt1.src.rpm: build swiftly SKIPPED
2025-Mar-31 13:47:18 :: [aarch64] #3600 octave-queueing-1.2.8-alt1.src.rpm: build start
2025-Mar-31 13:47:18 :: [aarch64] #3600 octave-queueing-1.2.8-alt1.src.rpm: build swiftly SKIPPED
2025-Mar-31 13:47:18 :: [aarch64] #3700 octave-fuzzy-logic-toolkit-0.6.1-alt1.src.rpm: build start
2025-Mar-31 13:47:19 :: [aarch64] #3700 octave-fuzzy-logic-toolkit-0.6.1-alt1.src.rpm: build swiftly SKIPPED
2025-Mar-31 13:47:19 :: [aarch64] #4000 octave-level-set-0.3.0-alt6.src.rpm: build start
2025-Mar-31 13:47:19 :: [aarch64] #4000 octave-level-set-0.3.0-alt6.src.rpm: build swiftly SKIPPED
2025-Mar-31 13:47:19 :: [aarch64] #4100 octave-financial-0.5.3-alt2.src.rpm: build start
2025-Mar-31 13:47:20 :: [aarch64] #4100 octave-financial-0.5.3-alt2.src.rpm: build swiftly SKIPPED
2025-Mar-31 13:47:20 :: [aarch64] #4200 octave-octproj-3.0.2-alt1.src.rpm: build start
2025-Mar-31 13:48:17 :: [x86_64] #4200 octave-octproj-3.0.2-alt1.src.rpm: build OK
2025-Mar-31 13:48:17 :: [x86_64] #4300 octave-signal-1.4.6-alt1.src.rpm: build start
2025-Mar-31 13:48:23 :: [i586] #4200 octave-octproj-3.0.2-alt1.src.rpm: build OK
2025-Mar-31 13:48:23 :: [i586] #4300 octave-signal-1.4.6-alt1.src.rpm: build start
2025-Mar-31 13:49:29 :: [aarch64] #4200 octave-octproj-3.0.2-alt1.src.rpm: build OK
2025-Mar-31 13:49:29 :: [aarch64] #4300 octave-signal-1.4.6-alt1.src.rpm: build start
[x86_64] find-provides: running scripts (alternatives,debuginfo,lib,pam,perl,pkgconfig,python,python3,shell)
[x86_64] /usr/lib/rpm/python3.prov: ERROR: rpm-build-python3 is not installed, the following files cannot be processed: /usr/src/tmp/octave-signal-buildroot/usr/share/octave/packages/signal-1.4.6/doc/mkfuncdocs.py /usr/src/tmp/octave-signal-buildroot/usr/share/octave/packages/signal-1.4.6/doc/mkqhcp.py
[x86_64] find-provides: ERROR: /usr/lib/rpm/python3.prov failed
[x86_64] error: /bin/sh failed
[x86_64] error: Failed to find Provides
[x86_64] RPM build errors:
2025-Mar-31 13:49:50 :: [x86_64] octave-signal-1.4.6-alt1.src.rpm: remote: build failed
2025-Mar-31 13:49:50 :: [x86_64] #4300 octave-signal-1.4.6-alt1.src.rpm: build FAILED
2025-Mar-31 13:49:50 :: [x86_64] requesting cancellation of task processing
[i586] find-provides: running scripts (alternatives,debuginfo,lib,pam,perl,pkgconfig,python,python3,shell)
[i586] /usr/lib/rpm/python3.prov: ERROR: rpm-build-python3 is not installed, the following files cannot be processed: /usr/src/tmp/octave-signal-buildroot/usr/share/octave/packages/signal-1.4.6/doc/mkfuncdocs.py /usr/src/tmp/octave-signal-buildroot/usr/share/octave/packages/signal-1.4.6/doc/mkqhcp.py
[i586] find-provides: ERROR: /usr/lib/rpm/python3.prov failed
[i586] error: /bin/sh failed
[i586] error: Failed to find Provides
[i586] RPM build errors:
2025-Mar-31 13:50:04 :: [i586] octave-signal-1.4.6-alt1.src.rpm: remote: build failed
2025-Mar-31 13:50:04 :: [i586] #4300 octave-signal-1.4.6-alt1.src.rpm: build FAILED
[aarch64] find-provides: running scripts (alternatives,debuginfo,lib,pam,perl,pkgconfig,python,python3,shell)
[aarch64] /usr/lib/rpm/python3.prov: ERROR: rpm-build-python3 is not installed, the following files cannot be processed: /usr/src/tmp/octave-signal-buildroot/usr/share/octave/packages/signal-1.4.6/doc/mkfuncdocs.py /usr/src/tmp/octave-signal-buildroot/usr/share/octave/packages/signal-1.4.6/doc/mkqhcp.py
[aarch64] find-provides: ERROR: /usr/lib/rpm/python3.prov failed
[aarch64] error: /bin/sh failed
[aarch64] error: Failed to find Provides
[aarch64] RPM build errors:
2025-Mar-31 13:52:17 :: [aarch64] octave-signal-1.4.6-alt1.src.rpm: remote: build failed
2025-Mar-31 13:52:17 :: [aarch64] #4300 octave-signal-1.4.6-alt1.src.rpm: build FAILED
2025-Mar-31 13:49:50 :: [x86_64] build FAILED
2025-Mar-31 13:50:04 :: [i586] build FAILED
2025-Mar-31 13:52:17 :: [aarch64] build FAILED
2025-Mar-31 13:52:17 :: task #379725 for sisyphus FAILED
^ permalink raw reply [flat|nested] 18+ messages in thread
* [#379725] [test-only] FAILED (try 14) octave.git=10.1.0-alt1 srpm=octave-audio-2.0.5-alt2.src.rpm ...
2025-03-30 19:09 [#379725] [test-only] FAILED octave.git=10.1.0-alt1 Girar awaiter (cas)
` (11 preceding siblings ...)
2025-03-31 13:52 ` [#379725] [test-only] FAILED (try 13) " Girar awaiter (cas)
@ 2025-03-31 14:25 ` Girar awaiter (cas)
2025-03-31 15:25 ` [#379725] [test-only] FAILED (try 15) " Girar awaiter (cas)
` (3 subsequent siblings)
16 siblings, 0 replies; 18+ messages in thread
From: Girar awaiter (cas) @ 2025-03-31 14:25 UTC (permalink / raw)
To: Andrey Cherepanov; +Cc: sisyphus-incominger, girar-builder-sisyphus
https://git.altlinux.org/tasks/379725/logs/events.14.1.log
https://packages.altlinux.org/tasks/379725
subtask name aarch64 i586 x86_64
#4400 octave-nurbs 1:51 1:09 1:05
#4500 octave-msh 1:06 43 40
^ permalink raw reply [flat|nested] 18+ messages in thread
* [#379725] [test-only] FAILED (try 15) octave.git=10.1.0-alt1 srpm=octave-audio-2.0.5-alt2.src.rpm ...
2025-03-30 19:09 [#379725] [test-only] FAILED octave.git=10.1.0-alt1 Girar awaiter (cas)
` (12 preceding siblings ...)
2025-03-31 14:25 ` [#379725] [test-only] FAILED (try 14) " Girar awaiter (cas)
@ 2025-03-31 15:25 ` Girar awaiter (cas)
2025-04-01 15:19 ` [#379725] [test-only] FAILED (try 16) " Girar awaiter (cas)
` (2 subsequent siblings)
16 siblings, 0 replies; 18+ messages in thread
From: Girar awaiter (cas) @ 2025-03-31 15:25 UTC (permalink / raw)
To: Andrey Cherepanov; +Cc: sisyphus-incominger, girar-builder-sisyphus
https://git.altlinux.org/tasks/379725/logs/events.15.1.log
https://packages.altlinux.org/tasks/379725
subtask name aarch64 i586 x86_64
#4600 octave-image 3:46 2:17 2:06
#4700 octave-image-acquisition 1:29 58 54
#5000 octave-octclip 1:13 48 45
^ permalink raw reply [flat|nested] 18+ messages in thread
* [#379725] [test-only] FAILED (try 16) octave.git=10.1.0-alt1 srpm=octave-audio-2.0.5-alt2.src.rpm ...
2025-03-30 19:09 [#379725] [test-only] FAILED octave.git=10.1.0-alt1 Girar awaiter (cas)
` (13 preceding siblings ...)
2025-03-31 15:25 ` [#379725] [test-only] FAILED (try 15) " Girar awaiter (cas)
@ 2025-04-01 15:19 ` Girar awaiter (cas)
2025-04-03 3:29 ` [#379725] SWEPT (try 17) " Girar awaiter (cas)
2025-04-03 9:29 ` [#379725] DONE (try 18) " Girar pender (cas)
16 siblings, 0 replies; 18+ messages in thread
From: Girar awaiter (cas) @ 2025-04-01 15:19 UTC (permalink / raw)
To: Andrey Cherepanov; +Cc: sisyphus-incominger, girar-builder-sisyphus
https://git.altlinux.org/tasks/379725/logs/events.16.1.log
https://packages.altlinux.org/tasks/379725
subtask name aarch64 i586 x86_64
#5100 octave-geometry 2:03 1:19 1:12
#5200 octave-gsl 1:57 1:15 1:08
#5300 octave-ocl 2:02 1:19 1:12
#5400 octave-signal 2:58 2:00 1:43
#5500 octave-optim 2:29 1:37 1:23
#5600 octave-sockets 1:17 55 49
^ permalink raw reply [flat|nested] 18+ messages in thread
* [#379725] SWEPT (try 17) octave.git=10.1.0-alt1 srpm=octave-audio-2.0.5-alt2.src.rpm ...
2025-03-30 19:09 [#379725] [test-only] FAILED octave.git=10.1.0-alt1 Girar awaiter (cas)
` (14 preceding siblings ...)
2025-04-01 15:19 ` [#379725] [test-only] FAILED (try 16) " Girar awaiter (cas)
@ 2025-04-03 3:29 ` Girar awaiter (cas)
2025-04-03 9:29 ` [#379725] DONE (try 18) " Girar pender (cas)
16 siblings, 0 replies; 18+ messages in thread
From: Girar awaiter (cas) @ 2025-04-03 3:29 UTC (permalink / raw)
To: Andrey Cherepanov
Cc: Paul Wolneykien, Igor Vlasenko, sisyphus-incominger,
girar-builder-sisyphus, Igor Vlasenko (qa)
https://git.altlinux.org/tasks/379725/logs/events.17.1.log
https://packages.altlinux.org/tasks/379725
2025-Apr-03 02:36:05 :: test-only swift task #379725 for sisyphus resumed by cas:
2025-Apr-03 02:36:05 :: message: New_version_of_octave
#100 removed
#200 build 10.1.0-alt1 from /people/cas/packages/octave.git fetched at 2025-Mar-31 05:38:18
#300 build octave-audio-2.0.5-alt2.src.rpm from sisyphus
#400 build 0.5.1-alt1 from /gears/o/octave-dicom.git fetched at 2025-Mar-31 08:33:43 from sisyphus
#500 build 1.1.2-alt1 from /gears/o/octave-econometrics.git fetched at 2025-Mar-31 08:33:43 from sisyphus
#600 build octave-fits-1.0.7-alt4.src.rpm from sisyphus
#700 build octave-general-2.1.3-alt2.src.rpm from sisyphus
#740 removed
#1000 removed
#1100 removed
#1200 removed
#1300 build octave-instrument-control-0.9.1-alt1.src.rpm from sisyphus
#1400 build octave-interval-3.2.1-alt2.src.rpm from sisyphus
#1500 build octave-io-2.6.4-alt1.src.rpm from sisyphus
#1600 build octave-lssa-0.1.4-alt1.src.rpm from sisyphus
#1700 removed
#2000 build octave-mapping-1.4.2-alt1.src.rpm from sisyphus
#2100 build octave-miscellaneous-1.3.0-alt2.src.rpm from sisyphus
#2200 build octave-netcdf-1.0.17-alt2.src.rpm from sisyphus
#2300 removed
#2400 removed
#2500 removed
#2600 build octave-optiminterp-0.3.7-alt1.src.rpm from sisyphus
#2700 build 2.4.0-alt5 from /gears/o/octave-quaternion.git fetched at 2025-Mar-31 08:34:01 from sisyphus
#3000 removed
#3100 build octave-struct-1.0.18-alt1.src.rpm from sisyphus
#3200 build 0.2.0-alt5 from /gears/o/octave-vibes.git fetched at 2025-Mar-31 08:34:04 from sisyphus
#3300 build octave-zeromq-1.5.5-alt1.src.rpm from sisyphus
#3400 build 4.1.1-alt1 from /gears/o/octave-control.git fetched at 2025-Mar-31 08:34:08 from sisyphus
#3500 build octave-communications-1.2.7-alt1.src.rpm from sisyphus
#3600 build octave-queueing-1.2.8-alt1.src.rpm from sisyphus
#3700 build octave-fuzzy-logic-toolkit-0.6.1-alt1.src.rpm from sisyphus
#4000 build octave-level-set-0.3.0-alt6.src.rpm from sisyphus
#4100 build octave-financial-0.5.3-alt2.src.rpm from sisyphus
#4200 build octave-octproj-3.0.2-alt1.src.rpm
#4300 removed
#4400 build octave-nurbs-1.4.4-alt1.src.rpm
#4500 build octave-msh-1.0.12-alt1.src.rpm
#4600 build octave-image-2.16.0-alt1.src.rpm
#4700 build octave-image-acquisition-0.3.0-alt1.src.rpm
#5000 build octave-octclip-2.0.3-alt1.src.rpm
#5100 build octave-geometry-4.1.0-alt1.src.rpm
#5200 build octave-gsl-2.1.1-alt3.src.rpm from sisyphus
#5300 build octave-ocl-1.2.3-alt1.src.rpm
#5400 build octave-signal-1.4.6-alt1.src.rpm
#5500 build octave-optim-1.6.2-alt2.src.rpm
#5600 build octave-sockets-1.4.1-alt1.src.rpm from sisyphus
#5700 delete octave-ltfat
2025-Apr-03 02:36:05 :: created build repo
2025-Apr-03 02:36:07 :: [i586] #200 octave.git 10.1.0-alt1: build start
2025-Apr-03 02:36:07 :: [x86_64] #200 octave.git 10.1.0-alt1: build start
2025-Apr-03 02:36:07 :: [aarch64] #200 octave.git 10.1.0-alt1: build start
2025-Apr-03 02:36:08 :: [x86_64] #200 octave.git 10.1.0-alt1: build swiftly SKIPPED
2025-Apr-03 02:36:08 :: [i586] #200 octave.git 10.1.0-alt1: build swiftly SKIPPED
2025-Apr-03 02:36:08 :: [x86_64] #300 octave-audio-2.0.5-alt2.src.rpm: build start
2025-Apr-03 02:36:08 :: [i586] #300 octave-audio-2.0.5-alt2.src.rpm: build start
2025-Apr-03 02:36:08 :: [aarch64] #200 octave.git 10.1.0-alt1: build swiftly SKIPPED
2025-Apr-03 02:36:08 :: [x86_64] #300 octave-audio-2.0.5-alt2.src.rpm: build swiftly SKIPPED
2025-Apr-03 02:36:08 :: [i586] #300 octave-audio-2.0.5-alt2.src.rpm: build swiftly SKIPPED
2025-Apr-03 02:36:08 :: [aarch64] #300 octave-audio-2.0.5-alt2.src.rpm: build start
2025-Apr-03 02:36:08 :: [i586] #400 octave-dicom.git 0.5.1-alt1: build start
2025-Apr-03 02:36:08 :: [x86_64] #400 octave-dicom.git 0.5.1-alt1: build start
2025-Apr-03 02:36:09 :: [aarch64] #300 octave-audio-2.0.5-alt2.src.rpm: build swiftly SKIPPED
2025-Apr-03 02:36:09 :: [i586] #400 octave-dicom.git 0.5.1-alt1: build swiftly SKIPPED
2025-Apr-03 02:36:09 :: [x86_64] #400 octave-dicom.git 0.5.1-alt1: build swiftly SKIPPED
2025-Apr-03 02:36:09 :: [aarch64] #400 octave-dicom.git 0.5.1-alt1: build start
2025-Apr-03 02:36:09 :: [i586] #500 octave-econometrics.git 1.1.2-alt1: build start
2025-Apr-03 02:36:09 :: [x86_64] #500 octave-econometrics.git 1.1.2-alt1: build start
2025-Apr-03 02:36:09 :: [aarch64] #400 octave-dicom.git 0.5.1-alt1: build swiftly SKIPPED
2025-Apr-03 02:36:09 :: [i586] #500 octave-econometrics.git 1.1.2-alt1: build swiftly SKIPPED
2025-Apr-03 02:36:09 :: [x86_64] #500 octave-econometrics.git 1.1.2-alt1: build swiftly SKIPPED
2025-Apr-03 02:36:09 :: [aarch64] #500 octave-econometrics.git 1.1.2-alt1: build start
2025-Apr-03 02:36:09 :: [x86_64] #600 octave-fits-1.0.7-alt4.src.rpm: build start
2025-Apr-03 02:36:09 :: [i586] #600 octave-fits-1.0.7-alt4.src.rpm: build start
2025-Apr-03 02:36:09 :: [aarch64] #500 octave-econometrics.git 1.1.2-alt1: build swiftly SKIPPED
2025-Apr-03 02:36:10 :: [x86_64] #600 octave-fits-1.0.7-alt4.src.rpm: build swiftly SKIPPED
2025-Apr-03 02:36:10 :: [i586] #600 octave-fits-1.0.7-alt4.src.rpm: build swiftly SKIPPED
2025-Apr-03 02:36:10 :: [aarch64] #600 octave-fits-1.0.7-alt4.src.rpm: build start
2025-Apr-03 02:36:10 :: [x86_64] #700 octave-general-2.1.3-alt2.src.rpm: build start
2025-Apr-03 02:36:10 :: [i586] #700 octave-general-2.1.3-alt2.src.rpm: build start
2025-Apr-03 02:36:10 :: [aarch64] #600 octave-fits-1.0.7-alt4.src.rpm: build swiftly SKIPPED
2025-Apr-03 02:36:10 :: [i586] #700 octave-general-2.1.3-alt2.src.rpm: build swiftly SKIPPED
2025-Apr-03 02:36:10 :: [x86_64] #700 octave-general-2.1.3-alt2.src.rpm: build swiftly SKIPPED
2025-Apr-03 02:36:10 :: [aarch64] #700 octave-general-2.1.3-alt2.src.rpm: build start
2025-Apr-03 02:36:10 :: [i586] #1300 octave-instrument-control-0.9.1-alt1.src.rpm: build start
2025-Apr-03 02:36:10 :: [x86_64] #1300 octave-instrument-control-0.9.1-alt1.src.rpm: build start
2025-Apr-03 02:36:10 :: [aarch64] #700 octave-general-2.1.3-alt2.src.rpm: build swiftly SKIPPED
2025-Apr-03 02:36:11 :: [aarch64] #1300 octave-instrument-control-0.9.1-alt1.src.rpm: build start
2025-Apr-03 02:36:11 :: [x86_64] #1300 octave-instrument-control-0.9.1-alt1.src.rpm: build swiftly SKIPPED
2025-Apr-03 02:36:11 :: [i586] #1300 octave-instrument-control-0.9.1-alt1.src.rpm: build swiftly SKIPPED
2025-Apr-03 02:36:11 :: [x86_64] #1400 octave-interval-3.2.1-alt2.src.rpm: build start
2025-Apr-03 02:36:11 :: [i586] #1400 octave-interval-3.2.1-alt2.src.rpm: build start
2025-Apr-03 02:36:11 :: [aarch64] #1300 octave-instrument-control-0.9.1-alt1.src.rpm: build swiftly SKIPPED
2025-Apr-03 02:36:11 :: [i586] #1400 octave-interval-3.2.1-alt2.src.rpm: build swiftly SKIPPED
2025-Apr-03 02:36:11 :: [x86_64] #1400 octave-interval-3.2.1-alt2.src.rpm: build swiftly SKIPPED
2025-Apr-03 02:36:11 :: [aarch64] #1400 octave-interval-3.2.1-alt2.src.rpm: build start
2025-Apr-03 02:36:11 :: [i586] #1500 octave-io-2.6.4-alt1.src.rpm: build start
2025-Apr-03 02:36:11 :: [x86_64] #1500 octave-io-2.6.4-alt1.src.rpm: build start
2025-Apr-03 02:36:11 :: [aarch64] #1400 octave-interval-3.2.1-alt2.src.rpm: build swiftly SKIPPED
2025-Apr-03 02:36:12 :: [i586] #1500 octave-io-2.6.4-alt1.src.rpm: build swiftly SKIPPED
2025-Apr-03 02:36:12 :: [x86_64] #1500 octave-io-2.6.4-alt1.src.rpm: build swiftly SKIPPED
2025-Apr-03 02:36:12 :: [aarch64] #1500 octave-io-2.6.4-alt1.src.rpm: build start
2025-Apr-03 02:36:12 :: [aarch64] #1500 octave-io-2.6.4-alt1.src.rpm: build swiftly SKIPPED
2025-Apr-03 02:36:12 :: [i586] #1600 octave-lssa-0.1.4-alt1.src.rpm: build start
2025-Apr-03 02:36:12 :: [x86_64] #1600 octave-lssa-0.1.4-alt1.src.rpm: build start
2025-Apr-03 02:36:12 :: [i586] #1600 octave-lssa-0.1.4-alt1.src.rpm: build swiftly SKIPPED
2025-Apr-03 02:36:12 :: [x86_64] #1600 octave-lssa-0.1.4-alt1.src.rpm: build swiftly SKIPPED
2025-Apr-03 02:36:12 :: [aarch64] #1600 octave-lssa-0.1.4-alt1.src.rpm: build start
2025-Apr-03 02:36:12 :: [aarch64] #1600 octave-lssa-0.1.4-alt1.src.rpm: build swiftly SKIPPED
2025-Apr-03 02:36:12 :: [i586] #2000 octave-mapping-1.4.2-alt1.src.rpm: build start
2025-Apr-03 02:36:12 :: [x86_64] #2000 octave-mapping-1.4.2-alt1.src.rpm: build start
2025-Apr-03 02:36:13 :: [aarch64] #2000 octave-mapping-1.4.2-alt1.src.rpm: build start
2025-Apr-03 02:36:13 :: [i586] #2000 octave-mapping-1.4.2-alt1.src.rpm: build swiftly SKIPPED
2025-Apr-03 02:36:13 :: [x86_64] #2000 octave-mapping-1.4.2-alt1.src.rpm: build swiftly SKIPPED
2025-Apr-03 02:36:13 :: [aarch64] #2000 octave-mapping-1.4.2-alt1.src.rpm: build swiftly SKIPPED
2025-Apr-03 02:36:13 :: [x86_64] #2100 octave-miscellaneous-1.3.0-alt2.src.rpm: build start
2025-Apr-03 02:36:13 :: [i586] #2100 octave-miscellaneous-1.3.0-alt2.src.rpm: build start
2025-Apr-03 02:36:13 :: [aarch64] #2100 octave-miscellaneous-1.3.0-alt2.src.rpm: build start
2025-Apr-03 02:36:13 :: [i586] #2100 octave-miscellaneous-1.3.0-alt2.src.rpm: build swiftly SKIPPED
2025-Apr-03 02:36:13 :: [x86_64] #2100 octave-miscellaneous-1.3.0-alt2.src.rpm: build swiftly SKIPPED
2025-Apr-03 02:36:13 :: [aarch64] #2100 octave-miscellaneous-1.3.0-alt2.src.rpm: build swiftly SKIPPED
2025-Apr-03 02:36:13 :: [x86_64] #2200 octave-netcdf-1.0.17-alt2.src.rpm: build start
2025-Apr-03 02:36:13 :: [i586] #2200 octave-netcdf-1.0.17-alt2.src.rpm: build start
2025-Apr-03 02:36:13 :: [aarch64] #2200 octave-netcdf-1.0.17-alt2.src.rpm: build start
2025-Apr-03 02:36:14 :: [i586] #2200 octave-netcdf-1.0.17-alt2.src.rpm: build swiftly SKIPPED
2025-Apr-03 02:36:14 :: [x86_64] #2200 octave-netcdf-1.0.17-alt2.src.rpm: build swiftly SKIPPED
2025-Apr-03 02:36:14 :: [aarch64] #2200 octave-netcdf-1.0.17-alt2.src.rpm: build swiftly SKIPPED
2025-Apr-03 02:36:14 :: [i586] #2600 octave-optiminterp-0.3.7-alt1.src.rpm: build start
2025-Apr-03 02:36:14 :: [x86_64] #2600 octave-optiminterp-0.3.7-alt1.src.rpm: build start
2025-Apr-03 02:36:14 :: [aarch64] #2600 octave-optiminterp-0.3.7-alt1.src.rpm: build start
2025-Apr-03 02:36:14 :: [i586] #2600 octave-optiminterp-0.3.7-alt1.src.rpm: build swiftly SKIPPED
2025-Apr-03 02:36:14 :: [x86_64] #2600 octave-optiminterp-0.3.7-alt1.src.rpm: build swiftly SKIPPED
2025-Apr-03 02:36:14 :: [aarch64] #2600 octave-optiminterp-0.3.7-alt1.src.rpm: build swiftly SKIPPED
2025-Apr-03 02:36:14 :: [i586] #2700 octave-quaternion.git 2.4.0-alt5: build start
2025-Apr-03 02:36:14 :: [x86_64] #2700 octave-quaternion.git 2.4.0-alt5: build start
2025-Apr-03 02:36:14 :: [aarch64] #2700 octave-quaternion.git 2.4.0-alt5: build start
2025-Apr-03 02:36:14 :: [i586] #2700 octave-quaternion.git 2.4.0-alt5: build swiftly SKIPPED
2025-Apr-03 02:36:15 :: [x86_64] #2700 octave-quaternion.git 2.4.0-alt5: build swiftly SKIPPED
2025-Apr-03 02:36:15 :: [aarch64] #2700 octave-quaternion.git 2.4.0-alt5: build swiftly SKIPPED
2025-Apr-03 02:36:15 :: [x86_64] #3100 octave-struct-1.0.18-alt1.src.rpm: build start
2025-Apr-03 02:36:15 :: [i586] #3100 octave-struct-1.0.18-alt1.src.rpm: build start
2025-Apr-03 02:36:15 :: [aarch64] #3100 octave-struct-1.0.18-alt1.src.rpm: build start
2025-Apr-03 02:36:15 :: [x86_64] #3100 octave-struct-1.0.18-alt1.src.rpm: build swiftly SKIPPED
2025-Apr-03 02:36:15 :: [i586] #3100 octave-struct-1.0.18-alt1.src.rpm: build swiftly SKIPPED
2025-Apr-03 02:36:15 :: [aarch64] #3100 octave-struct-1.0.18-alt1.src.rpm: build swiftly SKIPPED
2025-Apr-03 02:36:15 :: [i586] #3200 octave-vibes.git 0.2.0-alt5: build start
2025-Apr-03 02:36:15 :: [x86_64] #3200 octave-vibes.git 0.2.0-alt5: build start
2025-Apr-03 02:36:15 :: [aarch64] #3200 octave-vibes.git 0.2.0-alt5: build start
2025-Apr-03 02:36:15 :: [i586] #3200 octave-vibes.git 0.2.0-alt5: build swiftly SKIPPED
2025-Apr-03 02:36:15 :: [x86_64] #3200 octave-vibes.git 0.2.0-alt5: build swiftly SKIPPED
2025-Apr-03 02:36:16 :: [aarch64] #3200 octave-vibes.git 0.2.0-alt5: build swiftly SKIPPED
2025-Apr-03 02:36:16 :: [x86_64] #3300 octave-zeromq-1.5.5-alt1.src.rpm: build start
2025-Apr-03 02:36:16 :: [i586] #3300 octave-zeromq-1.5.5-alt1.src.rpm: build start
2025-Apr-03 02:36:16 :: [aarch64] #3300 octave-zeromq-1.5.5-alt1.src.rpm: build start
2025-Apr-03 02:36:16 :: [i586] #3300 octave-zeromq-1.5.5-alt1.src.rpm: build swiftly SKIPPED
2025-Apr-03 02:36:16 :: [x86_64] #3300 octave-zeromq-1.5.5-alt1.src.rpm: build swiftly SKIPPED
2025-Apr-03 02:36:16 :: [aarch64] #3300 octave-zeromq-1.5.5-alt1.src.rpm: build swiftly SKIPPED
2025-Apr-03 02:36:16 :: [x86_64] #3400 octave-control.git 4.1.1-alt1: build start
2025-Apr-03 02:36:16 :: [i586] #3400 octave-control.git 4.1.1-alt1: build start
2025-Apr-03 02:36:16 :: [aarch64] #3400 octave-control.git 4.1.1-alt1: build start
2025-Apr-03 02:36:16 :: [i586] #3400 octave-control.git 4.1.1-alt1: build swiftly SKIPPED
2025-Apr-03 02:36:16 :: [x86_64] #3400 octave-control.git 4.1.1-alt1: build swiftly SKIPPED
2025-Apr-03 02:36:17 :: [aarch64] #3400 octave-control.git 4.1.1-alt1: build swiftly SKIPPED
2025-Apr-03 02:36:17 :: [i586] #3500 octave-communications-1.2.7-alt1.src.rpm: build start
2025-Apr-03 02:36:17 :: [x86_64] #3500 octave-communications-1.2.7-alt1.src.rpm: build start
2025-Apr-03 02:36:17 :: [aarch64] #3500 octave-communications-1.2.7-alt1.src.rpm: build start
2025-Apr-03 02:36:17 :: [i586] #3500 octave-communications-1.2.7-alt1.src.rpm: build swiftly SKIPPED
2025-Apr-03 02:36:17 :: [x86_64] #3500 octave-communications-1.2.7-alt1.src.rpm: build swiftly SKIPPED
2025-Apr-03 02:36:17 :: [aarch64] #3500 octave-communications-1.2.7-alt1.src.rpm: build swiftly SKIPPED
2025-Apr-03 02:36:17 :: [i586] #3600 octave-queueing-1.2.8-alt1.src.rpm: build start
2025-Apr-03 02:36:17 :: [x86_64] #3600 octave-queueing-1.2.8-alt1.src.rpm: build start
2025-Apr-03 02:36:17 :: [aarch64] #3600 octave-queueing-1.2.8-alt1.src.rpm: build start
2025-Apr-03 02:36:17 :: [i586] #3600 octave-queueing-1.2.8-alt1.src.rpm: build swiftly SKIPPED
2025-Apr-03 02:36:17 :: [x86_64] #3600 octave-queueing-1.2.8-alt1.src.rpm: build swiftly SKIPPED
2025-Apr-03 02:36:18 :: [aarch64] #3600 octave-queueing-1.2.8-alt1.src.rpm: build swiftly SKIPPED
2025-Apr-03 02:36:18 :: [i586] #3700 octave-fuzzy-logic-toolkit-0.6.1-alt1.src.rpm: build start
2025-Apr-03 02:36:18 :: [x86_64] #3700 octave-fuzzy-logic-toolkit-0.6.1-alt1.src.rpm: build start
2025-Apr-03 02:36:18 :: [aarch64] #3700 octave-fuzzy-logic-toolkit-0.6.1-alt1.src.rpm: build start
2025-Apr-03 02:36:18 :: [i586] #3700 octave-fuzzy-logic-toolkit-0.6.1-alt1.src.rpm: build swiftly SKIPPED
2025-Apr-03 02:36:18 :: [x86_64] #3700 octave-fuzzy-logic-toolkit-0.6.1-alt1.src.rpm: build swiftly SKIPPED
2025-Apr-03 02:36:18 :: [aarch64] #3700 octave-fuzzy-logic-toolkit-0.6.1-alt1.src.rpm: build swiftly SKIPPED
2025-Apr-03 02:36:18 :: [i586] #4000 octave-level-set-0.3.0-alt6.src.rpm: build start
2025-Apr-03 02:36:18 :: [x86_64] #4000 octave-level-set-0.3.0-alt6.src.rpm: build start
2025-Apr-03 02:36:18 :: [aarch64] #4000 octave-level-set-0.3.0-alt6.src.rpm: build start
2025-Apr-03 02:36:18 :: [i586] #4000 octave-level-set-0.3.0-alt6.src.rpm: build swiftly SKIPPED
2025-Apr-03 02:36:18 :: [x86_64] #4000 octave-level-set-0.3.0-alt6.src.rpm: build swiftly SKIPPED
2025-Apr-03 02:36:19 :: [aarch64] #4000 octave-level-set-0.3.0-alt6.src.rpm: build swiftly SKIPPED
2025-Apr-03 02:36:19 :: [i586] #4100 octave-financial-0.5.3-alt2.src.rpm: build start
2025-Apr-03 02:36:19 :: [x86_64] #4100 octave-financial-0.5.3-alt2.src.rpm: build start
2025-Apr-03 02:36:19 :: [aarch64] #4100 octave-financial-0.5.3-alt2.src.rpm: build start
2025-Apr-03 02:36:19 :: [i586] #4100 octave-financial-0.5.3-alt2.src.rpm: build swiftly SKIPPED
2025-Apr-03 02:36:19 :: [x86_64] #4100 octave-financial-0.5.3-alt2.src.rpm: build swiftly SKIPPED
2025-Apr-03 02:36:19 :: [aarch64] #4100 octave-financial-0.5.3-alt2.src.rpm: build swiftly SKIPPED
2025-Apr-03 02:36:19 :: [x86_64] #4200 octave-octproj-3.0.2-alt1.src.rpm: build start
2025-Apr-03 02:36:19 :: [i586] #4200 octave-octproj-3.0.2-alt1.src.rpm: build start
2025-Apr-03 02:36:19 :: [aarch64] #4200 octave-octproj-3.0.2-alt1.src.rpm: build start
2025-Apr-03 02:36:19 :: [i586] #4200 octave-octproj-3.0.2-alt1.src.rpm: build swiftly SKIPPED
2025-Apr-03 02:36:19 :: [x86_64] #4200 octave-octproj-3.0.2-alt1.src.rpm: build swiftly SKIPPED
2025-Apr-03 02:36:20 :: [aarch64] #4200 octave-octproj-3.0.2-alt1.src.rpm: build swiftly SKIPPED
2025-Apr-03 02:36:20 :: [i586] #4400 octave-nurbs-1.4.4-alt1.src.rpm: build start
2025-Apr-03 02:36:20 :: [x86_64] #4400 octave-nurbs-1.4.4-alt1.src.rpm: build start
2025-Apr-03 02:36:20 :: [aarch64] #4400 octave-nurbs-1.4.4-alt1.src.rpm: build start
2025-Apr-03 02:36:20 :: [i586] #4400 octave-nurbs-1.4.4-alt1.src.rpm: build swiftly SKIPPED
2025-Apr-03 02:36:20 :: [x86_64] #4400 octave-nurbs-1.4.4-alt1.src.rpm: build swiftly SKIPPED
2025-Apr-03 02:36:20 :: [aarch64] #4400 octave-nurbs-1.4.4-alt1.src.rpm: build swiftly SKIPPED
2025-Apr-03 02:36:20 :: [x86_64] #4500 octave-msh-1.0.12-alt1.src.rpm: build start
2025-Apr-03 02:36:20 :: [i586] #4500 octave-msh-1.0.12-alt1.src.rpm: build start
2025-Apr-03 02:36:20 :: [aarch64] #4500 octave-msh-1.0.12-alt1.src.rpm: build start
2025-Apr-03 02:36:20 :: [i586] #4500 octave-msh-1.0.12-alt1.src.rpm: build swiftly SKIPPED
2025-Apr-03 02:36:20 :: [x86_64] #4500 octave-msh-1.0.12-alt1.src.rpm: build swiftly SKIPPED
2025-Apr-03 02:36:21 :: [aarch64] #4500 octave-msh-1.0.12-alt1.src.rpm: build swiftly SKIPPED
2025-Apr-03 02:36:21 :: [x86_64] #4600 octave-image-2.16.0-alt1.src.rpm: build start
2025-Apr-03 02:36:21 :: [i586] #4600 octave-image-2.16.0-alt1.src.rpm: build start
2025-Apr-03 02:36:21 :: [aarch64] #4600 octave-image-2.16.0-alt1.src.rpm: build start
2025-Apr-03 02:36:21 :: [i586] #4600 octave-image-2.16.0-alt1.src.rpm: build swiftly SKIPPED
2025-Apr-03 02:36:21 :: [x86_64] #4600 octave-image-2.16.0-alt1.src.rpm: build swiftly SKIPPED
2025-Apr-03 02:36:21 :: [aarch64] #4600 octave-image-2.16.0-alt1.src.rpm: build swiftly SKIPPED
2025-Apr-03 02:36:21 :: [x86_64] #4700 octave-image-acquisition-0.3.0-alt1.src.rpm: build start
2025-Apr-03 02:36:21 :: [i586] #4700 octave-image-acquisition-0.3.0-alt1.src.rpm: build start
2025-Apr-03 02:36:21 :: [aarch64] #4700 octave-image-acquisition-0.3.0-alt1.src.rpm: build start
2025-Apr-03 02:36:21 :: [x86_64] #4700 octave-image-acquisition-0.3.0-alt1.src.rpm: build swiftly SKIPPED
2025-Apr-03 02:36:21 :: [i586] #4700 octave-image-acquisition-0.3.0-alt1.src.rpm: build swiftly SKIPPED
2025-Apr-03 02:36:21 :: [aarch64] #4700 octave-image-acquisition-0.3.0-alt1.src.rpm: build swiftly SKIPPED
2025-Apr-03 02:36:22 :: [x86_64] #5000 octave-octclip-2.0.3-alt1.src.rpm: build start
2025-Apr-03 02:36:22 :: [i586] #5000 octave-octclip-2.0.3-alt1.src.rpm: build start
2025-Apr-03 02:36:22 :: [aarch64] #5000 octave-octclip-2.0.3-alt1.src.rpm: build start
2025-Apr-03 02:36:22 :: [x86_64] #5000 octave-octclip-2.0.3-alt1.src.rpm: build swiftly SKIPPED
2025-Apr-03 02:36:22 :: [i586] #5000 octave-octclip-2.0.3-alt1.src.rpm: build swiftly SKIPPED
2025-Apr-03 02:36:22 :: [aarch64] #5000 octave-octclip-2.0.3-alt1.src.rpm: build swiftly SKIPPED
2025-Apr-03 02:36:22 :: [i586] #5100 octave-geometry-4.1.0-alt1.src.rpm: build start
2025-Apr-03 02:36:22 :: [x86_64] #5100 octave-geometry-4.1.0-alt1.src.rpm: build start
2025-Apr-03 02:36:22 :: [aarch64] #5100 octave-geometry-4.1.0-alt1.src.rpm: build start
2025-Apr-03 02:36:22 :: [x86_64] #5100 octave-geometry-4.1.0-alt1.src.rpm: build swiftly SKIPPED
2025-Apr-03 02:36:22 :: [i586] #5100 octave-geometry-4.1.0-alt1.src.rpm: build swiftly SKIPPED
2025-Apr-03 02:36:22 :: [aarch64] #5100 octave-geometry-4.1.0-alt1.src.rpm: build swiftly SKIPPED
2025-Apr-03 02:36:23 :: [i586] #5200 octave-gsl-2.1.1-alt3.src.rpm: build start
2025-Apr-03 02:36:23 :: [x86_64] #5200 octave-gsl-2.1.1-alt3.src.rpm: build start
2025-Apr-03 02:36:23 :: [aarch64] #5200 octave-gsl-2.1.1-alt3.src.rpm: build start
2025-Apr-03 02:36:23 :: [i586] #5200 octave-gsl-2.1.1-alt3.src.rpm: build swiftly SKIPPED
2025-Apr-03 02:36:23 :: [x86_64] #5200 octave-gsl-2.1.1-alt3.src.rpm: build swiftly SKIPPED
2025-Apr-03 02:36:23 :: [aarch64] #5200 octave-gsl-2.1.1-alt3.src.rpm: build swiftly SKIPPED
2025-Apr-03 02:36:23 :: [i586] #5300 octave-ocl-1.2.3-alt1.src.rpm: build start
2025-Apr-03 02:36:23 :: [x86_64] #5300 octave-ocl-1.2.3-alt1.src.rpm: build start
2025-Apr-03 02:36:23 :: [aarch64] #5300 octave-ocl-1.2.3-alt1.src.rpm: build start
2025-Apr-03 02:36:23 :: [i586] #5300 octave-ocl-1.2.3-alt1.src.rpm: build swiftly SKIPPED
2025-Apr-03 02:36:23 :: [x86_64] #5300 octave-ocl-1.2.3-alt1.src.rpm: build swiftly SKIPPED
2025-Apr-03 02:36:23 :: [aarch64] #5300 octave-ocl-1.2.3-alt1.src.rpm: build swiftly SKIPPED
2025-Apr-03 02:36:24 :: [x86_64] #5400 octave-signal-1.4.6-alt1.src.rpm: build start
2025-Apr-03 02:36:24 :: [i586] #5400 octave-signal-1.4.6-alt1.src.rpm: build start
2025-Apr-03 02:36:24 :: [aarch64] #5400 octave-signal-1.4.6-alt1.src.rpm: build start
2025-Apr-03 02:36:24 :: [x86_64] #5400 octave-signal-1.4.6-alt1.src.rpm: build swiftly SKIPPED
2025-Apr-03 02:36:24 :: [i586] #5400 octave-signal-1.4.6-alt1.src.rpm: build swiftly SKIPPED
2025-Apr-03 02:36:24 :: [aarch64] #5400 octave-signal-1.4.6-alt1.src.rpm: build swiftly SKIPPED
2025-Apr-03 02:36:24 :: [i586] #5500 octave-optim-1.6.2-alt2.src.rpm: build start
2025-Apr-03 02:36:24 :: [x86_64] #5500 octave-optim-1.6.2-alt2.src.rpm: build start
2025-Apr-03 02:36:24 :: [aarch64] #5500 octave-optim-1.6.2-alt2.src.rpm: build start
2025-Apr-03 02:36:24 :: [i586] #5500 octave-optim-1.6.2-alt2.src.rpm: build swiftly SKIPPED
2025-Apr-03 02:36:24 :: [x86_64] #5500 octave-optim-1.6.2-alt2.src.rpm: build swiftly SKIPPED
2025-Apr-03 02:36:24 :: [aarch64] #5500 octave-optim-1.6.2-alt2.src.rpm: build swiftly SKIPPED
2025-Apr-03 02:36:25 :: [i586] #5600 octave-sockets-1.4.1-alt1.src.rpm: build start
2025-Apr-03 02:36:25 :: [x86_64] #5600 octave-sockets-1.4.1-alt1.src.rpm: build start
2025-Apr-03 02:36:25 :: [aarch64] #5600 octave-sockets-1.4.1-alt1.src.rpm: build start
2025-Apr-03 02:36:25 :: [i586] #5600 octave-sockets-1.4.1-alt1.src.rpm: build swiftly SKIPPED
2025-Apr-03 02:36:25 :: [x86_64] #5600 octave-sockets-1.4.1-alt1.src.rpm: build swiftly SKIPPED
2025-Apr-03 02:36:25 :: [aarch64] #5600 octave-sockets-1.4.1-alt1.src.rpm: build swiftly SKIPPED
2025-Apr-03 02:36:50 :: #200: octave.git 10.1.0-alt1: build check OK
2025-Apr-03 02:36:59 :: #300: octave-audio-2.0.5-alt2.src.rpm: build check OK
x86_64/srpm/octave-dicom-0.5.1-alt1.src.rpm: The use of such a license name is ambiguous: GPL
x86_64/srpm/octave-dicom-0.5.1-alt1.src.rpm: license not found in '/usr/share/license' directory: version
x86_64/srpm/octave-dicom-0.5.1-alt1.src.rpm: license not found in '/usr/share/license' directory: 3
x86_64/srpm/octave-dicom-0.5.1-alt1.src.rpm: license not found in '/usr/share/license' directory: later
x86_64/rpms/octave-dicom-debuginfo-0.5.1-alt1.x86_64.rpm: The use of such a license name is ambiguous: GPL
x86_64/rpms/octave-dicom-debuginfo-0.5.1-alt1.x86_64.rpm: license not found in '/usr/share/license' directory: version
x86_64/rpms/octave-dicom-debuginfo-0.5.1-alt1.x86_64.rpm: license not found in '/usr/share/license' directory: 3
x86_64/rpms/octave-dicom-debuginfo-0.5.1-alt1.x86_64.rpm: license not found in '/usr/share/license' directory: later
x86_64/rpms/octave-dicom-0.5.1-alt1.x86_64.rpm: The use of such a license name is ambiguous: GPL
x86_64/rpms/octave-dicom-0.5.1-alt1.x86_64.rpm: license not found in '/usr/share/license' directory: version
x86_64/rpms/octave-dicom-0.5.1-alt1.x86_64.rpm: license not found in '/usr/share/license' directory: 3
x86_64/rpms/octave-dicom-0.5.1-alt1.x86_64.rpm: license not found in '/usr/share/license' directory: later
i586/srpm/octave-dicom-0.5.1-alt1.src.rpm: The use of such a license name is ambiguous: GPL
i586/srpm/octave-dicom-0.5.1-alt1.src.rpm: license not found in '/usr/share/license' directory: version
i586/srpm/octave-dicom-0.5.1-alt1.src.rpm: license not found in '/usr/share/license' directory: 3
i586/srpm/octave-dicom-0.5.1-alt1.src.rpm: license not found in '/usr/share/license' directory: later
i586/rpms/octave-dicom-0.5.1-alt1.i586.rpm: The use of such a license name is ambiguous: GPL
i586/rpms/octave-dicom-0.5.1-alt1.i586.rpm: license not found in '/usr/share/license' directory: version
i586/rpms/octave-dicom-0.5.1-alt1.i586.rpm: license not found in '/usr/share/license' directory: 3
i586/rpms/octave-dicom-0.5.1-alt1.i586.rpm: license not found in '/usr/share/license' directory: later
i586/rpms/octave-dicom-debuginfo-0.5.1-alt1.i586.rpm: The use of such a license name is ambiguous: GPL
i586/rpms/octave-dicom-debuginfo-0.5.1-alt1.i586.rpm: license not found in '/usr/share/license' directory: version
i586/rpms/octave-dicom-debuginfo-0.5.1-alt1.i586.rpm: license not found in '/usr/share/license' directory: 3
i586/rpms/octave-dicom-debuginfo-0.5.1-alt1.i586.rpm: license not found in '/usr/share/license' directory: later
aarch64/srpm/octave-dicom-0.5.1-alt1.src.rpm: The use of such a license name is ambiguous: GPL
aarch64/srpm/octave-dicom-0.5.1-alt1.src.rpm: license not found in '/usr/share/license' directory: version
aarch64/srpm/octave-dicom-0.5.1-alt1.src.rpm: license not found in '/usr/share/license' directory: 3
aarch64/srpm/octave-dicom-0.5.1-alt1.src.rpm: license not found in '/usr/share/license' directory: later
aarch64/rpms/octave-dicom-0.5.1-alt1.aarch64.rpm: The use of such a license name is ambiguous: GPL
aarch64/rpms/octave-dicom-0.5.1-alt1.aarch64.rpm: license not found in '/usr/share/license' directory: version
aarch64/rpms/octave-dicom-0.5.1-alt1.aarch64.rpm: license not found in '/usr/share/license' directory: 3
aarch64/rpms/octave-dicom-0.5.1-alt1.aarch64.rpm: license not found in '/usr/share/license' directory: later
aarch64/rpms/octave-dicom-debuginfo-0.5.1-alt1.aarch64.rpm: The use of such a license name is ambiguous: GPL
aarch64/rpms/octave-dicom-debuginfo-0.5.1-alt1.aarch64.rpm: license not found in '/usr/share/license' directory: version
aarch64/rpms/octave-dicom-debuginfo-0.5.1-alt1.aarch64.rpm: license not found in '/usr/share/license' directory: 3
aarch64/rpms/octave-dicom-debuginfo-0.5.1-alt1.aarch64.rpm: license not found in '/usr/share/license' directory: later
2025-Apr-03 02:37:09 :: #400: octave-dicom.git 0.5.1-alt1: build check OK
2025-Apr-03 02:37:19 :: #500: octave-econometrics.git 1.1.2-alt1: build check OK
2025-Apr-03 02:37:29 :: #600: octave-fits-1.0.7-alt4.src.rpm: build check OK
x86_64/srpm/octave-general-2.1.3-alt2.src.rpm: bad symbols in the license tag: ,,
x86_64/rpms/octave-general-debuginfo-2.1.3-alt2.x86_64.rpm: bad symbols in the license tag: ,,
x86_64/rpms/octave-general-2.1.3-alt2.x86_64.rpm: bad symbols in the license tag: ,,
i586/srpm/octave-general-2.1.3-alt2.src.rpm: bad symbols in the license tag: ,,
i586/rpms/octave-general-debuginfo-2.1.3-alt2.i586.rpm: bad symbols in the license tag: ,,
i586/rpms/octave-general-2.1.3-alt2.i586.rpm: bad symbols in the license tag: ,,
aarch64/srpm/octave-general-2.1.3-alt2.src.rpm: bad symbols in the license tag: ,,
aarch64/rpms/octave-general-2.1.3-alt2.aarch64.rpm: bad symbols in the license tag: ,,
aarch64/rpms/octave-general-debuginfo-2.1.3-alt2.aarch64.rpm: bad symbols in the license tag: ,,
2025-Apr-03 02:37:39 :: #700: octave-general-2.1.3-alt2.src.rpm: build check OK
2025-Apr-03 02:37:49 :: #1300: octave-instrument-control-0.9.1-alt1.src.rpm: build check OK
2025-Apr-03 02:38:00 :: #1400: octave-interval-3.2.1-alt2.src.rpm: build check OK
x86_64/srpm/octave-io-2.6.4-alt1.src.rpm: bad symbols in the license tag: ,
x86_64/rpms/octave-io-debuginfo-2.6.4-alt1.x86_64.rpm: bad symbols in the license tag: ,
x86_64/rpms/octave-io-2.6.4-alt1.x86_64.rpm: bad symbols in the license tag: ,
i586/srpm/octave-io-2.6.4-alt1.src.rpm: bad symbols in the license tag: ,
i586/rpms/octave-io-2.6.4-alt1.i586.rpm: bad symbols in the license tag: ,
i586/rpms/octave-io-debuginfo-2.6.4-alt1.i586.rpm: bad symbols in the license tag: ,
aarch64/srpm/octave-io-2.6.4-alt1.src.rpm: bad symbols in the license tag: ,
aarch64/rpms/octave-io-debuginfo-2.6.4-alt1.aarch64.rpm: bad symbols in the license tag: ,
aarch64/rpms/octave-io-2.6.4-alt1.aarch64.rpm: bad symbols in the license tag: ,
2025-Apr-03 02:38:10 :: #1500: octave-io-2.6.4-alt1.src.rpm: build check OK
2025-Apr-03 02:38:20 :: #1600: octave-lssa-0.1.4-alt1.src.rpm: build check OK
2025-Apr-03 02:38:30 :: #2000: octave-mapping-1.4.2-alt1.src.rpm: build check OK
2025-Apr-03 02:38:40 :: #2100: octave-miscellaneous-1.3.0-alt2.src.rpm: build check OK
2025-Apr-03 02:38:50 :: #2200: octave-netcdf-1.0.17-alt2.src.rpm: build check OK
2025-Apr-03 02:39:00 :: #2600: octave-optiminterp-0.3.7-alt1.src.rpm: build check OK
2025-Apr-03 02:39:10 :: #2700: octave-quaternion.git 2.4.0-alt5: build check OK
2025-Apr-03 02:39:20 :: #3100: octave-struct-1.0.18-alt1.src.rpm: build check OK
x86_64/srpm/octave-vibes-0.2.0-alt5.src.rpm: bad symbols in the license tag: ,
x86_64/rpms/octave-vibes-0.2.0-alt5.x86_64.rpm: bad symbols in the license tag: ,
x86_64/rpms/octave-vibes-debuginfo-0.2.0-alt5.x86_64.rpm: bad symbols in the license tag: ,
i586/srpm/octave-vibes-0.2.0-alt5.src.rpm: bad symbols in the license tag: ,
i586/rpms/octave-vibes-debuginfo-0.2.0-alt5.i586.rpm: bad symbols in the license tag: ,
i586/rpms/octave-vibes-0.2.0-alt5.i586.rpm: bad symbols in the license tag: ,
aarch64/srpm/octave-vibes-0.2.0-alt5.src.rpm: bad symbols in the license tag: ,
aarch64/rpms/octave-vibes-debuginfo-0.2.0-alt5.aarch64.rpm: bad symbols in the license tag: ,
aarch64/rpms/octave-vibes-0.2.0-alt5.aarch64.rpm: bad symbols in the license tag: ,
2025-Apr-03 02:39:29 :: #3200: octave-vibes.git 0.2.0-alt5: build check OK
2025-Apr-03 02:39:39 :: #3300: octave-zeromq-1.5.5-alt1.src.rpm: build check OK
2025-Apr-03 02:39:49 :: #3400: octave-control.git 4.1.1-alt1: build check OK
2025-Apr-03 02:39:59 :: #3500: octave-communications-1.2.7-alt1.src.rpm: build check OK
2025-Apr-03 02:40:06 :: #3600: octave-queueing-1.2.8-alt1.src.rpm: build check OK
2025-Apr-03 02:40:15 :: #3700: octave-fuzzy-logic-toolkit-0.6.1-alt1.src.rpm: build check OK
2025-Apr-03 02:40:25 :: #4000: octave-level-set-0.3.0-alt6.src.rpm: build check OK
2025-Apr-03 02:40:32 :: #4100: octave-financial-0.5.3-alt2.src.rpm: build check OK
2025-Apr-03 02:40:40 :: #4200: octave-octproj-3.0.2-alt1.src.rpm: build check OK
2025-Apr-03 02:40:50 :: #4400: octave-nurbs-1.4.4-alt1.src.rpm: build check OK
2025-Apr-03 02:40:57 :: #4500: octave-msh-1.0.12-alt1.src.rpm: build check OK
2025-Apr-03 02:41:07 :: #4600: octave-image-2.16.0-alt1.src.rpm: build check OK
2025-Apr-03 02:41:16 :: #4700: octave-image-acquisition-0.3.0-alt1.src.rpm: build check OK
x86_64/srpm/octave-octclip-2.0.3-alt1.src.rpm: bad symbols in the license tag: ,
x86_64/rpms/octave-octclip-2.0.3-alt1.x86_64.rpm: bad symbols in the license tag: ,
i586/srpm/octave-octclip-2.0.3-alt1.src.rpm: bad symbols in the license tag: ,
i586/rpms/octave-octclip-2.0.3-alt1.i586.rpm: bad symbols in the license tag: ,
aarch64/srpm/octave-octclip-2.0.3-alt1.src.rpm: bad symbols in the license tag: ,
aarch64/rpms/octave-octclip-2.0.3-alt1.aarch64.rpm: bad symbols in the license tag: ,
2025-Apr-03 02:41:24 :: #5000: octave-octclip-2.0.3-alt1.src.rpm: build check OK
x86_64/srpm/octave-geometry-4.1.0-alt1.src.rpm: bad symbols in the license tag: ,,
x86_64/rpms/octave-geometry-4.1.0-alt1.x86_64.rpm: bad symbols in the license tag: ,,
x86_64/rpms/octave-geometry-debuginfo-4.1.0-alt1.x86_64.rpm: bad symbols in the license tag: ,,
i586/srpm/octave-geometry-4.1.0-alt1.src.rpm: bad symbols in the license tag: ,,
i586/rpms/octave-geometry-debuginfo-4.1.0-alt1.i586.rpm: bad symbols in the license tag: ,,
i586/rpms/octave-geometry-4.1.0-alt1.i586.rpm: bad symbols in the license tag: ,,
aarch64/srpm/octave-geometry-4.1.0-alt1.src.rpm: bad symbols in the license tag: ,,
aarch64/rpms/octave-geometry-4.1.0-alt1.aarch64.rpm: bad symbols in the license tag: ,,
aarch64/rpms/octave-geometry-debuginfo-4.1.0-alt1.aarch64.rpm: bad symbols in the license tag: ,,
2025-Apr-03 02:41:33 :: #5100: octave-geometry-4.1.0-alt1.src.rpm: build check OK
2025-Apr-03 02:41:43 :: #5200: octave-gsl-2.1.1-alt3.src.rpm: build check OK
2025-Apr-03 02:41:53 :: #5300: octave-ocl-1.2.3-alt1.src.rpm: build check OK
x86_64/srpm/octave-signal-1.4.6-alt1.src.rpm: bad symbols in the license tag: ,
x86_64/rpms/octave-signal-1.4.6-alt1.x86_64.rpm: bad symbols in the license tag: ,
x86_64/rpms/octave-signal-debuginfo-1.4.6-alt1.x86_64.rpm: bad symbols in the license tag: ,
i586/srpm/octave-signal-1.4.6-alt1.src.rpm: bad symbols in the license tag: ,
i586/rpms/octave-signal-debuginfo-1.4.6-alt1.i586.rpm: bad symbols in the license tag: ,
i586/rpms/octave-signal-1.4.6-alt1.i586.rpm: bad symbols in the license tag: ,
aarch64/srpm/octave-signal-1.4.6-alt1.src.rpm: bad symbols in the license tag: ,
aarch64/rpms/octave-signal-1.4.6-alt1.aarch64.rpm: bad symbols in the license tag: ,
aarch64/rpms/octave-signal-debuginfo-1.4.6-alt1.aarch64.rpm: bad symbols in the license tag: ,
2025-Apr-03 02:42:03 :: #5400: octave-signal-1.4.6-alt1.src.rpm: build check OK
x86_64/srpm/octave-optim-1.6.2-alt2.src.rpm: bad symbols in the license tag: ,,
x86_64/rpms/octave-optim-1.6.2-alt2.x86_64.rpm: bad symbols in the license tag: ,,
x86_64/rpms/octave-optim-debuginfo-1.6.2-alt2.x86_64.rpm: bad symbols in the license tag: ,,
i586/srpm/octave-optim-1.6.2-alt2.src.rpm: bad symbols in the license tag: ,,
i586/rpms/octave-optim-1.6.2-alt2.i586.rpm: bad symbols in the license tag: ,,
i586/rpms/octave-optim-debuginfo-1.6.2-alt2.i586.rpm: bad symbols in the license tag: ,,
aarch64/srpm/octave-optim-1.6.2-alt2.src.rpm: bad symbols in the license tag: ,,
aarch64/rpms/octave-optim-debuginfo-1.6.2-alt2.aarch64.rpm: bad symbols in the license tag: ,,
aarch64/rpms/octave-optim-1.6.2-alt2.aarch64.rpm: bad symbols in the license tag: ,,
2025-Apr-03 02:42:13 :: #5500: octave-optim-1.6.2-alt2.src.rpm: build check OK
2025-Apr-03 02:42:23 :: #5600: octave-sockets-1.4.1-alt1.src.rpm: build check OK
2025-Apr-03 02:42:26 :: build check OK
2025-Apr-03 02:44:33 :: noarch check OK
2025-Apr-03 02:44:35 :: plan: src +36 -37 =20068, aarch64 +64 -68 =34853, i586 +64 -68 =33709, noarch +5 -4 =21230, x86_64 +64 -68 =35662
#200 octave 9.4.0-alt1 -> 10.1.0-alt1
Sun Mar 30 2025 Andrey Cherepanov <cas@altlinux> 10.1.0-alt1
- New version.
#5100 octave-geometry 4.0.0-alt3 -> 4.1.0-alt1
Mon Mar 31 2025 Andrey Cherepanov <cas@altlinux> 4.1.0-alt1
- New version.
#4600 octave-image 2.14.0-alt1 -> 2.16.0-alt1
Mon Mar 31 2025 Andrey Cherepanov <cas@altlinux> 2.16.0-alt1
- new version
#4700 octave-image-acquisition 0.2.2-alt6 -> 0.3.0-alt1
Mon Mar 31 2025 Andrey Cherepanov <cas@altlinux> 0.3.0-alt1
- new version
#4500 octave-msh 1.0.10-alt3 -> 1.0.12-alt1
Mon Mar 31 2025 Andrey Cherepanov <cas@altlinux> 1.0.12-alt1
- new version
#4400 octave-nurbs 1.4.3-alt1 -> 1.4.4-alt1
Mon Mar 31 2025 Andrey Cherepanov <cas@altlinux> 1.4.4-alt1
- new version
#5300 octave-ocl 1.2.2-alt1 -> 1.2.3-alt1
Mon Mar 31 2025 Andrey Cherepanov <cas@altlinux> 1.2.3-alt1
- new version
#5000 octave-octclip 2.0.1-alt1 -> 2.0.3-alt1
Mon Mar 31 2025 Andrey Cherepanov <cas@altlinux> 2.0.3-alt1
- new version
#4200 octave-octproj 2.0.1-alt1 -> 3.0.2-alt1
Mon Mar 31 2025 Andrey Cherepanov <cas@altlinux> 3.0.2-alt1
- new version
#5500 octave-optim 1.6.2-alt1 -> 1:1.6.2-alt2
Tue Apr 01 2025 Andrey Cherepanov <cas@altlinux> 1:1.6.2-alt2
- rebuild with octave 10.x
#5400 octave-signal 1.4.5-alt1 -> 2:1.4.6-alt1
Mon Mar 31 2025 Andrey Cherepanov <cas@altlinux> 2:1.4.6-alt1
- new version
2025-Apr-03 02:45:19 :: patched apt indices
2025-Apr-03 02:45:28 :: created next repo
2025-Apr-03 02:45:37 :: duplicate provides check OK
2025-Apr-03 02:46:16 :: dependencies check OK
2025-Apr-03 02:46:47 :: [x86_64 i586 aarch64] ELF symbols check OK
x86_64: octave=10.1.0-alt1 post-install unowned files:
/usr/share/icons/hicolor/1024x1024
/usr/share/icons/hicolor/1024x1024/apps
/usr/share/icons/hicolor/128x128
/usr/share/icons/hicolor/128x128/apps
/usr/share/icons/hicolor/22x22
/usr/share/icons/hicolor/22x22/apps
/usr/share/icons/hicolor/24x24
/usr/share/icons/hicolor/24x24/apps
/usr/share/icons/hicolor/256x256
/usr/share/icons/hicolor/256x256/apps
/usr/share/icons/hicolor/512x512
/usr/share/icons/hicolor/512x512/apps
/usr/share/icons/hicolor/64x64
/usr/share/icons/hicolor/64x64/apps
/usr/share/icons/hicolor/scalable
/usr/share/icons/hicolor/scalable/apps
/usr/share/metainfo
2025-Apr-03 02:47:17 :: [x86_64] #200 octave: install check OK
i586: octave=10.1.0-alt1 post-install unowned files:
/usr/share/icons/hicolor/1024x1024
/usr/share/icons/hicolor/1024x1024/apps
/usr/share/icons/hicolor/128x128
/usr/share/icons/hicolor/128x128/apps
/usr/share/icons/hicolor/22x22
/usr/share/icons/hicolor/22x22/apps
/usr/share/icons/hicolor/24x24
/usr/share/icons/hicolor/24x24/apps
/usr/share/icons/hicolor/256x256
/usr/share/icons/hicolor/256x256/apps
/usr/share/icons/hicolor/512x512
/usr/share/icons/hicolor/512x512/apps
/usr/share/icons/hicolor/64x64
/usr/share/icons/hicolor/64x64/apps
/usr/share/icons/hicolor/scalable
/usr/share/icons/hicolor/scalable/apps
/usr/share/metainfo
2025-Apr-03 02:47:19 :: [i586] #200 octave: install check OK
aarch64: octave=10.1.0-alt1 post-install unowned files:
/usr/share/icons/hicolor/1024x1024
/usr/share/icons/hicolor/1024x1024/apps
/usr/share/icons/hicolor/128x128
/usr/share/icons/hicolor/128x128/apps
/usr/share/icons/hicolor/22x22
/usr/share/icons/hicolor/22x22/apps
/usr/share/icons/hicolor/24x24
/usr/share/icons/hicolor/24x24/apps
/usr/share/icons/hicolor/256x256
/usr/share/icons/hicolor/256x256/apps
/usr/share/icons/hicolor/512x512
/usr/share/icons/hicolor/512x512/apps
/usr/share/icons/hicolor/64x64
/usr/share/icons/hicolor/64x64/apps
/usr/share/icons/hicolor/scalable
/usr/share/icons/hicolor/scalable/apps
/usr/share/metainfo
2025-Apr-03 02:47:31 :: [aarch64] #200 octave: install check OK
2025-Apr-03 02:47:41 :: [x86_64] #300 octave-audio: install check OK
2025-Apr-03 02:47:44 :: [i586] #300 octave-audio: install check OK
2025-Apr-03 02:48:03 :: [aarch64] #300 octave-audio: install check OK
2025-Apr-03 02:48:16 :: [x86_64] #300 octave-audio-debuginfo: install check OK
2025-Apr-03 02:48:18 :: [i586] #300 octave-audio-debuginfo: install check OK
2025-Apr-03 02:48:41 :: [x86_64] #3500 octave-communications: install check OK
2025-Apr-03 02:48:42 :: [i586] #3500 octave-communications: install check OK
2025-Apr-03 02:48:51 :: [aarch64] #300 octave-audio-debuginfo: install check OK
2025-Apr-03 02:49:07 :: [x86_64] #3500 octave-communications-debuginfo: install check OK
2025-Apr-03 02:49:08 :: [i586] #3500 octave-communications-debuginfo: install check OK
2025-Apr-03 02:49:24 :: [aarch64] #3500 octave-communications: install check OK
2025-Apr-03 02:49:32 :: [i586] #3400 octave-control: install check OK
2025-Apr-03 02:49:32 :: [x86_64] #3400 octave-control: install check OK
2025-Apr-03 02:49:58 :: [aarch64] #3500 octave-communications-debuginfo: install check OK
2025-Apr-03 02:49:58 :: [i586] #3400 octave-control-debuginfo: install check OK
2025-Apr-03 02:49:59 :: [x86_64] #3400 octave-control-debuginfo: install check OK
2025-Apr-03 02:50:30 :: [aarch64] #3400 octave-control: install check OK
2025-Apr-03 02:51:04 :: [i586] #200 octave-debuginfo: install check OK
2025-Apr-03 02:51:04 :: [aarch64] #3400 octave-control-debuginfo: install check OK
2025-Apr-03 02:51:10 :: [x86_64] #200 octave-debuginfo: install check OK
2025-Apr-03 02:51:29 :: [i586] #200 octave-devel: install check OK
2025-Apr-03 02:51:34 :: [x86_64] #200 octave-devel: install check OK
2025-Apr-03 02:52:34 :: [aarch64] #200 octave-debuginfo: install check OK
2025-Apr-03 02:52:35 :: [i586] #200 octave-devel-debuginfo: install check OK
2025-Apr-03 02:52:39 :: [x86_64] #200 octave-devel-debuginfo: install check OK
2025-Apr-03 02:53:00 :: [i586] #400 octave-dicom: install check OK
2025-Apr-03 02:53:05 :: [x86_64] #400 octave-dicom: install check OK
2025-Apr-03 02:53:06 :: [aarch64] #200 octave-devel: install check OK
2025-Apr-03 02:53:27 :: [i586] #400 octave-dicom-debuginfo: install check OK
2025-Apr-03 02:53:32 :: [x86_64] #400 octave-dicom-debuginfo: install check OK
2025-Apr-03 02:53:35 :: [i586] #200 octave-doc: install check OK
2025-Apr-03 02:53:40 :: [x86_64] #200 octave-doc: install check OK
2025-Apr-03 02:54:00 :: [i586] #500 octave-econometrics: install check OK
2025-Apr-03 02:54:04 :: [x86_64] #500 octave-econometrics: install check OK
2025-Apr-03 02:54:28 :: [i586] #500 octave-econometrics-debuginfo: install check OK
2025-Apr-03 02:54:30 :: [x86_64] #500 octave-econometrics-debuginfo: install check OK
2025-Apr-03 02:54:35 :: [aarch64] #200 octave-devel-debuginfo: install check OK
2025-Apr-03 02:54:53 :: [x86_64] #4100 octave-financial: install check OK
2025-Apr-03 02:54:55 :: [i586] #4100 octave-financial: install check OK
2025-Apr-03 02:55:08 :: [aarch64] #400 octave-dicom: install check OK
2025-Apr-03 02:55:15 :: [x86_64] #600 octave-fits: install check OK
2025-Apr-03 02:55:20 :: [i586] #600 octave-fits: install check OK
2025-Apr-03 02:55:39 :: [x86_64] #600 octave-fits-debuginfo: install check OK
2025-Apr-03 02:55:44 :: [aarch64] #400 octave-dicom-debuginfo: install check OK
2025-Apr-03 02:55:45 :: [i586] #600 octave-fits-debuginfo: install check OK
2025-Apr-03 02:55:55 :: [aarch64] #200 octave-doc: install check OK
2025-Apr-03 02:56:02 :: [x86_64] #3700 octave-fuzzy-logic-toolkit: install check OK
2025-Apr-03 02:56:10 :: [i586] #3700 octave-fuzzy-logic-toolkit: install check OK
2025-Apr-03 02:56:26 :: [x86_64] #700 octave-general: install check OK
2025-Apr-03 02:56:27 :: [aarch64] #500 octave-econometrics: install check OK
2025-Apr-03 02:56:35 :: [i586] #700 octave-general: install check OK
2025-Apr-03 02:56:52 :: [x86_64] #700 octave-general-debuginfo: install check OK
2025-Apr-03 02:57:00 :: [i586] #700 octave-general-debuginfo: install check OK
2025-Apr-03 02:57:00 :: [aarch64] #500 octave-econometrics-debuginfo: install check OK
2025-Apr-03 02:57:17 :: [x86_64] #5100 octave-geometry: install check OK
2025-Apr-03 02:57:24 :: [i586] #5100 octave-geometry: install check OK
2025-Apr-03 02:57:32 :: [aarch64] #4100 octave-financial: install check OK
2025-Apr-03 02:58:04 :: [aarch64] #600 octave-fits: install check OK
2025-Apr-03 02:58:23 :: [x86_64] #5100 octave-geometry-debuginfo: install check OK
2025-Apr-03 02:58:29 :: [i586] #5100 octave-geometry-debuginfo: install check OK
2025-Apr-03 02:58:37 :: [aarch64] #600 octave-fits-debuginfo: install check OK
2025-Apr-03 02:58:48 :: [x86_64] #5200 octave-gsl: install check OK
2025-Apr-03 02:58:55 :: [i586] #5200 octave-gsl: install check OK
2025-Apr-03 02:59:09 :: [aarch64] #3700 octave-fuzzy-logic-toolkit: install check OK
2025-Apr-03 02:59:12 :: [x86_64] #5200 octave-gsl-debuginfo: install check OK
2025-Apr-03 02:59:22 :: [i586] #5200 octave-gsl-debuginfo: install check OK
2025-Apr-03 02:59:35 :: [x86_64] #4600 octave-image: install check OK
2025-Apr-03 02:59:40 :: [aarch64] #700 octave-general: install check OK
2025-Apr-03 02:59:47 :: [i586] #4600 octave-image: install check OK
2025-Apr-03 02:59:59 :: [x86_64] #4700 octave-image-acquisition: install check OK
2025-Apr-03 03:00:12 :: [i586] #4700 octave-image-acquisition: install check OK
2025-Apr-03 03:00:13 :: [aarch64] #700 octave-general-debuginfo: install check OK
2025-Apr-03 03:00:27 :: [x86_64] #4700 octave-image-acquisition-debuginfo: install check OK
2025-Apr-03 03:00:43 :: [i586] #4700 octave-image-acquisition-debuginfo: install check OK
2025-Apr-03 03:00:45 :: [aarch64] #5100 octave-geometry: install check OK
2025-Apr-03 03:00:54 :: [x86_64] #4600 octave-image-debuginfo: install check OK
2025-Apr-03 03:01:12 :: [i586] #4600 octave-image-debuginfo: install check OK
2025-Apr-03 03:01:19 :: [x86_64] #1300 octave-instrument-control: install check OK
2025-Apr-03 03:01:39 :: [i586] #1300 octave-instrument-control: install check OK
2025-Apr-03 03:01:46 :: [x86_64] #1300 octave-instrument-control-debuginfo: install check OK
2025-Apr-03 03:02:10 :: [x86_64] #1400 octave-interval: install check OK
2025-Apr-03 03:02:11 :: [i586] #1300 octave-instrument-control-debuginfo: install check OK
2025-Apr-03 03:02:14 :: [aarch64] #5100 octave-geometry-debuginfo: install check OK
2025-Apr-03 03:02:35 :: [x86_64] #1400 octave-interval-debuginfo: install check OK
2025-Apr-03 03:02:37 :: [i586] #1400 octave-interval: install check OK
2025-Apr-03 03:02:47 :: [aarch64] #5200 octave-gsl: install check OK
2025-Apr-03 03:03:00 :: [x86_64] #1500 octave-io: install check OK
2025-Apr-03 03:03:04 :: [i586] #1400 octave-interval-debuginfo: install check OK
2025-Apr-03 03:03:20 :: [aarch64] #5200 octave-gsl-debuginfo: install check OK
2025-Apr-03 03:03:25 :: [x86_64] #1500 octave-io-debuginfo: install check OK
2025-Apr-03 03:03:30 :: [i586] #1500 octave-io: install check OK
2025-Apr-03 03:03:51 :: [x86_64] #4000 octave-level-set: install check OK
2025-Apr-03 03:03:52 :: [aarch64] #4600 octave-image: install check OK
2025-Apr-03 03:03:56 :: [i586] #1500 octave-io-debuginfo: install check OK
2025-Apr-03 03:04:16 :: [x86_64] #4000 octave-level-set-debuginfo: install check OK
2025-Apr-03 03:04:21 :: [i586] #4000 octave-level-set: install check OK
2025-Apr-03 03:04:25 :: [aarch64] #4700 octave-image-acquisition: install check OK
2025-Apr-03 03:04:41 :: [x86_64] #1600 octave-lssa: install check OK
2025-Apr-03 03:04:47 :: [i586] #4000 octave-level-set-debuginfo: install check OK
2025-Apr-03 03:05:01 :: [aarch64] #4700 octave-image-acquisition-debuginfo: install check OK
2025-Apr-03 03:05:06 :: [x86_64] #1600 octave-lssa-debuginfo: install check OK
2025-Apr-03 03:05:12 :: [i586] #1600 octave-lssa: install check OK
2025-Apr-03 03:05:35 :: [aarch64] #4600 octave-image-debuginfo: install check OK
2025-Apr-03 03:05:35 :: [x86_64] #2000 octave-mapping: install check OK
2025-Apr-03 03:05:38 :: [i586] #1600 octave-lssa-debuginfo: install check OK
2025-Apr-03 03:06:06 :: [i586] #2000 octave-mapping: install check OK
2025-Apr-03 03:06:07 :: [aarch64] #1300 octave-instrument-control: install check OK
2025-Apr-03 03:06:30 :: [x86_64] #2000 octave-mapping-debuginfo: install check OK
2025-Apr-03 03:06:44 :: [aarch64] #1300 octave-instrument-control-debuginfo: install check OK
2025-Apr-03 03:06:58 :: [i586] #2000 octave-mapping-debuginfo: install check OK
2025-Apr-03 03:06:59 :: [x86_64] #2100 octave-miscellaneous: install check OK
2025-Apr-03 03:07:16 :: [aarch64] #1400 octave-interval: install check OK
2025-Apr-03 03:07:24 :: [i586] #2100 octave-miscellaneous: install check OK
2025-Apr-03 03:07:25 :: [x86_64] #2100 octave-miscellaneous-debuginfo: install check OK
2025-Apr-03 03:07:49 :: [x86_64] #4500 octave-msh: install check OK
2025-Apr-03 03:07:49 :: [aarch64] #1400 octave-interval-debuginfo: install check OK
2025-Apr-03 03:07:49 :: [i586] #2100 octave-miscellaneous-debuginfo: install check OK
2025-Apr-03 03:08:14 :: [x86_64] #2200 octave-netcdf: install check OK
2025-Apr-03 03:08:14 :: [i586] #4500 octave-msh: install check OK
2025-Apr-03 03:08:21 :: [aarch64] #1500 octave-io: install check OK
2025-Apr-03 03:08:38 :: [i586] #2200 octave-netcdf: install check OK
2025-Apr-03 03:08:43 :: [x86_64] #2200 octave-netcdf-debuginfo: install check OK
2025-Apr-03 03:08:54 :: [aarch64] #1500 octave-io-debuginfo: install check OK
2025-Apr-03 03:09:07 :: [i586] #2200 octave-netcdf-debuginfo: install check OK
2025-Apr-03 03:09:07 :: [x86_64] #4400 octave-nurbs: install check OK
2025-Apr-03 03:09:26 :: [aarch64] #4000 octave-level-set: install check OK
2025-Apr-03 03:09:32 :: [i586] #4400 octave-nurbs: install check OK
2025-Apr-03 03:09:33 :: [x86_64] #4400 octave-nurbs-debuginfo: install check OK
2025-Apr-03 03:09:57 :: [x86_64] #5300 octave-ocl: install check OK
2025-Apr-03 03:09:58 :: [i586] #4400 octave-nurbs-debuginfo: install check OK
2025-Apr-03 03:09:59 :: [aarch64] #4000 octave-level-set-debuginfo: install check OK
2025-Apr-03 03:10:22 :: [i586] #5300 octave-ocl: install check OK
2025-Apr-03 03:10:23 :: [x86_64] #5300 octave-ocl-debuginfo: install check OK
2025-Apr-03 03:10:31 :: [aarch64] #1600 octave-lssa: install check OK
2025-Apr-03 03:10:48 :: [x86_64] #5000 octave-octclip: install check OK
2025-Apr-03 03:10:49 :: [i586] #5300 octave-ocl-debuginfo: install check OK
2025-Apr-03 03:11:04 :: [aarch64] #1600 octave-lssa-debuginfo: install check OK
2025-Apr-03 03:11:14 :: [i586] #5000 octave-octclip: install check OK
2025-Apr-03 03:11:14 :: [x86_64] #4200 octave-octproj: install check OK
2025-Apr-03 03:11:36 :: [x86_64] #5500 octave-optim: install check OK
2025-Apr-03 03:11:38 :: [aarch64] #2000 octave-mapping: install check OK
2025-Apr-03 03:11:39 :: [i586] #4200 octave-octproj: install check OK
2025-Apr-03 03:12:03 :: [x86_64] #5500 octave-optim-debuginfo: install check OK
2025-Apr-03 03:12:04 :: [i586] #5500 octave-optim: install check OK
2025-Apr-03 03:12:27 :: [x86_64] #2600 octave-optiminterp: install check OK
2025-Apr-03 03:12:31 :: [i586] #5500 octave-optim-debuginfo: install check OK
2025-Apr-03 03:12:41 :: [aarch64] #2000 octave-mapping-debuginfo: install check OK
2025-Apr-03 03:12:54 :: [x86_64] #2600 octave-optiminterp-debuginfo: install check OK
2025-Apr-03 03:12:56 :: [i586] #2600 octave-optiminterp: install check OK
2025-Apr-03 03:13:14 :: [aarch64] #2100 octave-miscellaneous: install check OK
2025-Apr-03 03:13:23 :: [i586] #2600 octave-optiminterp-debuginfo: install check OK
2025-Apr-03 03:13:27 :: [x86_64] #2700 octave-quaternion: install check OK
2025-Apr-03 03:13:47 :: [aarch64] #2100 octave-miscellaneous-debuginfo: install check OK
2025-Apr-03 03:13:47 :: [i586] #2700 octave-quaternion: install check OK
2025-Apr-03 03:13:54 :: [x86_64] #2700 octave-quaternion-debuginfo: install check OK
2025-Apr-03 03:14:12 :: [i586] #2700 octave-quaternion-debuginfo: install check OK
2025-Apr-03 03:14:18 :: [aarch64] #4500 octave-msh: install check OK
2025-Apr-03 03:14:22 :: [x86_64] #3600 octave-queueing: install check OK
2025-Apr-03 03:14:36 :: [i586] #3600 octave-queueing: install check OK
2025-Apr-03 03:14:49 :: [x86_64] #5400 octave-signal: install check OK
2025-Apr-03 03:14:50 :: [aarch64] #2200 octave-netcdf: install check OK
2025-Apr-03 03:15:00 :: [i586] #5400 octave-signal: install check OK
2025-Apr-03 03:15:13 :: [x86_64] #5400 octave-signal-debuginfo: install check OK
2025-Apr-03 03:15:27 :: [i586] #5400 octave-signal-debuginfo: install check OK
2025-Apr-03 03:15:28 :: [aarch64] #2200 octave-netcdf-debuginfo: install check OK
2025-Apr-03 03:15:37 :: [x86_64] #5600 octave-sockets: install check OK
2025-Apr-03 03:15:52 :: [i586] #5600 octave-sockets: install check OK
2025-Apr-03 03:16:00 :: [aarch64] #4400 octave-nurbs: install check OK
2025-Apr-03 03:16:02 :: [x86_64] #5600 octave-sockets-debuginfo: install check OK
2025-Apr-03 03:16:18 :: [i586] #5600 octave-sockets-debuginfo: install check OK
2025-Apr-03 03:16:26 :: [x86_64] #3100 octave-struct: install check OK
2025-Apr-03 03:16:33 :: [aarch64] #4400 octave-nurbs-debuginfo: install check OK
2025-Apr-03 03:16:44 :: [i586] #3100 octave-struct: install check OK
2025-Apr-03 03:16:50 :: [x86_64] #3100 octave-struct-debuginfo: install check OK
2025-Apr-03 03:17:05 :: [aarch64] #5300 octave-ocl: install check OK
2025-Apr-03 03:17:10 :: [i586] #3100 octave-struct-debuginfo: install check OK
2025-Apr-03 03:17:15 :: [x86_64] #3200 octave-vibes: install check OK
2025-Apr-03 03:17:37 :: [i586] #3200 octave-vibes: install check OK
2025-Apr-03 03:17:38 :: [aarch64] #5300 octave-ocl-debuginfo: install check OK
2025-Apr-03 03:17:40 :: [x86_64] #3200 octave-vibes-debuginfo: install check OK
2025-Apr-03 03:18:02 :: [i586] #3200 octave-vibes-debuginfo: install check OK
2025-Apr-03 03:18:05 :: [x86_64] #3300 octave-zeromq: install check OK
2025-Apr-03 03:18:10 :: [aarch64] #5000 octave-octclip: install check OK
2025-Apr-03 03:18:28 :: [i586] #3300 octave-zeromq: install check OK
2025-Apr-03 03:18:32 :: [x86_64] #3300 octave-zeromq-debuginfo: install check OK
2025-Apr-03 03:18:43 :: [aarch64] #4200 octave-octproj: install check OK
2025-Apr-03 03:18:54 :: [i586] #3300 octave-zeromq-debuginfo: install check OK
2025-Apr-03 03:19:16 :: [aarch64] #5500 octave-optim: install check OK
2025-Apr-03 03:19:51 :: [aarch64] #5500 octave-optim-debuginfo: install check OK
2025-Apr-03 03:20:23 :: [aarch64] #2600 octave-optiminterp: install check OK
2025-Apr-03 03:20:57 :: [aarch64] #2600 octave-optiminterp-debuginfo: install check OK
2025-Apr-03 03:21:29 :: [aarch64] #2700 octave-quaternion: install check OK
2025-Apr-03 03:22:02 :: [aarch64] #2700 octave-quaternion-debuginfo: install check OK
2025-Apr-03 03:22:34 :: [aarch64] #3600 octave-queueing: install check OK
2025-Apr-03 03:23:06 :: [aarch64] #5400 octave-signal: install check OK
2025-Apr-03 03:23:40 :: [aarch64] #5400 octave-signal-debuginfo: install check OK
2025-Apr-03 03:24:11 :: [aarch64] #5600 octave-sockets: install check OK
2025-Apr-03 03:24:43 :: [aarch64] #5600 octave-sockets-debuginfo: install check OK
2025-Apr-03 03:25:15 :: [aarch64] #3100 octave-struct: install check OK
2025-Apr-03 03:25:48 :: [aarch64] #3100 octave-struct-debuginfo: install check OK
2025-Apr-03 03:26:20 :: [aarch64] #3200 octave-vibes: install check OK
2025-Apr-03 03:26:52 :: [aarch64] #3200 octave-vibes-debuginfo: install check OK
2025-Apr-03 03:27:24 :: [aarch64] #3300 octave-zeromq: install check OK
2025-Apr-03 03:27:58 :: [aarch64] #3300 octave-zeromq-debuginfo: install check OK
2025-Apr-03 03:28:01 :: [x86_64-i586] plan: #2 +2 -2 =11598
2025-Apr-03 03:28:34 :: [x86_64-i586] arepo build OK
2025-Apr-03 03:28:50 :: [x86_64-i586] generated apt indices
2025-Apr-03 03:28:52 :: [x86_64-i586] created next repo
2025-Apr-03 03:29:03 :: [x86_64-i586] dependencies check OK
2025-Apr-03 03:29:06 :: gears inheritance check OK
2025-Apr-03 03:29:07 :: srpm inheritance check OK
girar-check-perms: access to octave ALLOWED for cas: project leader
check-subtask-perms: #200: octave: allowed for cas
girar-check-perms: access to octave-audio ALLOWED for cas: project leader welcomes random builders
check-subtask-perms: #300: octave-audio: allowed for cas
girar-check-perms: access to octave-dicom ALLOWED for cas: project leader welcomes random builders
check-subtask-perms: #400: octave-dicom: allowed for cas
girar-check-perms: access to octave-econometrics ALLOWED for cas: project leader welcomes random builders
check-subtask-perms: #500: octave-econometrics: allowed for cas
girar-check-perms: access to octave-fits ALLOWED for cas: project leader welcomes random builders
check-subtask-perms: #600: octave-fits: allowed for cas
girar-check-perms: access to octave-general ALLOWED for cas: project leader welcomes random builders
check-subtask-perms: #700: octave-general: allowed for cas
girar-check-perms: access to octave-instrument-control ALLOWED for cas: project leader welcomes random builders
check-subtask-perms: #1300: octave-instrument-control: allowed for cas
girar-check-perms: access to octave-interval ALLOWED for cas: project leader welcomes random builders
check-subtask-perms: #1400: octave-interval: allowed for cas
girar-check-perms: access to octave-io ALLOWED for cas: project leader welcomes random builders
check-subtask-perms: #1500: octave-io: allowed for cas
girar-check-perms: access to octave-lssa ALLOWED for cas: project leader welcomes random builders
check-subtask-perms: #1600: octave-lssa: allowed for cas
girar-check-perms: access to octave-mapping ALLOWED for cas: project leader welcomes random builders
check-subtask-perms: #2000: octave-mapping: allowed for cas
girar-check-perms: access to octave-miscellaneous ALLOWED for cas: project leader welcomes random builders
check-subtask-perms: #2100: octave-miscellaneous: allowed for cas
girar-check-perms: access to octave-netcdf ALLOWED for cas: project leader welcomes random builders
check-subtask-perms: #2200: octave-netcdf: allowed for cas
girar-check-perms: access to octave-optiminterp ALLOWED for cas: project leader welcomes random builders
check-subtask-perms: #2600: octave-optiminterp: allowed for cas
girar-check-perms: access to octave-quaternion ALLOWED for cas: project leader welcomes random builders
check-subtask-perms: #2700: octave-quaternion: allowed for cas
girar-check-perms: access to octave-struct ALLOWED for cas: project leader welcomes random builders
check-subtask-perms: #3100: octave-struct: allowed for cas
girar-check-perms: access to octave-vibes ALLOWED for cas: project leader welcomes random builders
check-subtask-perms: #3200: octave-vibes: allowed for cas
girar-check-perms: access to octave-zeromq ALLOWED for cas: project leader welcomes random builders
check-subtask-perms: #3300: octave-zeromq: allowed for cas
girar-check-perms: access to octave-control ALLOWED for cas: project leader welcomes random builders
check-subtask-perms: #3400: octave-control: allowed for cas
girar-check-perms: access to octave-communications ALLOWED for cas: project leader welcomes random builders
check-subtask-perms: #3500: octave-communications: allowed for cas
girar-check-perms: access to octave-queueing ALLOWED for cas: project leader welcomes random builders
check-subtask-perms: #3600: octave-queueing: allowed for cas
girar-check-perms: access to octave-fuzzy-logic-toolkit ALLOWED for cas: project leader welcomes random builders
check-subtask-perms: #3700: octave-fuzzy-logic-toolkit: allowed for cas
girar-check-perms: access to octave-level-set ALLOWED for cas: project leader welcomes random builders
check-subtask-perms: #4000: octave-level-set: allowed for cas
girar-check-perms: access to octave-financial ALLOWED for cas: project leader welcomes random builders
check-subtask-perms: #4100: octave-financial: allowed for cas
girar-check-perms: access to octave-octproj ALLOWED for cas: project leader welcomes random builders
check-subtask-perms: #4200: octave-octproj: allowed for cas
girar-check-perms: access to octave-nurbs ALLOWED for cas: project leader welcomes random builders
check-subtask-perms: #4400: octave-nurbs: allowed for cas
girar-check-perms: access to octave-msh ALLOWED for cas: project leader welcomes random builders
check-subtask-perms: #4500: octave-msh: allowed for cas
girar-check-perms: access to octave-image ALLOWED for cas: project leader welcomes random builders
check-subtask-perms: #4600: octave-image: allowed for cas
girar-check-perms: access to octave-image-acquisition ALLOWED for cas: project leader welcomes random builders
check-subtask-perms: #4700: octave-image-acquisition: allowed for cas
girar-check-perms: access to octave-octclip ALLOWED for cas: project leader welcomes random builders
check-subtask-perms: #5000: octave-octclip: allowed for cas
girar-check-perms: access to octave-geometry ALLOWED for cas: project leader welcomes random builders
check-subtask-perms: #5100: octave-geometry: allowed for cas
girar-check-perms: access to octave-gsl ALLOWED for cas: project leader welcomes random builders
check-subtask-perms: #5200: octave-gsl: allowed for cas
girar-check-perms: access to octave-ocl ALLOWED for cas: project leader welcomes random builders
check-subtask-perms: #5300: octave-ocl: allowed for cas
girar-check-perms: access to octave-signal ALLOWED for cas: project leader welcomes random builders
check-subtask-perms: #5400: octave-signal: allowed for cas
girar-check-perms: access to octave-optim ALLOWED for cas: project leader welcomes random builders
check-subtask-perms: #5500: octave-optim: allowed for cas
girar-check-perms: access to octave-sockets ALLOWED for cas: project leader welcomes random builders
check-subtask-perms: #5600: octave-sockets: allowed for cas
girar-check-perms: access to octave-ltfat ALLOWED for cas: project leader welcomes random builders
check-subtask-perms: #5700: octave-ltfat: allowed for cas
2025-Apr-03 03:29:09 :: acl check OK
2025-Apr-03 03:29:31 :: created contents_index files
2025-Apr-03 03:29:41 :: created hash files: aarch64 i586 noarch src x86_64-i586 x86_64
2025-Apr-03 03:29:45 :: task #379725 for sisyphus SWEPT
^ permalink raw reply [flat|nested] 18+ messages in thread
* [#379725] DONE (try 18) octave.git=10.1.0-alt1 srpm=octave-audio-2.0.5-alt2.src.rpm ...
2025-03-30 19:09 [#379725] [test-only] FAILED octave.git=10.1.0-alt1 Girar awaiter (cas)
` (15 preceding siblings ...)
2025-04-03 3:29 ` [#379725] SWEPT (try 17) " Girar awaiter (cas)
@ 2025-04-03 9:29 ` Girar pender (cas)
16 siblings, 0 replies; 18+ messages in thread
From: Girar pender (cas) @ 2025-04-03 9:29 UTC (permalink / raw)
To: Andrey Cherepanov
Cc: Paul Wolneykien, Igor Vlasenko, sisyphus-incominger,
girar-builder-sisyphus, Igor Vlasenko (qa)
https://git.altlinux.org/tasks/archive/done/_370/379725/logs/events.18.3.log
https://packages.altlinux.org/tasks/379725
subtask name aarch64 i586 x86_64
#200 octave 24:44 12:55 13:01
#300 octave-audio 2:05 1:18 1:14
#400 octave-dicom 2:33 1:38 1:29
#500 octave-econometrics 1:16 51 49
#600 octave-fits 1:16 50 47
#700 octave-general 1:57 1:14 1:08
#1300 octave-instrument-control 5:05 2:40 2:39
#1400 octave-interval 1:49 1:15 1:07
#1500 octave-io 1:36 1:03 59
#1600 octave-lssa 1:16 51 49
#2000 octave-mapping 2:35 1:39 1:31
#2100 octave-miscellaneous 1:42 1:06 1:02
#2200 octave-netcdf 1:29 59 55
#2600 octave-optiminterp 1:28 56 54
#2700 octave-quaternion 1:14 50 48
#3100 octave-struct 1:40 1:05 1:02
#3200 octave-vibes 1:16 52 49
#3300 octave-zeromq 2:38 1:35 1:30
#3400 octave-control 3:23 2:11 1:54
#3500 octave-communications 3:29 2:10 1:57
#3600 octave-queueing 1:35 1:01 56
#3700 octave-fuzzy-logic-toolkit 1:27 56 52
#4000 octave-level-set 1:48 1:11 1:07
#4100 octave-financial 1:39 1:04 59
#4200 octave-octproj 1:35 1:02 58
#4400 octave-nurbs 1:38 1:04 1:01
#4500 octave-msh 1:07 44 41
#4600 octave-image 3:31 2:13 2:01
#4700 octave-image-acquisition 1:30 59 56
#5000 octave-octclip 1:16 50 47
#5100 octave-geometry 1:39 1:04 59
#5200 octave-gsl 1:58 1:16 1:09
#5300 octave-ocl 2:02 1:16 1:13
#5400 octave-signal 3:02 1:53 1:44
#5500 octave-optim 3:00 1:33 1:28
#5600 octave-sockets 1:25 54 50
2025-Apr-03 06:55:44 :: task #379725 for sisyphus resumed by cas:
2025-Apr-03 06:55:44 :: message: New_version_of_octave
#100 removed
#200 build 10.1.0-alt1 from /people/cas/packages/octave.git fetched at 2025-Mar-31 05:38:18
#300 build octave-audio-2.0.5-alt2.src.rpm from sisyphus
#400 build 0.5.1-alt1 from /gears/o/octave-dicom.git fetched at 2025-Mar-31 08:33:43 from sisyphus
#500 build 1.1.2-alt1 from /gears/o/octave-econometrics.git fetched at 2025-Mar-31 08:33:43 from sisyphus
#600 build octave-fits-1.0.7-alt4.src.rpm from sisyphus
#700 build octave-general-2.1.3-alt2.src.rpm from sisyphus
#740 removed
#1000 removed
#1100 removed
#1200 removed
#1300 build octave-instrument-control-0.9.1-alt1.src.rpm from sisyphus
#1400 build octave-interval-3.2.1-alt2.src.rpm from sisyphus
#1500 build octave-io-2.6.4-alt1.src.rpm from sisyphus
#1600 build octave-lssa-0.1.4-alt1.src.rpm from sisyphus
#1700 removed
#2000 build octave-mapping-1.4.2-alt1.src.rpm from sisyphus
#2100 build octave-miscellaneous-1.3.0-alt2.src.rpm from sisyphus
#2200 build octave-netcdf-1.0.17-alt2.src.rpm from sisyphus
#2300 removed
#2400 removed
#2500 removed
#2600 build octave-optiminterp-0.3.7-alt1.src.rpm from sisyphus
#2700 build 2.4.0-alt5 from /gears/o/octave-quaternion.git fetched at 2025-Mar-31 08:34:01 from sisyphus
#3000 removed
#3100 build octave-struct-1.0.18-alt1.src.rpm from sisyphus
#3200 build 0.2.0-alt5 from /gears/o/octave-vibes.git fetched at 2025-Mar-31 08:34:04 from sisyphus
#3300 build octave-zeromq-1.5.5-alt1.src.rpm from sisyphus
#3400 build 4.1.1-alt1 from /gears/o/octave-control.git fetched at 2025-Mar-31 08:34:08 from sisyphus
#3500 build octave-communications-1.2.7-alt1.src.rpm from sisyphus
#3600 build octave-queueing-1.2.8-alt1.src.rpm from sisyphus
#3700 build octave-fuzzy-logic-toolkit-0.6.1-alt1.src.rpm from sisyphus
#4000 build octave-level-set-0.3.0-alt6.src.rpm from sisyphus
#4100 build octave-financial-0.5.3-alt2.src.rpm from sisyphus
#4200 build octave-octproj-3.0.2-alt1.src.rpm
#4300 removed
#4400 build octave-nurbs-1.4.4-alt1.src.rpm
#4500 build octave-msh-1.0.12-alt1.src.rpm
#4600 build octave-image-2.16.0-alt1.src.rpm
#4700 build octave-image-acquisition-0.3.0-alt1.src.rpm
#5000 build octave-octclip-2.0.3-alt1.src.rpm
#5100 build octave-geometry-4.1.0-alt1.src.rpm
#5200 build octave-gsl-2.1.1-alt3.src.rpm from sisyphus
#5300 build octave-ocl-1.2.3-alt1.src.rpm
#5400 build octave-signal-1.4.6-alt1.src.rpm
#5500 build octave-optim-1.6.2-alt2.src.rpm
#5600 build octave-sockets-1.4.1-alt1.src.rpm from sisyphus
#5700 delete octave-ltfat
2025-Apr-03 06:55:45 :: created build repo
2025-Apr-03 06:55:46 :: [x86_64] #200 octave.git 10.1.0-alt1: build start
2025-Apr-03 06:55:46 :: [i586] #200 octave.git 10.1.0-alt1: build start
2025-Apr-03 06:55:46 :: [aarch64] #200 octave.git 10.1.0-alt1: build start
2025-Apr-03 07:08:41 :: [i586] #200 octave.git 10.1.0-alt1: build OK
2025-Apr-03 07:08:41 :: [i586] #300 octave-audio-2.0.5-alt2.src.rpm: build start
2025-Apr-03 07:08:47 :: [x86_64] #200 octave.git 10.1.0-alt1: build OK
2025-Apr-03 07:08:47 :: [x86_64] #300 octave-audio-2.0.5-alt2.src.rpm: build start
2025-Apr-03 07:09:59 :: [i586] #300 octave-audio-2.0.5-alt2.src.rpm: build OK
2025-Apr-03 07:09:59 :: [i586] #400 octave-dicom.git 0.5.1-alt1: build start
2025-Apr-03 07:10:01 :: [x86_64] #300 octave-audio-2.0.5-alt2.src.rpm: build OK
2025-Apr-03 07:10:02 :: [x86_64] #400 octave-dicom.git 0.5.1-alt1: build start
2025-Apr-03 07:11:31 :: [x86_64] #400 octave-dicom.git 0.5.1-alt1: build OK
2025-Apr-03 07:11:37 :: [i586] #400 octave-dicom.git 0.5.1-alt1: build OK
2025-Apr-03 07:11:55 :: [x86_64] #500 octave-econometrics.git 1.1.2-alt1: build start
2025-Apr-03 07:12:05 :: [i586] #500 octave-econometrics.git 1.1.2-alt1: build start
2025-Apr-03 07:12:44 :: [x86_64] #500 octave-econometrics.git 1.1.2-alt1: build OK
2025-Apr-03 07:12:56 :: [i586] #500 octave-econometrics.git 1.1.2-alt1: build OK
2025-Apr-03 07:12:59 :: [x86_64] #600 octave-fits-1.0.7-alt4.src.rpm: build start
2025-Apr-03 07:12:59 :: [i586] #600 octave-fits-1.0.7-alt4.src.rpm: build start
2025-Apr-03 07:13:46 :: [x86_64] #600 octave-fits-1.0.7-alt4.src.rpm: build OK
2025-Apr-03 07:13:46 :: [x86_64] #700 octave-general-2.1.3-alt2.src.rpm: build start
2025-Apr-03 07:13:49 :: [i586] #600 octave-fits-1.0.7-alt4.src.rpm: build OK
2025-Apr-03 07:13:49 :: [i586] #700 octave-general-2.1.3-alt2.src.rpm: build start
2025-Apr-03 07:14:54 :: [x86_64] #700 octave-general-2.1.3-alt2.src.rpm: build OK
2025-Apr-03 07:14:55 :: [x86_64] #1300 octave-instrument-control-0.9.1-alt1.src.rpm: build start
2025-Apr-03 07:15:03 :: [i586] #700 octave-general-2.1.3-alt2.src.rpm: build OK
2025-Apr-03 07:15:03 :: [i586] #1300 octave-instrument-control-0.9.1-alt1.src.rpm: build start
2025-Apr-03 07:17:34 :: [x86_64] #1300 octave-instrument-control-0.9.1-alt1.src.rpm: build OK
2025-Apr-03 07:17:34 :: [x86_64] #1400 octave-interval-3.2.1-alt2.src.rpm: build start
2025-Apr-03 07:17:43 :: [i586] #1300 octave-instrument-control-0.9.1-alt1.src.rpm: build OK
2025-Apr-03 07:17:43 :: [i586] #1400 octave-interval-3.2.1-alt2.src.rpm: build start
2025-Apr-03 07:18:41 :: [x86_64] #1400 octave-interval-3.2.1-alt2.src.rpm: build OK
2025-Apr-03 07:18:41 :: [x86_64] #1500 octave-io-2.6.4-alt1.src.rpm: build start
2025-Apr-03 07:18:58 :: [i586] #1400 octave-interval-3.2.1-alt2.src.rpm: build OK
2025-Apr-03 07:18:58 :: [i586] #1500 octave-io-2.6.4-alt1.src.rpm: build start
2025-Apr-03 07:19:40 :: [x86_64] #1500 octave-io-2.6.4-alt1.src.rpm: build OK
2025-Apr-03 07:19:40 :: [x86_64] #1600 octave-lssa-0.1.4-alt1.src.rpm: build start
2025-Apr-03 07:20:01 :: [i586] #1500 octave-io-2.6.4-alt1.src.rpm: build OK
2025-Apr-03 07:20:02 :: [i586] #1600 octave-lssa-0.1.4-alt1.src.rpm: build start
2025-Apr-03 07:20:29 :: [x86_64] #1600 octave-lssa-0.1.4-alt1.src.rpm: build OK
2025-Apr-03 07:20:29 :: [x86_64] #2000 octave-mapping-1.4.2-alt1.src.rpm: build start
2025-Apr-03 07:20:30 :: [aarch64] #200 octave.git 10.1.0-alt1: build OK
2025-Apr-03 07:20:30 :: [aarch64] #300 octave-audio-2.0.5-alt2.src.rpm: build start
2025-Apr-03 07:20:53 :: [i586] #1600 octave-lssa-0.1.4-alt1.src.rpm: build OK
2025-Apr-03 07:20:54 :: [i586] #2000 octave-mapping-1.4.2-alt1.src.rpm: build start
2025-Apr-03 07:22:00 :: [x86_64] #2000 octave-mapping-1.4.2-alt1.src.rpm: build OK
2025-Apr-03 07:22:00 :: [x86_64] #2100 octave-miscellaneous-1.3.0-alt2.src.rpm: build start
2025-Apr-03 07:22:33 :: [i586] #2000 octave-mapping-1.4.2-alt1.src.rpm: build OK
2025-Apr-03 07:22:33 :: [i586] #2100 octave-miscellaneous-1.3.0-alt2.src.rpm: build start
2025-Apr-03 07:22:35 :: [aarch64] #300 octave-audio-2.0.5-alt2.src.rpm: build OK
2025-Apr-03 07:22:35 :: [aarch64] #400 octave-dicom.git 0.5.1-alt1: build start
2025-Apr-03 07:23:02 :: [x86_64] #2100 octave-miscellaneous-1.3.0-alt2.src.rpm: build OK
2025-Apr-03 07:23:03 :: [x86_64] #2200 octave-netcdf-1.0.17-alt2.src.rpm: build start
2025-Apr-03 07:23:39 :: [i586] #2100 octave-miscellaneous-1.3.0-alt2.src.rpm: build OK
2025-Apr-03 07:23:40 :: [i586] #2200 octave-netcdf-1.0.17-alt2.src.rpm: build start
2025-Apr-03 07:23:58 :: [x86_64] #2200 octave-netcdf-1.0.17-alt2.src.rpm: build OK
2025-Apr-03 07:23:58 :: [x86_64] #2600 octave-optiminterp-0.3.7-alt1.src.rpm: build start
2025-Apr-03 07:24:39 :: [i586] #2200 octave-netcdf-1.0.17-alt2.src.rpm: build OK
2025-Apr-03 07:24:40 :: [i586] #2600 octave-optiminterp-0.3.7-alt1.src.rpm: build start
2025-Apr-03 07:24:52 :: [x86_64] #2600 octave-optiminterp-0.3.7-alt1.src.rpm: build OK
2025-Apr-03 07:24:53 :: [x86_64] #2700 octave-quaternion.git 2.4.0-alt5: build start
2025-Apr-03 07:25:08 :: [aarch64] #400 octave-dicom.git 0.5.1-alt1: build OK
2025-Apr-03 07:25:08 :: [aarch64] #500 octave-econometrics.git 1.1.2-alt1: build start
2025-Apr-03 07:25:36 :: [i586] #2600 octave-optiminterp-0.3.7-alt1.src.rpm: build OK
2025-Apr-03 07:25:37 :: [i586] #2700 octave-quaternion.git 2.4.0-alt5: build start
2025-Apr-03 07:25:41 :: [x86_64] #2700 octave-quaternion.git 2.4.0-alt5: build OK
2025-Apr-03 07:25:41 :: [x86_64] #3100 octave-struct-1.0.18-alt1.src.rpm: build start
2025-Apr-03 07:26:24 :: [aarch64] #500 octave-econometrics.git 1.1.2-alt1: build OK
2025-Apr-03 07:26:25 :: [aarch64] #600 octave-fits-1.0.7-alt4.src.rpm: build start
2025-Apr-03 07:26:27 :: [i586] #2700 octave-quaternion.git 2.4.0-alt5: build OK
2025-Apr-03 07:26:27 :: [i586] #3100 octave-struct-1.0.18-alt1.src.rpm: build start
2025-Apr-03 07:26:43 :: [x86_64] #3100 octave-struct-1.0.18-alt1.src.rpm: build OK
2025-Apr-03 07:26:43 :: [x86_64] #3200 octave-vibes.git 0.2.0-alt5: build start
2025-Apr-03 07:27:32 :: [x86_64] #3200 octave-vibes.git 0.2.0-alt5: build OK
2025-Apr-03 07:27:32 :: [x86_64] #3300 octave-zeromq-1.5.5-alt1.src.rpm: build start
2025-Apr-03 07:27:32 :: [i586] #3100 octave-struct-1.0.18-alt1.src.rpm: build OK
2025-Apr-03 07:27:32 :: [i586] #3200 octave-vibes.git 0.2.0-alt5: build start
2025-Apr-03 07:27:41 :: [aarch64] #600 octave-fits-1.0.7-alt4.src.rpm: build OK
2025-Apr-03 07:27:41 :: [aarch64] #700 octave-general-2.1.3-alt2.src.rpm: build start
2025-Apr-03 07:28:24 :: [i586] #3200 octave-vibes.git 0.2.0-alt5: build OK
2025-Apr-03 07:28:24 :: [i586] #3300 octave-zeromq-1.5.5-alt1.src.rpm: build start
2025-Apr-03 07:29:02 :: [x86_64] #3300 octave-zeromq-1.5.5-alt1.src.rpm: build OK
2025-Apr-03 07:29:02 :: [x86_64] #3400 octave-control.git 4.1.1-alt1: build start
2025-Apr-03 07:29:38 :: [aarch64] #700 octave-general-2.1.3-alt2.src.rpm: build OK
2025-Apr-03 07:29:38 :: [aarch64] #1300 octave-instrument-control-0.9.1-alt1.src.rpm: build start
2025-Apr-03 07:29:59 :: [i586] #3300 octave-zeromq-1.5.5-alt1.src.rpm: build OK
2025-Apr-03 07:29:59 :: [i586] #3400 octave-control.git 4.1.1-alt1: build start
2025-Apr-03 07:30:56 :: [x86_64] #3400 octave-control.git 4.1.1-alt1: build OK
2025-Apr-03 07:30:57 :: [x86_64] #3500 octave-communications-1.2.7-alt1.src.rpm: build start
2025-Apr-03 07:32:10 :: [i586] #3400 octave-control.git 4.1.1-alt1: build OK
2025-Apr-03 07:32:10 :: [i586] #3500 octave-communications-1.2.7-alt1.src.rpm: build start
2025-Apr-03 07:32:54 :: [x86_64] #3500 octave-communications-1.2.7-alt1.src.rpm: build OK
2025-Apr-03 07:32:54 :: [x86_64] #3600 octave-queueing-1.2.8-alt1.src.rpm: build start
2025-Apr-03 07:33:50 :: [x86_64] #3600 octave-queueing-1.2.8-alt1.src.rpm: build OK
2025-Apr-03 07:33:50 :: [x86_64] #3700 octave-fuzzy-logic-toolkit-0.6.1-alt1.src.rpm: build start
2025-Apr-03 07:34:20 :: [i586] #3500 octave-communications-1.2.7-alt1.src.rpm: build OK
2025-Apr-03 07:34:20 :: [i586] #3600 octave-queueing-1.2.8-alt1.src.rpm: build start
2025-Apr-03 07:34:42 :: [x86_64] #3700 octave-fuzzy-logic-toolkit-0.6.1-alt1.src.rpm: build OK
2025-Apr-03 07:34:42 :: [x86_64] #4000 octave-level-set-0.3.0-alt6.src.rpm: build start
2025-Apr-03 07:34:43 :: [aarch64] #1300 octave-instrument-control-0.9.1-alt1.src.rpm: build OK
2025-Apr-03 07:34:43 :: [aarch64] #1400 octave-interval-3.2.1-alt2.src.rpm: build start
2025-Apr-03 07:35:21 :: [i586] #3600 octave-queueing-1.2.8-alt1.src.rpm: build OK
2025-Apr-03 07:35:21 :: [i586] #3700 octave-fuzzy-logic-toolkit-0.6.1-alt1.src.rpm: build start
2025-Apr-03 07:35:49 :: [x86_64] #4000 octave-level-set-0.3.0-alt6.src.rpm: build OK
2025-Apr-03 07:35:49 :: [x86_64] #4100 octave-financial-0.5.3-alt2.src.rpm: build start
2025-Apr-03 07:36:17 :: [i586] #3700 octave-fuzzy-logic-toolkit-0.6.1-alt1.src.rpm: build OK
2025-Apr-03 07:36:17 :: [i586] #4000 octave-level-set-0.3.0-alt6.src.rpm: build start
2025-Apr-03 07:36:32 :: [aarch64] #1400 octave-interval-3.2.1-alt2.src.rpm: build OK
2025-Apr-03 07:36:32 :: [aarch64] #1500 octave-io-2.6.4-alt1.src.rpm: build start
2025-Apr-03 07:36:48 :: [x86_64] #4100 octave-financial-0.5.3-alt2.src.rpm: build OK
2025-Apr-03 07:36:48 :: [x86_64] #4200 octave-octproj-3.0.2-alt1.src.rpm: build start
2025-Apr-03 07:37:28 :: [i586] #4000 octave-level-set-0.3.0-alt6.src.rpm: build OK
2025-Apr-03 07:37:28 :: [i586] #4100 octave-financial-0.5.3-alt2.src.rpm: build start
2025-Apr-03 07:37:46 :: [x86_64] #4200 octave-octproj-3.0.2-alt1.src.rpm: build OK
2025-Apr-03 07:37:46 :: [x86_64] #4400 octave-nurbs-1.4.4-alt1.src.rpm: build start
2025-Apr-03 07:38:08 :: [aarch64] #1500 octave-io-2.6.4-alt1.src.rpm: build OK
2025-Apr-03 07:38:08 :: [aarch64] #1600 octave-lssa-0.1.4-alt1.src.rpm: build start
2025-Apr-03 07:38:32 :: [i586] #4100 octave-financial-0.5.3-alt2.src.rpm: build OK
2025-Apr-03 07:38:33 :: [i586] #4200 octave-octproj-3.0.2-alt1.src.rpm: build start
2025-Apr-03 07:38:47 :: [x86_64] #4400 octave-nurbs-1.4.4-alt1.src.rpm: build OK
2025-Apr-03 07:38:47 :: [x86_64] #4500 octave-msh-1.0.12-alt1.src.rpm: build start
2025-Apr-03 07:39:24 :: [aarch64] #1600 octave-lssa-0.1.4-alt1.src.rpm: build OK
2025-Apr-03 07:39:24 :: [aarch64] #2000 octave-mapping-1.4.2-alt1.src.rpm: build start
2025-Apr-03 07:39:28 :: [x86_64] #4500 octave-msh-1.0.12-alt1.src.rpm: build OK
2025-Apr-03 07:39:29 :: [x86_64] #4600 octave-image-2.16.0-alt1.src.rpm: build start
2025-Apr-03 07:39:35 :: [i586] #4200 octave-octproj-3.0.2-alt1.src.rpm: build OK
2025-Apr-03 07:39:35 :: [i586] #4400 octave-nurbs-1.4.4-alt1.src.rpm: build start
2025-Apr-03 07:40:39 :: [i586] #4400 octave-nurbs-1.4.4-alt1.src.rpm: build OK
2025-Apr-03 07:40:39 :: [i586] #4500 octave-msh-1.0.12-alt1.src.rpm: build start
2025-Apr-03 07:41:23 :: [i586] #4500 octave-msh-1.0.12-alt1.src.rpm: build OK
2025-Apr-03 07:41:24 :: [i586] #4600 octave-image-2.16.0-alt1.src.rpm: build start
2025-Apr-03 07:41:30 :: [x86_64] #4600 octave-image-2.16.0-alt1.src.rpm: build OK
2025-Apr-03 07:41:30 :: [x86_64] #4700 octave-image-acquisition-0.3.0-alt1.src.rpm: build start
2025-Apr-03 07:41:59 :: [aarch64] #2000 octave-mapping-1.4.2-alt1.src.rpm: build OK
2025-Apr-03 07:41:59 :: [aarch64] #2100 octave-miscellaneous-1.3.0-alt2.src.rpm: build start
2025-Apr-03 07:42:26 :: [x86_64] #4700 octave-image-acquisition-0.3.0-alt1.src.rpm: build OK
2025-Apr-03 07:42:26 :: [x86_64] #5000 octave-octclip-2.0.3-alt1.src.rpm: build start
2025-Apr-03 07:43:13 :: [x86_64] #5000 octave-octclip-2.0.3-alt1.src.rpm: build OK
2025-Apr-03 07:43:14 :: [x86_64] #5100 octave-geometry-4.1.0-alt1.src.rpm: build start
2025-Apr-03 07:43:37 :: [i586] #4600 octave-image-2.16.0-alt1.src.rpm: build OK
2025-Apr-03 07:43:37 :: [i586] #4700 octave-image-acquisition-0.3.0-alt1.src.rpm: build start
2025-Apr-03 07:43:41 :: [aarch64] #2100 octave-miscellaneous-1.3.0-alt2.src.rpm: build OK
2025-Apr-03 07:43:41 :: [aarch64] #2200 octave-netcdf-1.0.17-alt2.src.rpm: build start
2025-Apr-03 07:44:13 :: [x86_64] #5100 octave-geometry-4.1.0-alt1.src.rpm: build OK
2025-Apr-03 07:44:13 :: [x86_64] #5200 octave-gsl-2.1.1-alt3.src.rpm: build start
2025-Apr-03 07:44:36 :: [i586] #4700 octave-image-acquisition-0.3.0-alt1.src.rpm: build OK
2025-Apr-03 07:44:37 :: [i586] #5000 octave-octclip-2.0.3-alt1.src.rpm: build start
2025-Apr-03 07:45:10 :: [aarch64] #2200 octave-netcdf-1.0.17-alt2.src.rpm: build OK
2025-Apr-03 07:45:10 :: [aarch64] #2600 octave-optiminterp-0.3.7-alt1.src.rpm: build start
2025-Apr-03 07:45:22 :: [x86_64] #5200 octave-gsl-2.1.1-alt3.src.rpm: build OK
2025-Apr-03 07:45:23 :: [x86_64] #5300 octave-ocl-1.2.3-alt1.src.rpm: build start
2025-Apr-03 07:45:27 :: [i586] #5000 octave-octclip-2.0.3-alt1.src.rpm: build OK
2025-Apr-03 07:45:27 :: [i586] #5100 octave-geometry-4.1.0-alt1.src.rpm: build start
2025-Apr-03 07:46:31 :: [i586] #5100 octave-geometry-4.1.0-alt1.src.rpm: build OK
2025-Apr-03 07:46:31 :: [i586] #5200 octave-gsl-2.1.1-alt3.src.rpm: build start
2025-Apr-03 07:46:36 :: [x86_64] #5300 octave-ocl-1.2.3-alt1.src.rpm: build OK
2025-Apr-03 07:46:36 :: [x86_64] #5400 octave-signal-1.4.6-alt1.src.rpm: build start
2025-Apr-03 07:46:38 :: [aarch64] #2600 octave-optiminterp-0.3.7-alt1.src.rpm: build OK
2025-Apr-03 07:46:38 :: [aarch64] #2700 octave-quaternion.git 2.4.0-alt5: build start
2025-Apr-03 07:47:47 :: [i586] #5200 octave-gsl-2.1.1-alt3.src.rpm: build OK
2025-Apr-03 07:47:48 :: [i586] #5300 octave-ocl-1.2.3-alt1.src.rpm: build start
2025-Apr-03 07:47:52 :: [aarch64] #2700 octave-quaternion.git 2.4.0-alt5: build OK
2025-Apr-03 07:47:52 :: [aarch64] #3100 octave-struct-1.0.18-alt1.src.rpm: build start
2025-Apr-03 07:48:20 :: [x86_64] #5400 octave-signal-1.4.6-alt1.src.rpm: build OK
2025-Apr-03 07:48:20 :: [x86_64] #5500 octave-optim-1.6.2-alt2.src.rpm: build start
2025-Apr-03 07:49:04 :: [i586] #5300 octave-ocl-1.2.3-alt1.src.rpm: build OK
2025-Apr-03 07:49:05 :: [i586] #5400 octave-signal-1.4.6-alt1.src.rpm: build start
2025-Apr-03 07:49:32 :: [aarch64] #3100 octave-struct-1.0.18-alt1.src.rpm: build OK
2025-Apr-03 07:49:32 :: [aarch64] #3200 octave-vibes.git 0.2.0-alt5: build start
2025-Apr-03 07:49:48 :: [x86_64] #5500 octave-optim-1.6.2-alt2.src.rpm: build OK
2025-Apr-03 07:49:48 :: [x86_64] #5600 octave-sockets-1.4.1-alt1.src.rpm: build start
2025-Apr-03 07:50:38 :: [x86_64] #5600 octave-sockets-1.4.1-alt1.src.rpm: build OK
2025-Apr-03 07:50:48 :: [aarch64] #3200 octave-vibes.git 0.2.0-alt5: build OK
2025-Apr-03 07:50:48 :: [aarch64] #3300 octave-zeromq-1.5.5-alt1.src.rpm: build start
2025-Apr-03 07:50:58 :: [i586] #5400 octave-signal-1.4.6-alt1.src.rpm: build OK
2025-Apr-03 07:50:59 :: [i586] #5500 octave-optim-1.6.2-alt2.src.rpm: build start
2025-Apr-03 07:52:32 :: [i586] #5500 octave-optim-1.6.2-alt2.src.rpm: build OK
2025-Apr-03 07:52:32 :: [i586] #5600 octave-sockets-1.4.1-alt1.src.rpm: build start
2025-Apr-03 07:53:26 :: [i586] #5600 octave-sockets-1.4.1-alt1.src.rpm: build OK
2025-Apr-03 07:53:26 :: [aarch64] #3300 octave-zeromq-1.5.5-alt1.src.rpm: build OK
2025-Apr-03 07:53:26 :: [aarch64] #3400 octave-control.git 4.1.1-alt1: build start
2025-Apr-03 07:56:49 :: [aarch64] #3400 octave-control.git 4.1.1-alt1: build OK
2025-Apr-03 07:56:49 :: [aarch64] #3500 octave-communications-1.2.7-alt1.src.rpm: build start
2025-Apr-03 08:00:18 :: [aarch64] #3500 octave-communications-1.2.7-alt1.src.rpm: build OK
2025-Apr-03 08:00:18 :: [aarch64] #3600 octave-queueing-1.2.8-alt1.src.rpm: build start
2025-Apr-03 08:01:53 :: [aarch64] #3600 octave-queueing-1.2.8-alt1.src.rpm: build OK
2025-Apr-03 08:01:53 :: [aarch64] #3700 octave-fuzzy-logic-toolkit-0.6.1-alt1.src.rpm: build start
2025-Apr-03 08:03:20 :: [aarch64] #3700 octave-fuzzy-logic-toolkit-0.6.1-alt1.src.rpm: build OK
2025-Apr-03 08:03:20 :: [aarch64] #4000 octave-level-set-0.3.0-alt6.src.rpm: build start
2025-Apr-03 08:05:08 :: [aarch64] #4000 octave-level-set-0.3.0-alt6.src.rpm: build OK
2025-Apr-03 08:05:09 :: [aarch64] #4100 octave-financial-0.5.3-alt2.src.rpm: build start
2025-Apr-03 08:06:48 :: [aarch64] #4100 octave-financial-0.5.3-alt2.src.rpm: build OK
2025-Apr-03 08:06:48 :: [aarch64] #4200 octave-octproj-3.0.2-alt1.src.rpm: build start
2025-Apr-03 08:08:23 :: [aarch64] #4200 octave-octproj-3.0.2-alt1.src.rpm: build OK
2025-Apr-03 08:08:23 :: [aarch64] #4400 octave-nurbs-1.4.4-alt1.src.rpm: build start
2025-Apr-03 08:10:01 :: [aarch64] #4400 octave-nurbs-1.4.4-alt1.src.rpm: build OK
2025-Apr-03 08:10:02 :: [aarch64] #4500 octave-msh-1.0.12-alt1.src.rpm: build start
2025-Apr-03 08:11:09 :: [aarch64] #4500 octave-msh-1.0.12-alt1.src.rpm: build OK
2025-Apr-03 08:11:09 :: [aarch64] #4600 octave-image-2.16.0-alt1.src.rpm: build start
2025-Apr-03 08:14:40 :: [aarch64] #4600 octave-image-2.16.0-alt1.src.rpm: build OK
2025-Apr-03 08:14:40 :: [aarch64] #4700 octave-image-acquisition-0.3.0-alt1.src.rpm: build start
2025-Apr-03 08:16:10 :: [aarch64] #4700 octave-image-acquisition-0.3.0-alt1.src.rpm: build OK
2025-Apr-03 08:16:10 :: [aarch64] #5000 octave-octclip-2.0.3-alt1.src.rpm: build start
2025-Apr-03 08:17:26 :: [aarch64] #5000 octave-octclip-2.0.3-alt1.src.rpm: build OK
2025-Apr-03 08:17:26 :: [aarch64] #5100 octave-geometry-4.1.0-alt1.src.rpm: build start
2025-Apr-03 08:19:05 :: [aarch64] #5100 octave-geometry-4.1.0-alt1.src.rpm: build OK
2025-Apr-03 08:19:05 :: [aarch64] #5200 octave-gsl-2.1.1-alt3.src.rpm: build start
2025-Apr-03 08:21:03 :: [aarch64] #5200 octave-gsl-2.1.1-alt3.src.rpm: build OK
2025-Apr-03 08:21:03 :: [aarch64] #5300 octave-ocl-1.2.3-alt1.src.rpm: build start
2025-Apr-03 08:23:05 :: [aarch64] #5300 octave-ocl-1.2.3-alt1.src.rpm: build OK
2025-Apr-03 08:23:05 :: [aarch64] #5400 octave-signal-1.4.6-alt1.src.rpm: build start
2025-Apr-03 08:26:07 :: [aarch64] #5400 octave-signal-1.4.6-alt1.src.rpm: build OK
2025-Apr-03 08:26:07 :: [aarch64] #5500 octave-optim-1.6.2-alt2.src.rpm: build start
2025-Apr-03 08:29:07 :: [aarch64] #5500 octave-optim-1.6.2-alt2.src.rpm: build OK
2025-Apr-03 08:29:07 :: [aarch64] #5600 octave-sockets-1.4.1-alt1.src.rpm: build start
2025-Apr-03 08:30:32 :: [aarch64] #5600 octave-sockets-1.4.1-alt1.src.rpm: build OK
2025-Apr-03 08:30:57 :: #200: octave.git 10.1.0-alt1: build check OK
2025-Apr-03 08:31:07 :: #300: octave-audio-2.0.5-alt2.src.rpm: build check OK
x86_64/srpm/octave-dicom-0.5.1-alt1.src.rpm: The use of such a license name is ambiguous: GPL
x86_64/srpm/octave-dicom-0.5.1-alt1.src.rpm: license not found in '/usr/share/license' directory: version
x86_64/srpm/octave-dicom-0.5.1-alt1.src.rpm: license not found in '/usr/share/license' directory: 3
x86_64/srpm/octave-dicom-0.5.1-alt1.src.rpm: license not found in '/usr/share/license' directory: later
x86_64/rpms/octave-dicom-debuginfo-0.5.1-alt1.x86_64.rpm: The use of such a license name is ambiguous: GPL
x86_64/rpms/octave-dicom-debuginfo-0.5.1-alt1.x86_64.rpm: license not found in '/usr/share/license' directory: version
x86_64/rpms/octave-dicom-debuginfo-0.5.1-alt1.x86_64.rpm: license not found in '/usr/share/license' directory: 3
x86_64/rpms/octave-dicom-debuginfo-0.5.1-alt1.x86_64.rpm: license not found in '/usr/share/license' directory: later
x86_64/rpms/octave-dicom-0.5.1-alt1.x86_64.rpm: The use of such a license name is ambiguous: GPL
x86_64/rpms/octave-dicom-0.5.1-alt1.x86_64.rpm: license not found in '/usr/share/license' directory: version
x86_64/rpms/octave-dicom-0.5.1-alt1.x86_64.rpm: license not found in '/usr/share/license' directory: 3
x86_64/rpms/octave-dicom-0.5.1-alt1.x86_64.rpm: license not found in '/usr/share/license' directory: later
i586/srpm/octave-dicom-0.5.1-alt1.src.rpm: The use of such a license name is ambiguous: GPL
i586/srpm/octave-dicom-0.5.1-alt1.src.rpm: license not found in '/usr/share/license' directory: version
i586/srpm/octave-dicom-0.5.1-alt1.src.rpm: license not found in '/usr/share/license' directory: 3
i586/srpm/octave-dicom-0.5.1-alt1.src.rpm: license not found in '/usr/share/license' directory: later
i586/rpms/octave-dicom-0.5.1-alt1.i586.rpm: The use of such a license name is ambiguous: GPL
i586/rpms/octave-dicom-0.5.1-alt1.i586.rpm: license not found in '/usr/share/license' directory: version
i586/rpms/octave-dicom-0.5.1-alt1.i586.rpm: license not found in '/usr/share/license' directory: 3
i586/rpms/octave-dicom-0.5.1-alt1.i586.rpm: license not found in '/usr/share/license' directory: later
i586/rpms/octave-dicom-debuginfo-0.5.1-alt1.i586.rpm: The use of such a license name is ambiguous: GPL
i586/rpms/octave-dicom-debuginfo-0.5.1-alt1.i586.rpm: license not found in '/usr/share/license' directory: version
i586/rpms/octave-dicom-debuginfo-0.5.1-alt1.i586.rpm: license not found in '/usr/share/license' directory: 3
i586/rpms/octave-dicom-debuginfo-0.5.1-alt1.i586.rpm: license not found in '/usr/share/license' directory: later
aarch64/srpm/octave-dicom-0.5.1-alt1.src.rpm: The use of such a license name is ambiguous: GPL
aarch64/srpm/octave-dicom-0.5.1-alt1.src.rpm: license not found in '/usr/share/license' directory: version
aarch64/srpm/octave-dicom-0.5.1-alt1.src.rpm: license not found in '/usr/share/license' directory: 3
aarch64/srpm/octave-dicom-0.5.1-alt1.src.rpm: license not found in '/usr/share/license' directory: later
aarch64/rpms/octave-dicom-0.5.1-alt1.aarch64.rpm: The use of such a license name is ambiguous: GPL
aarch64/rpms/octave-dicom-0.5.1-alt1.aarch64.rpm: license not found in '/usr/share/license' directory: version
aarch64/rpms/octave-dicom-0.5.1-alt1.aarch64.rpm: license not found in '/usr/share/license' directory: 3
aarch64/rpms/octave-dicom-0.5.1-alt1.aarch64.rpm: license not found in '/usr/share/license' directory: later
aarch64/rpms/octave-dicom-debuginfo-0.5.1-alt1.aarch64.rpm: The use of such a license name is ambiguous: GPL
aarch64/rpms/octave-dicom-debuginfo-0.5.1-alt1.aarch64.rpm: license not found in '/usr/share/license' directory: version
aarch64/rpms/octave-dicom-debuginfo-0.5.1-alt1.aarch64.rpm: license not found in '/usr/share/license' directory: 3
aarch64/rpms/octave-dicom-debuginfo-0.5.1-alt1.aarch64.rpm: license not found in '/usr/share/license' directory: later
2025-Apr-03 08:31:17 :: #400: octave-dicom.git 0.5.1-alt1: build check OK
2025-Apr-03 08:31:26 :: #500: octave-econometrics.git 1.1.2-alt1: build check OK
2025-Apr-03 08:31:36 :: #600: octave-fits-1.0.7-alt4.src.rpm: build check OK
x86_64/srpm/octave-general-2.1.3-alt2.src.rpm: bad symbols in the license tag: ,,
x86_64/rpms/octave-general-debuginfo-2.1.3-alt2.x86_64.rpm: bad symbols in the license tag: ,,
x86_64/rpms/octave-general-2.1.3-alt2.x86_64.rpm: bad symbols in the license tag: ,,
i586/srpm/octave-general-2.1.3-alt2.src.rpm: bad symbols in the license tag: ,,
i586/rpms/octave-general-debuginfo-2.1.3-alt2.i586.rpm: bad symbols in the license tag: ,,
i586/rpms/octave-general-2.1.3-alt2.i586.rpm: bad symbols in the license tag: ,,
aarch64/srpm/octave-general-2.1.3-alt2.src.rpm: bad symbols in the license tag: ,,
aarch64/rpms/octave-general-2.1.3-alt2.aarch64.rpm: bad symbols in the license tag: ,,
aarch64/rpms/octave-general-debuginfo-2.1.3-alt2.aarch64.rpm: bad symbols in the license tag: ,,
2025-Apr-03 08:31:46 :: #700: octave-general-2.1.3-alt2.src.rpm: build check OK
2025-Apr-03 08:31:57 :: #1300: octave-instrument-control-0.9.1-alt1.src.rpm: build check OK
2025-Apr-03 08:32:07 :: #1400: octave-interval-3.2.1-alt2.src.rpm: build check OK
x86_64/srpm/octave-io-2.6.4-alt1.src.rpm: bad symbols in the license tag: ,
x86_64/rpms/octave-io-debuginfo-2.6.4-alt1.x86_64.rpm: bad symbols in the license tag: ,
x86_64/rpms/octave-io-2.6.4-alt1.x86_64.rpm: bad symbols in the license tag: ,
i586/srpm/octave-io-2.6.4-alt1.src.rpm: bad symbols in the license tag: ,
i586/rpms/octave-io-2.6.4-alt1.i586.rpm: bad symbols in the license tag: ,
i586/rpms/octave-io-debuginfo-2.6.4-alt1.i586.rpm: bad symbols in the license tag: ,
aarch64/srpm/octave-io-2.6.4-alt1.src.rpm: bad symbols in the license tag: ,
aarch64/rpms/octave-io-debuginfo-2.6.4-alt1.aarch64.rpm: bad symbols in the license tag: ,
aarch64/rpms/octave-io-2.6.4-alt1.aarch64.rpm: bad symbols in the license tag: ,
2025-Apr-03 08:32:17 :: #1500: octave-io-2.6.4-alt1.src.rpm: build check OK
2025-Apr-03 08:32:28 :: #1600: octave-lssa-0.1.4-alt1.src.rpm: build check OK
2025-Apr-03 08:32:38 :: #2000: octave-mapping-1.4.2-alt1.src.rpm: build check OK
2025-Apr-03 08:32:49 :: #2100: octave-miscellaneous-1.3.0-alt2.src.rpm: build check OK
2025-Apr-03 08:33:00 :: #2200: octave-netcdf-1.0.17-alt2.src.rpm: build check OK
2025-Apr-03 08:33:10 :: #2600: octave-optiminterp-0.3.7-alt1.src.rpm: build check OK
2025-Apr-03 08:33:20 :: #2700: octave-quaternion.git 2.4.0-alt5: build check OK
2025-Apr-03 08:33:30 :: #3100: octave-struct-1.0.18-alt1.src.rpm: build check OK
x86_64/srpm/octave-vibes-0.2.0-alt5.src.rpm: bad symbols in the license tag: ,
x86_64/rpms/octave-vibes-0.2.0-alt5.x86_64.rpm: bad symbols in the license tag: ,
x86_64/rpms/octave-vibes-debuginfo-0.2.0-alt5.x86_64.rpm: bad symbols in the license tag: ,
i586/srpm/octave-vibes-0.2.0-alt5.src.rpm: bad symbols in the license tag: ,
i586/rpms/octave-vibes-debuginfo-0.2.0-alt5.i586.rpm: bad symbols in the license tag: ,
i586/rpms/octave-vibes-0.2.0-alt5.i586.rpm: bad symbols in the license tag: ,
aarch64/srpm/octave-vibes-0.2.0-alt5.src.rpm: bad symbols in the license tag: ,
aarch64/rpms/octave-vibes-debuginfo-0.2.0-alt5.aarch64.rpm: bad symbols in the license tag: ,
aarch64/rpms/octave-vibes-0.2.0-alt5.aarch64.rpm: bad symbols in the license tag: ,
2025-Apr-03 08:33:40 :: #3200: octave-vibes.git 0.2.0-alt5: build check OK
2025-Apr-03 08:33:49 :: #3300: octave-zeromq-1.5.5-alt1.src.rpm: build check OK
2025-Apr-03 08:34:00 :: #3400: octave-control.git 4.1.1-alt1: build check OK
2025-Apr-03 08:34:11 :: #3500: octave-communications-1.2.7-alt1.src.rpm: build check OK
2025-Apr-03 08:34:19 :: #3600: octave-queueing-1.2.8-alt1.src.rpm: build check OK
2025-Apr-03 08:34:27 :: #3700: octave-fuzzy-logic-toolkit-0.6.1-alt1.src.rpm: build check OK
2025-Apr-03 08:34:37 :: #4000: octave-level-set-0.3.0-alt6.src.rpm: build check OK
2025-Apr-03 08:34:45 :: #4100: octave-financial-0.5.3-alt2.src.rpm: build check OK
2025-Apr-03 08:34:53 :: #4200: octave-octproj-3.0.2-alt1.src.rpm: build check OK
2025-Apr-03 08:35:03 :: #4400: octave-nurbs-1.4.4-alt1.src.rpm: build check OK
2025-Apr-03 08:35:11 :: #4500: octave-msh-1.0.12-alt1.src.rpm: build check OK
2025-Apr-03 08:35:21 :: #4600: octave-image-2.16.0-alt1.src.rpm: build check OK
2025-Apr-03 08:35:30 :: #4700: octave-image-acquisition-0.3.0-alt1.src.rpm: build check OK
x86_64/srpm/octave-octclip-2.0.3-alt1.src.rpm: bad symbols in the license tag: ,
x86_64/rpms/octave-octclip-2.0.3-alt1.x86_64.rpm: bad symbols in the license tag: ,
i586/srpm/octave-octclip-2.0.3-alt1.src.rpm: bad symbols in the license tag: ,
i586/rpms/octave-octclip-2.0.3-alt1.i586.rpm: bad symbols in the license tag: ,
aarch64/srpm/octave-octclip-2.0.3-alt1.src.rpm: bad symbols in the license tag: ,
aarch64/rpms/octave-octclip-2.0.3-alt1.aarch64.rpm: bad symbols in the license tag: ,
2025-Apr-03 08:35:38 :: #5000: octave-octclip-2.0.3-alt1.src.rpm: build check OK
x86_64/srpm/octave-geometry-4.1.0-alt1.src.rpm: bad symbols in the license tag: ,,
x86_64/rpms/octave-geometry-4.1.0-alt1.x86_64.rpm: bad symbols in the license tag: ,,
x86_64/rpms/octave-geometry-debuginfo-4.1.0-alt1.x86_64.rpm: bad symbols in the license tag: ,,
i586/srpm/octave-geometry-4.1.0-alt1.src.rpm: bad symbols in the license tag: ,,
i586/rpms/octave-geometry-debuginfo-4.1.0-alt1.i586.rpm: bad symbols in the license tag: ,,
i586/rpms/octave-geometry-4.1.0-alt1.i586.rpm: bad symbols in the license tag: ,,
aarch64/srpm/octave-geometry-4.1.0-alt1.src.rpm: bad symbols in the license tag: ,,
aarch64/rpms/octave-geometry-4.1.0-alt1.aarch64.rpm: bad symbols in the license tag: ,,
aarch64/rpms/octave-geometry-debuginfo-4.1.0-alt1.aarch64.rpm: bad symbols in the license tag: ,,
2025-Apr-03 08:35:48 :: #5100: octave-geometry-4.1.0-alt1.src.rpm: build check OK
2025-Apr-03 08:35:58 :: #5200: octave-gsl-2.1.1-alt3.src.rpm: build check OK
2025-Apr-03 08:36:08 :: #5300: octave-ocl-1.2.3-alt1.src.rpm: build check OK
x86_64/srpm/octave-signal-1.4.6-alt1.src.rpm: bad symbols in the license tag: ,
x86_64/rpms/octave-signal-1.4.6-alt1.x86_64.rpm: bad symbols in the license tag: ,
x86_64/rpms/octave-signal-debuginfo-1.4.6-alt1.x86_64.rpm: bad symbols in the license tag: ,
i586/srpm/octave-signal-1.4.6-alt1.src.rpm: bad symbols in the license tag: ,
i586/rpms/octave-signal-debuginfo-1.4.6-alt1.i586.rpm: bad symbols in the license tag: ,
i586/rpms/octave-signal-1.4.6-alt1.i586.rpm: bad symbols in the license tag: ,
aarch64/srpm/octave-signal-1.4.6-alt1.src.rpm: bad symbols in the license tag: ,
aarch64/rpms/octave-signal-1.4.6-alt1.aarch64.rpm: bad symbols in the license tag: ,
aarch64/rpms/octave-signal-debuginfo-1.4.6-alt1.aarch64.rpm: bad symbols in the license tag: ,
2025-Apr-03 08:36:18 :: #5400: octave-signal-1.4.6-alt1.src.rpm: build check OK
x86_64/srpm/octave-optim-1.6.2-alt2.src.rpm: bad symbols in the license tag: ,,
x86_64/rpms/octave-optim-1.6.2-alt2.x86_64.rpm: bad symbols in the license tag: ,,
x86_64/rpms/octave-optim-debuginfo-1.6.2-alt2.x86_64.rpm: bad symbols in the license tag: ,,
i586/srpm/octave-optim-1.6.2-alt2.src.rpm: bad symbols in the license tag: ,,
i586/rpms/octave-optim-1.6.2-alt2.i586.rpm: bad symbols in the license tag: ,,
i586/rpms/octave-optim-debuginfo-1.6.2-alt2.i586.rpm: bad symbols in the license tag: ,,
aarch64/srpm/octave-optim-1.6.2-alt2.src.rpm: bad symbols in the license tag: ,,
aarch64/rpms/octave-optim-debuginfo-1.6.2-alt2.aarch64.rpm: bad symbols in the license tag: ,,
aarch64/rpms/octave-optim-1.6.2-alt2.aarch64.rpm: bad symbols in the license tag: ,,
2025-Apr-03 08:36:28 :: #5500: octave-optim-1.6.2-alt2.src.rpm: build check OK
2025-Apr-03 08:36:38 :: #5600: octave-sockets-1.4.1-alt1.src.rpm: build check OK
2025-Apr-03 08:36:41 :: build check OK
2025-Apr-03 08:38:51 :: noarch check OK
2025-Apr-03 08:38:53 :: plan: src +36 -37 =20071, aarch64 +64 -68 =34853, i586 +64 -68 =33709, noarch +5 -4 =21233, x86_64 +64 -68 =35662
#200 octave 9.4.0-alt1 -> 10.1.0-alt1
Sun Mar 30 2025 Andrey Cherepanov <cas@altlinux> 10.1.0-alt1
- New version.
#5100 octave-geometry 4.0.0-alt3 -> 4.1.0-alt1
Mon Mar 31 2025 Andrey Cherepanov <cas@altlinux> 4.1.0-alt1
- New version.
#4600 octave-image 2.14.0-alt1 -> 2.16.0-alt1
Mon Mar 31 2025 Andrey Cherepanov <cas@altlinux> 2.16.0-alt1
- new version
#4700 octave-image-acquisition 0.2.2-alt6 -> 0.3.0-alt1
Mon Mar 31 2025 Andrey Cherepanov <cas@altlinux> 0.3.0-alt1
- new version
#4500 octave-msh 1.0.10-alt3 -> 1.0.12-alt1
Mon Mar 31 2025 Andrey Cherepanov <cas@altlinux> 1.0.12-alt1
- new version
#4400 octave-nurbs 1.4.3-alt1 -> 1.4.4-alt1
Mon Mar 31 2025 Andrey Cherepanov <cas@altlinux> 1.4.4-alt1
- new version
#5300 octave-ocl 1.2.2-alt1 -> 1.2.3-alt1
Mon Mar 31 2025 Andrey Cherepanov <cas@altlinux> 1.2.3-alt1
- new version
#5000 octave-octclip 2.0.1-alt1 -> 2.0.3-alt1
Mon Mar 31 2025 Andrey Cherepanov <cas@altlinux> 2.0.3-alt1
- new version
#4200 octave-octproj 2.0.1-alt1 -> 3.0.2-alt1
Mon Mar 31 2025 Andrey Cherepanov <cas@altlinux> 3.0.2-alt1
- new version
#5500 octave-optim 1.6.2-alt1 -> 1:1.6.2-alt2
Tue Apr 01 2025 Andrey Cherepanov <cas@altlinux> 1:1.6.2-alt2
- rebuild with octave 10.x
#5400 octave-signal 1.4.5-alt1 -> 2:1.4.6-alt1
Mon Mar 31 2025 Andrey Cherepanov <cas@altlinux> 2:1.4.6-alt1
- new version
2025-Apr-03 08:39:38 :: patched apt indices
2025-Apr-03 08:39:47 :: created next repo
2025-Apr-03 08:39:58 :: duplicate provides check OK
2025-Apr-03 08:40:36 :: dependencies check OK
2025-Apr-03 08:41:13 :: [x86_64 i586 aarch64] ELF symbols check OK
i586: octave=10.1.0-alt1 post-install unowned files:
/usr/share/icons/hicolor/1024x1024
/usr/share/icons/hicolor/1024x1024/apps
/usr/share/icons/hicolor/128x128
/usr/share/icons/hicolor/128x128/apps
/usr/share/icons/hicolor/22x22
/usr/share/icons/hicolor/22x22/apps
/usr/share/icons/hicolor/24x24
/usr/share/icons/hicolor/24x24/apps
/usr/share/icons/hicolor/256x256
/usr/share/icons/hicolor/256x256/apps
/usr/share/icons/hicolor/512x512
/usr/share/icons/hicolor/512x512/apps
/usr/share/icons/hicolor/64x64
/usr/share/icons/hicolor/64x64/apps
/usr/share/icons/hicolor/scalable
/usr/share/icons/hicolor/scalable/apps
/usr/share/metainfo
2025-Apr-03 08:41:45 :: [i586] #200 octave: install check OK
x86_64: octave=10.1.0-alt1 post-install unowned files:
/usr/share/icons/hicolor/1024x1024
/usr/share/icons/hicolor/1024x1024/apps
/usr/share/icons/hicolor/128x128
/usr/share/icons/hicolor/128x128/apps
/usr/share/icons/hicolor/22x22
/usr/share/icons/hicolor/22x22/apps
/usr/share/icons/hicolor/24x24
/usr/share/icons/hicolor/24x24/apps
/usr/share/icons/hicolor/256x256
/usr/share/icons/hicolor/256x256/apps
/usr/share/icons/hicolor/512x512
/usr/share/icons/hicolor/512x512/apps
/usr/share/icons/hicolor/64x64
/usr/share/icons/hicolor/64x64/apps
/usr/share/icons/hicolor/scalable
/usr/share/icons/hicolor/scalable/apps
/usr/share/metainfo
2025-Apr-03 08:42:02 :: [x86_64] #200 octave: install check OK
2025-Apr-03 08:42:08 :: [i586] #300 octave-audio: install check OK
aarch64: octave=10.1.0-alt1 post-install unowned files:
/usr/share/icons/hicolor/1024x1024
/usr/share/icons/hicolor/1024x1024/apps
/usr/share/icons/hicolor/128x128
/usr/share/icons/hicolor/128x128/apps
/usr/share/icons/hicolor/22x22
/usr/share/icons/hicolor/22x22/apps
/usr/share/icons/hicolor/24x24
/usr/share/icons/hicolor/24x24/apps
/usr/share/icons/hicolor/256x256
/usr/share/icons/hicolor/256x256/apps
/usr/share/icons/hicolor/512x512
/usr/share/icons/hicolor/512x512/apps
/usr/share/icons/hicolor/64x64
/usr/share/icons/hicolor/64x64/apps
/usr/share/icons/hicolor/scalable
/usr/share/icons/hicolor/scalable/apps
/usr/share/metainfo
2025-Apr-03 08:42:14 :: [aarch64] #200 octave: install check OK
2025-Apr-03 08:42:37 :: [x86_64] #300 octave-audio: install check OK
2025-Apr-03 08:42:41 :: [i586] #300 octave-audio-debuginfo: install check OK
2025-Apr-03 08:42:54 :: [aarch64] #300 octave-audio: install check OK
2025-Apr-03 08:43:06 :: [i586] #3500 octave-communications: install check OK
2025-Apr-03 08:43:28 :: [x86_64] #300 octave-audio-debuginfo: install check OK
2025-Apr-03 08:43:31 :: [i586] #3500 octave-communications-debuginfo: install check OK
2025-Apr-03 08:43:53 :: [aarch64] #300 octave-audio-debuginfo: install check OK
2025-Apr-03 08:43:56 :: [i586] #3400 octave-control: install check OK
2025-Apr-03 08:44:04 :: [x86_64] #3500 octave-communications: install check OK
2025-Apr-03 08:44:22 :: [i586] #3400 octave-control-debuginfo: install check OK
2025-Apr-03 08:44:35 :: [aarch64] #3500 octave-communications: install check OK
2025-Apr-03 08:44:42 :: [x86_64] #3500 octave-communications-debuginfo: install check OK
2025-Apr-03 08:45:17 :: [x86_64] #3400 octave-control: install check OK
2025-Apr-03 08:45:18 :: [aarch64] #3500 octave-communications-debuginfo: install check OK
2025-Apr-03 08:45:28 :: [i586] #200 octave-debuginfo: install check OK
2025-Apr-03 08:45:53 :: [i586] #200 octave-devel: install check OK
2025-Apr-03 08:45:57 :: [x86_64] #3400 octave-control-debuginfo: install check OK
2025-Apr-03 08:45:59 :: [aarch64] #3400 octave-control: install check OK
2025-Apr-03 08:46:44 :: [aarch64] #3400 octave-control-debuginfo: install check OK
2025-Apr-03 08:46:59 :: [i586] #200 octave-devel-debuginfo: install check OK
2025-Apr-03 08:47:25 :: [i586] #400 octave-dicom: install check OK
2025-Apr-03 08:47:35 :: [x86_64] #200 octave-debuginfo: install check OK
2025-Apr-03 08:47:52 :: [i586] #400 octave-dicom-debuginfo: install check OK
2025-Apr-03 08:47:59 :: [i586] #200 octave-doc: install check OK
2025-Apr-03 08:48:12 :: [x86_64] #200 octave-devel: install check OK
2025-Apr-03 08:48:23 :: [i586] #500 octave-econometrics: install check OK
2025-Apr-03 08:48:31 :: [aarch64] #200 octave-debuginfo: install check OK
2025-Apr-03 08:48:49 :: [i586] #500 octave-econometrics-debuginfo: install check OK
2025-Apr-03 08:49:13 :: [i586] #4100 octave-financial: install check OK
2025-Apr-03 08:49:13 :: [aarch64] #200 octave-devel: install check OK
2025-Apr-03 08:49:37 :: [i586] #600 octave-fits: install check OK
2025-Apr-03 08:49:42 :: [x86_64] #200 octave-devel-debuginfo: install check OK
2025-Apr-03 08:50:02 :: [i586] #600 octave-fits-debuginfo: install check OK
2025-Apr-03 08:50:18 :: [x86_64] #400 octave-dicom: install check OK
2025-Apr-03 08:50:26 :: [i586] #3700 octave-fuzzy-logic-toolkit: install check OK
2025-Apr-03 08:50:44 :: [x86_64] #400 octave-dicom-debuginfo: install check OK
2025-Apr-03 08:50:50 :: [i586] #700 octave-general: install check OK
2025-Apr-03 08:50:53 :: [x86_64] #200 octave-doc: install check OK
2025-Apr-03 08:51:00 :: [aarch64] #200 octave-devel-debuginfo: install check OK
2025-Apr-03 08:51:14 :: [x86_64] #500 octave-econometrics: install check OK
2025-Apr-03 08:51:15 :: [i586] #700 octave-general-debuginfo: install check OK
2025-Apr-03 08:51:37 :: [x86_64] #500 octave-econometrics-debuginfo: install check OK
2025-Apr-03 08:51:39 :: [i586] #5100 octave-geometry: install check OK
2025-Apr-03 08:51:43 :: [aarch64] #400 octave-dicom: install check OK
2025-Apr-03 08:51:59 :: [x86_64] #4100 octave-financial: install check OK
2025-Apr-03 08:52:21 :: [x86_64] #600 octave-fits: install check OK
2025-Apr-03 08:52:26 :: [aarch64] #400 octave-dicom-debuginfo: install check OK
2025-Apr-03 08:52:40 :: [aarch64] #200 octave-doc: install check OK
2025-Apr-03 08:52:43 :: [x86_64] #600 octave-fits-debuginfo: install check OK
2025-Apr-03 08:52:44 :: [i586] #5100 octave-geometry-debuginfo: install check OK
2025-Apr-03 08:53:05 :: [x86_64] #3700 octave-fuzzy-logic-toolkit: install check OK
2025-Apr-03 08:53:09 :: [i586] #5200 octave-gsl: install check OK
2025-Apr-03 08:53:13 :: [aarch64] #500 octave-econometrics: install check OK
2025-Apr-03 08:53:27 :: [x86_64] #700 octave-general: install check OK
2025-Apr-03 08:53:34 :: [i586] #5200 octave-gsl-debuginfo: install check OK
2025-Apr-03 08:53:47 :: [aarch64] #500 octave-econometrics-debuginfo: install check OK
2025-Apr-03 08:53:50 :: [x86_64] #700 octave-general-debuginfo: install check OK
2025-Apr-03 08:53:59 :: [i586] #4600 octave-image: install check OK
2025-Apr-03 08:54:12 :: [x86_64] #5100 octave-geometry: install check OK
2025-Apr-03 08:54:23 :: [i586] #4700 octave-image-acquisition: install check OK
2025-Apr-03 08:54:23 :: [aarch64] #4100 octave-financial: install check OK
2025-Apr-03 08:54:51 :: [i586] #4700 octave-image-acquisition-debuginfo: install check OK
2025-Apr-03 08:54:59 :: [aarch64] #600 octave-fits: install check OK
2025-Apr-03 08:55:12 :: [x86_64] #5100 octave-geometry-debuginfo: install check OK
2025-Apr-03 08:55:16 :: [i586] #4600 octave-image-debuginfo: install check OK
2025-Apr-03 08:55:33 :: [aarch64] #600 octave-fits-debuginfo: install check OK
2025-Apr-03 08:55:36 :: [x86_64] #5200 octave-gsl: install check OK
2025-Apr-03 08:55:41 :: [i586] #1300 octave-instrument-control: install check OK
2025-Apr-03 08:55:58 :: [x86_64] #5200 octave-gsl-debuginfo: install check OK
2025-Apr-03 08:56:07 :: [aarch64] #3700 octave-fuzzy-logic-toolkit: install check OK
2025-Apr-03 08:56:08 :: [i586] #1300 octave-instrument-control-debuginfo: install check OK
2025-Apr-03 08:56:21 :: [x86_64] #4600 octave-image: install check OK
2025-Apr-03 08:56:32 :: [i586] #1400 octave-interval: install check OK
2025-Apr-03 08:56:40 :: [aarch64] #700 octave-general: install check OK
2025-Apr-03 08:56:44 :: [x86_64] #4700 octave-image-acquisition: install check OK
2025-Apr-03 08:56:58 :: [i586] #1400 octave-interval-debuginfo: install check OK
2025-Apr-03 08:57:09 :: [x86_64] #4700 octave-image-acquisition-debuginfo: install check OK
2025-Apr-03 08:57:16 :: [aarch64] #700 octave-general-debuginfo: install check OK
2025-Apr-03 08:57:22 :: [i586] #1500 octave-io: install check OK
2025-Apr-03 08:57:33 :: [x86_64] #4600 octave-image-debuginfo: install check OK
2025-Apr-03 08:57:47 :: [i586] #1500 octave-io-debuginfo: install check OK
2025-Apr-03 08:57:50 :: [aarch64] #5100 octave-geometry: install check OK
2025-Apr-03 08:57:55 :: [x86_64] #1300 octave-instrument-control: install check OK
2025-Apr-03 08:58:11 :: [i586] #4000 octave-level-set: install check OK
2025-Apr-03 08:58:20 :: [x86_64] #1300 octave-instrument-control-debuginfo: install check OK
2025-Apr-03 08:58:36 :: [i586] #4000 octave-level-set-debuginfo: install check OK
2025-Apr-03 08:58:42 :: [x86_64] #1400 octave-interval: install check OK
2025-Apr-03 08:59:00 :: [i586] #1600 octave-lssa: install check OK
2025-Apr-03 08:59:05 :: [x86_64] #1400 octave-interval-debuginfo: install check OK
2025-Apr-03 08:59:22 :: [aarch64] #5100 octave-geometry-debuginfo: install check OK
2025-Apr-03 08:59:25 :: [i586] #1600 octave-lssa-debuginfo: install check OK
2025-Apr-03 08:59:26 :: [x86_64] #1500 octave-io: install check OK
2025-Apr-03 08:59:49 :: [x86_64] #1500 octave-io-debuginfo: install check OK
2025-Apr-03 08:59:52 :: [i586] #2000 octave-mapping: install check OK
2025-Apr-03 08:59:59 :: [aarch64] #5200 octave-gsl: install check OK
2025-Apr-03 09:00:10 :: [x86_64] #4000 octave-level-set: install check OK
2025-Apr-03 09:00:33 :: [x86_64] #4000 octave-level-set-debuginfo: install check OK
2025-Apr-03 09:00:34 :: [aarch64] #5200 octave-gsl-debuginfo: install check OK
2025-Apr-03 09:00:43 :: [i586] #2000 octave-mapping-debuginfo: install check OK
2025-Apr-03 09:00:55 :: [x86_64] #1600 octave-lssa: install check OK
2025-Apr-03 09:01:07 :: [aarch64] #4600 octave-image: install check OK
2025-Apr-03 09:01:08 :: [i586] #2100 octave-miscellaneous: install check OK
2025-Apr-03 09:01:17 :: [x86_64] #1600 octave-lssa-debuginfo: install check OK
2025-Apr-03 09:01:33 :: [i586] #2100 octave-miscellaneous-debuginfo: install check OK
2025-Apr-03 09:01:40 :: [aarch64] #4700 octave-image-acquisition: install check OK
2025-Apr-03 09:01:41 :: [x86_64] #2000 octave-mapping: install check OK
2025-Apr-03 09:01:57 :: [i586] #4500 octave-msh: install check OK
2025-Apr-03 09:02:21 :: [i586] #2200 octave-netcdf: install check OK
2025-Apr-03 09:02:24 :: [aarch64] #4700 octave-image-acquisition-debuginfo: install check OK
2025-Apr-03 09:02:27 :: [x86_64] #2000 octave-mapping-debuginfo: install check OK
2025-Apr-03 09:02:50 :: [i586] #2200 octave-netcdf-debuginfo: install check OK
2025-Apr-03 09:02:50 :: [x86_64] #2100 octave-miscellaneous: install check OK
2025-Apr-03 09:03:05 :: [aarch64] #4600 octave-image-debuginfo: install check OK
2025-Apr-03 09:03:13 :: [x86_64] #2100 octave-miscellaneous-debuginfo: install check OK
2025-Apr-03 09:03:14 :: [i586] #4400 octave-nurbs: install check OK
2025-Apr-03 09:03:35 :: [x86_64] #4500 octave-msh: install check OK
2025-Apr-03 09:03:39 :: [i586] #4400 octave-nurbs-debuginfo: install check OK
2025-Apr-03 09:03:41 :: [aarch64] #1300 octave-instrument-control: install check OK
2025-Apr-03 09:03:57 :: [x86_64] #2200 octave-netcdf: install check OK
2025-Apr-03 09:04:03 :: [i586] #5300 octave-ocl: install check OK
2025-Apr-03 09:04:19 :: [aarch64] #1300 octave-instrument-control-debuginfo: install check OK
2025-Apr-03 09:04:23 :: [x86_64] #2200 octave-netcdf-debuginfo: install check OK
2025-Apr-03 09:04:28 :: [i586] #5300 octave-ocl-debuginfo: install check OK
2025-Apr-03 09:04:45 :: [x86_64] #4400 octave-nurbs: install check OK
2025-Apr-03 09:04:51 :: [aarch64] #1400 octave-interval: install check OK
2025-Apr-03 09:04:52 :: [i586] #5000 octave-octclip: install check OK
2025-Apr-03 09:05:07 :: [x86_64] #4400 octave-nurbs-debuginfo: install check OK
2025-Apr-03 09:05:17 :: [i586] #4200 octave-octproj: install check OK
2025-Apr-03 09:05:26 :: [aarch64] #1400 octave-interval-debuginfo: install check OK
2025-Apr-03 09:05:29 :: [x86_64] #5300 octave-ocl: install check OK
2025-Apr-03 09:05:41 :: [i586] #5500 octave-optim: install check OK
2025-Apr-03 09:05:53 :: [x86_64] #5300 octave-ocl-debuginfo: install check OK
2025-Apr-03 09:05:58 :: [aarch64] #1500 octave-io: install check OK
2025-Apr-03 09:06:08 :: [i586] #5500 octave-optim-debuginfo: install check OK
2025-Apr-03 09:06:15 :: [x86_64] #5000 octave-octclip: install check OK
2025-Apr-03 09:06:32 :: [i586] #2600 octave-optiminterp: install check OK
2025-Apr-03 09:06:36 :: [aarch64] #1500 octave-io-debuginfo: install check OK
2025-Apr-03 09:06:38 :: [x86_64] #4200 octave-octproj: install check OK
2025-Apr-03 09:06:58 :: [i586] #2600 octave-optiminterp-debuginfo: install check OK
2025-Apr-03 09:07:00 :: [x86_64] #5500 octave-optim: install check OK
2025-Apr-03 09:07:09 :: [aarch64] #4000 octave-level-set: install check OK
2025-Apr-03 09:07:22 :: [i586] #2700 octave-quaternion: install check OK
2025-Apr-03 09:07:24 :: [x86_64] #5500 octave-optim-debuginfo: install check OK
2025-Apr-03 09:07:43 :: [aarch64] #4000 octave-level-set-debuginfo: install check OK
2025-Apr-03 09:07:46 :: [x86_64] #2600 octave-optiminterp: install check OK
2025-Apr-03 09:07:47 :: [i586] #2700 octave-quaternion-debuginfo: install check OK
2025-Apr-03 09:08:10 :: [x86_64] #2600 octave-optiminterp-debuginfo: install check OK
2025-Apr-03 09:08:11 :: [i586] #3600 octave-queueing: install check OK
2025-Apr-03 09:08:16 :: [aarch64] #1600 octave-lssa: install check OK
2025-Apr-03 09:08:32 :: [x86_64] #2700 octave-quaternion: install check OK
2025-Apr-03 09:08:35 :: [i586] #5400 octave-signal: install check OK
2025-Apr-03 09:08:51 :: [aarch64] #1600 octave-lssa-debuginfo: install check OK
2025-Apr-03 09:08:55 :: [x86_64] #2700 octave-quaternion-debuginfo: install check OK
2025-Apr-03 09:09:00 :: [i586] #5400 octave-signal-debuginfo: install check OK
2025-Apr-03 09:09:24 :: [x86_64] #3600 octave-queueing: install check OK
2025-Apr-03 09:09:24 :: [i586] #5600 octave-sockets: install check OK
2025-Apr-03 09:09:27 :: [aarch64] #2000 octave-mapping: install check OK
2025-Apr-03 09:09:49 :: [i586] #5600 octave-sockets-debuginfo: install check OK
2025-Apr-03 09:09:50 :: [x86_64] #5400 octave-signal: install check OK
2025-Apr-03 09:10:12 :: [x86_64] #5400 octave-signal-debuginfo: install check OK
2025-Apr-03 09:10:12 :: [i586] #3100 octave-struct: install check OK
2025-Apr-03 09:10:32 :: [aarch64] #2000 octave-mapping-debuginfo: install check OK
2025-Apr-03 09:10:34 :: [x86_64] #5600 octave-sockets: install check OK
2025-Apr-03 09:10:37 :: [i586] #3100 octave-struct-debuginfo: install check OK
2025-Apr-03 09:10:57 :: [x86_64] #5600 octave-sockets-debuginfo: install check OK
2025-Apr-03 09:11:01 :: [i586] #3200 octave-vibes: install check OK
2025-Apr-03 09:11:06 :: [aarch64] #2100 octave-miscellaneous: install check OK
2025-Apr-03 09:11:26 :: [i586] #3200 octave-vibes-debuginfo: install check OK
2025-Apr-03 09:11:29 :: [x86_64] #3100 octave-struct: install check OK
2025-Apr-03 09:11:41 :: [aarch64] #2100 octave-miscellaneous-debuginfo: install check OK
2025-Apr-03 09:11:50 :: [i586] #3300 octave-zeromq: install check OK
2025-Apr-03 09:12:05 :: [x86_64] #3100 octave-struct-debuginfo: install check OK
2025-Apr-03 09:12:16 :: [i586] #3300 octave-zeromq-debuginfo: install check OK
2025-Apr-03 09:12:17 :: [aarch64] #4500 octave-msh: install check OK
2025-Apr-03 09:12:31 :: [x86_64] #3200 octave-vibes: install check OK
2025-Apr-03 09:12:53 :: [aarch64] #2200 octave-netcdf: install check OK
2025-Apr-03 09:12:56 :: [x86_64] #3200 octave-vibes-debuginfo: install check OK
2025-Apr-03 09:13:18 :: [x86_64] #3300 octave-zeromq: install check OK
2025-Apr-03 09:13:32 :: [aarch64] #2200 octave-netcdf-debuginfo: install check OK
2025-Apr-03 09:13:41 :: [x86_64] #3300 octave-zeromq-debuginfo: install check OK
2025-Apr-03 09:14:05 :: [aarch64] #4400 octave-nurbs: install check OK
2025-Apr-03 09:14:39 :: [aarch64] #4400 octave-nurbs-debuginfo: install check OK
2025-Apr-03 09:15:14 :: [aarch64] #5300 octave-ocl: install check OK
2025-Apr-03 09:15:49 :: [aarch64] #5300 octave-ocl-debuginfo: install check OK
2025-Apr-03 09:16:23 :: [aarch64] #5000 octave-octclip: install check OK
2025-Apr-03 09:16:57 :: [aarch64] #4200 octave-octproj: install check OK
2025-Apr-03 09:17:30 :: [aarch64] #5500 octave-optim: install check OK
2025-Apr-03 09:18:07 :: [aarch64] #5500 octave-optim-debuginfo: install check OK
2025-Apr-03 09:18:45 :: [aarch64] #2600 octave-optiminterp: install check OK
2025-Apr-03 09:19:27 :: [aarch64] #2600 octave-optiminterp-debuginfo: install check OK
2025-Apr-03 09:20:12 :: [aarch64] #2700 octave-quaternion: install check OK
2025-Apr-03 09:20:46 :: [aarch64] #2700 octave-quaternion-debuginfo: install check OK
2025-Apr-03 09:21:19 :: [aarch64] #3600 octave-queueing: install check OK
2025-Apr-03 09:21:52 :: [aarch64] #5400 octave-signal: install check OK
2025-Apr-03 09:22:26 :: [aarch64] #5400 octave-signal-debuginfo: install check OK
2025-Apr-03 09:22:58 :: [aarch64] #5600 octave-sockets: install check OK
2025-Apr-03 09:23:32 :: [aarch64] #5600 octave-sockets-debuginfo: install check OK
2025-Apr-03 09:24:05 :: [aarch64] #3100 octave-struct: install check OK
2025-Apr-03 09:24:39 :: [aarch64] #3100 octave-struct-debuginfo: install check OK
2025-Apr-03 09:25:12 :: [aarch64] #3200 octave-vibes: install check OK
2025-Apr-03 09:25:46 :: [aarch64] #3200 octave-vibes-debuginfo: install check OK
2025-Apr-03 09:26:20 :: [aarch64] #3300 octave-zeromq: install check OK
2025-Apr-03 09:26:59 :: [aarch64] #3300 octave-zeromq-debuginfo: install check OK
2025-Apr-03 09:27:02 :: [x86_64-i586] plan: #2 +2 -2 =11598
2025-Apr-03 09:27:33 :: [x86_64-i586] arepo build OK
2025-Apr-03 09:27:50 :: [x86_64-i586] generated apt indices
2025-Apr-03 09:27:52 :: [x86_64-i586] created next repo
2025-Apr-03 09:28:04 :: [x86_64-i586] dependencies check OK
2025-Apr-03 09:28:06 :: gears inheritance check OK
2025-Apr-03 09:28:07 :: srpm inheritance check OK
girar-check-perms: access to octave ALLOWED for cas: project leader
check-subtask-perms: #200: octave: allowed for cas
girar-check-perms: access to octave-audio ALLOWED for cas: project leader welcomes random builders
check-subtask-perms: #300: octave-audio: allowed for cas
girar-check-perms: access to octave-dicom ALLOWED for cas: project leader welcomes random builders
check-subtask-perms: #400: octave-dicom: allowed for cas
girar-check-perms: access to octave-econometrics ALLOWED for cas: project leader welcomes random builders
check-subtask-perms: #500: octave-econometrics: allowed for cas
girar-check-perms: access to octave-fits ALLOWED for cas: project leader welcomes random builders
check-subtask-perms: #600: octave-fits: allowed for cas
girar-check-perms: access to octave-general ALLOWED for cas: project leader welcomes random builders
check-subtask-perms: #700: octave-general: allowed for cas
girar-check-perms: access to octave-instrument-control ALLOWED for cas: project leader welcomes random builders
check-subtask-perms: #1300: octave-instrument-control: allowed for cas
girar-check-perms: access to octave-interval ALLOWED for cas: project leader welcomes random builders
check-subtask-perms: #1400: octave-interval: allowed for cas
girar-check-perms: access to octave-io ALLOWED for cas: project leader welcomes random builders
check-subtask-perms: #1500: octave-io: allowed for cas
girar-check-perms: access to octave-lssa ALLOWED for cas: project leader welcomes random builders
check-subtask-perms: #1600: octave-lssa: allowed for cas
girar-check-perms: access to octave-mapping ALLOWED for cas: project leader welcomes random builders
check-subtask-perms: #2000: octave-mapping: allowed for cas
girar-check-perms: access to octave-miscellaneous ALLOWED for cas: project leader welcomes random builders
check-subtask-perms: #2100: octave-miscellaneous: allowed for cas
girar-check-perms: access to octave-netcdf ALLOWED for cas: project leader welcomes random builders
check-subtask-perms: #2200: octave-netcdf: allowed for cas
girar-check-perms: access to octave-optiminterp ALLOWED for cas: project leader welcomes random builders
check-subtask-perms: #2600: octave-optiminterp: allowed for cas
girar-check-perms: access to octave-quaternion ALLOWED for cas: project leader welcomes random builders
check-subtask-perms: #2700: octave-quaternion: allowed for cas
girar-check-perms: access to octave-struct ALLOWED for cas: project leader welcomes random builders
check-subtask-perms: #3100: octave-struct: allowed for cas
girar-check-perms: access to octave-vibes ALLOWED for cas: project leader welcomes random builders
check-subtask-perms: #3200: octave-vibes: allowed for cas
girar-check-perms: access to octave-zeromq ALLOWED for cas: project leader welcomes random builders
check-subtask-perms: #3300: octave-zeromq: allowed for cas
girar-check-perms: access to octave-control ALLOWED for cas: project leader welcomes random builders
check-subtask-perms: #3400: octave-control: allowed for cas
girar-check-perms: access to octave-communications ALLOWED for cas: project leader welcomes random builders
check-subtask-perms: #3500: octave-communications: allowed for cas
girar-check-perms: access to octave-queueing ALLOWED for cas: project leader welcomes random builders
check-subtask-perms: #3600: octave-queueing: allowed for cas
girar-check-perms: access to octave-fuzzy-logic-toolkit ALLOWED for cas: project leader welcomes random builders
check-subtask-perms: #3700: octave-fuzzy-logic-toolkit: allowed for cas
girar-check-perms: access to octave-level-set ALLOWED for cas: project leader welcomes random builders
check-subtask-perms: #4000: octave-level-set: allowed for cas
girar-check-perms: access to octave-financial ALLOWED for cas: project leader welcomes random builders
check-subtask-perms: #4100: octave-financial: allowed for cas
girar-check-perms: access to octave-octproj ALLOWED for cas: project leader welcomes random builders
check-subtask-perms: #4200: octave-octproj: allowed for cas
girar-check-perms: access to octave-nurbs ALLOWED for cas: project leader welcomes random builders
check-subtask-perms: #4400: octave-nurbs: allowed for cas
girar-check-perms: access to octave-msh ALLOWED for cas: project leader welcomes random builders
check-subtask-perms: #4500: octave-msh: allowed for cas
girar-check-perms: access to octave-image ALLOWED for cas: project leader welcomes random builders
check-subtask-perms: #4600: octave-image: allowed for cas
girar-check-perms: access to octave-image-acquisition ALLOWED for cas: project leader welcomes random builders
check-subtask-perms: #4700: octave-image-acquisition: allowed for cas
girar-check-perms: access to octave-octclip ALLOWED for cas: project leader welcomes random builders
check-subtask-perms: #5000: octave-octclip: allowed for cas
girar-check-perms: access to octave-geometry ALLOWED for cas: project leader welcomes random builders
check-subtask-perms: #5100: octave-geometry: allowed for cas
girar-check-perms: access to octave-gsl ALLOWED for cas: project leader welcomes random builders
check-subtask-perms: #5200: octave-gsl: allowed for cas
girar-check-perms: access to octave-ocl ALLOWED for cas: project leader welcomes random builders
check-subtask-perms: #5300: octave-ocl: allowed for cas
girar-check-perms: access to octave-signal ALLOWED for cas: project leader welcomes random builders
check-subtask-perms: #5400: octave-signal: allowed for cas
girar-check-perms: access to octave-optim ALLOWED for cas: project leader welcomes random builders
check-subtask-perms: #5500: octave-optim: allowed for cas
girar-check-perms: access to octave-sockets ALLOWED for cas: project leader welcomes random builders
check-subtask-perms: #5600: octave-sockets: allowed for cas
girar-check-perms: access to octave-ltfat ALLOWED for cas: project leader welcomes random builders
check-subtask-perms: #5700: octave-ltfat: allowed for cas
2025-Apr-03 09:28:09 :: acl check OK
2025-Apr-03 09:28:34 :: created contents_index files
2025-Apr-03 09:28:44 :: created hash files: aarch64 i586 noarch src x86_64-i586 x86_64
2025-Apr-03 09:28:48 :: task #379725 for sisyphus TESTED
2025-Apr-03 09:28:52 :: task is ready for commit
2025-Apr-03 09:28:57 :: repo clone OK
2025-Apr-03 09:29:01 :: packages update OK
2025-Apr-03 09:29:12 :: [x86_64 i586 aarch64 noarch] update OK
2025-Apr-03 09:29:13 :: [x86_64-i586] update OK
2025-Apr-03 09:29:13 :: repo update OK
2025-Apr-03 09:29:29 :: repo save OK
2025-Apr-03 09:29:30 :: src index update OK
2025-Apr-03 09:29:35 :: updated /gears/o/octave.git branch `sisyphus'
2025-Apr-03 09:29:36 :: updated /srpms/o/octave-audio.git branch `sisyphus'
2025-Apr-03 09:29:36 :: updated /srpms/o/octave-communications.git branch `sisyphus'
2025-Apr-03 09:29:36 :: updated /gears/o/octave-control.git branch `sisyphus'
2025-Apr-03 09:29:36 :: updated /gears/o/octave-dicom.git branch `sisyphus'
2025-Apr-03 09:29:36 :: updated /gears/o/octave-econometrics.git branch `sisyphus'
2025-Apr-03 09:29:37 :: updated /srpms/o/octave-financial.git branch `sisyphus'
2025-Apr-03 09:29:37 :: updated /srpms/o/octave-fits.git branch `sisyphus'
2025-Apr-03 09:29:37 :: updated /srpms/o/octave-fuzzy-logic-toolkit.git branch `sisyphus'
2025-Apr-03 09:29:38 :: updated /srpms/o/octave-general.git branch `sisyphus'
2025-Apr-03 09:29:38 :: updated /srpms/o/octave-geometry.git branch `sisyphus'
2025-Apr-03 09:29:38 :: updated /srpms/o/octave-gsl.git branch `sisyphus'
2025-Apr-03 09:29:39 :: updated /srpms/o/octave-image.git branch `sisyphus'
2025-Apr-03 09:29:39 :: updated /srpms/o/octave-image-acquisition.git branch `sisyphus'
2025-Apr-03 09:29:40 :: updated /srpms/o/octave-instrument-control.git branch `sisyphus'
2025-Apr-03 09:29:41 :: updated /srpms/o/octave-interval.git branch `sisyphus'
2025-Apr-03 09:29:41 :: updated /srpms/o/octave-io.git branch `sisyphus'
2025-Apr-03 09:29:41 :: updated /srpms/o/octave-level-set.git branch `sisyphus'
2025-Apr-03 09:29:42 :: updated /srpms/o/octave-lssa.git branch `sisyphus'
2025-Apr-03 09:29:43 :: updated /srpms/o/octave-mapping.git branch `sisyphus'
2025-Apr-03 09:29:43 :: updated /srpms/o/octave-miscellaneous.git branch `sisyphus'
2025-Apr-03 09:29:43 :: updated /srpms/o/octave-msh.git branch `sisyphus'
2025-Apr-03 09:29:44 :: updated /srpms/o/octave-netcdf.git branch `sisyphus'
2025-Apr-03 09:29:44 :: updated /srpms/o/octave-nurbs.git branch `sisyphus'
2025-Apr-03 09:29:44 :: updated /srpms/o/octave-ocl.git branch `sisyphus'
2025-Apr-03 09:29:46 :: updated /srpms/o/octave-octclip.git branch `sisyphus'
2025-Apr-03 09:29:49 :: updated /srpms/o/octave-octproj.git branch `sisyphus'
2025-Apr-03 09:29:50 :: updated /srpms/o/octave-optim.git branch `sisyphus'
2025-Apr-03 09:29:50 :: updated /srpms/o/octave-optiminterp.git branch `sisyphus'
2025-Apr-03 09:29:50 :: updated /gears/o/octave-quaternion.git branch `sisyphus'
2025-Apr-03 09:29:51 :: updated /srpms/o/octave-queueing.git branch `sisyphus'
2025-Apr-03 09:29:51 :: updated /srpms/o/octave-signal.git branch `sisyphus'
2025-Apr-03 09:29:52 :: updated /srpms/o/octave-sockets.git branch `sisyphus'
2025-Apr-03 09:29:52 :: updated /srpms/o/octave-struct.git branch `sisyphus'
2025-Apr-03 09:29:52 :: updated /gears/o/octave-vibes.git branch `sisyphus'
2025-Apr-03 09:29:52 :: updated /srpms/o/octave-zeromq.git branch `sisyphus'
2025-Apr-03 09:29:52 :: saved /srpms/o/octave-ltfat.git branch `sisyphus' as `old/sisyphus-task379725'
2025-Apr-03 09:29:52 :: removed /srpms/o/octave-ltfat.git branch `sisyphus'
2025-Apr-03 09:29:58 :: gears update OK
2025-Apr-03 09:29:59 :: ACL for old project `octave-ltfat' removed
2025-Apr-03 09:29:59 :: task #379725 for sisyphus DONE
^ permalink raw reply [flat|nested] 18+ messages in thread