* [#379723] FAILED libspnav.git=1.2-alt1
@ 2025-03-30 18:57 Girar awaiter (cas)
2025-03-31 9:25 ` [#379723] DONE (try 2) libspnav.git=1.2-alt1 Girar pender (cas)
0 siblings, 1 reply; 2+ messages in thread
From: Girar awaiter (cas) @ 2025-03-30 18:57 UTC (permalink / raw)
To: Andrey Cherepanov; +Cc: sisyphus-incominger, girar-builder-sisyphus
https://git.altlinux.org/tasks/379723/logs/events.1.1.log
https://packages.altlinux.org/tasks/379723
subtask name aarch64 i586 x86_64
#100 libspnav failed failed failed
2025-Mar-30 18:57:26 :: task #379723 for sisyphus started by cas:
#100 build 1.2-alt1 from /people/cas/packages/libspnav.git fetched at 2025-Mar-30 18:57:25
2025-Mar-30 18:57:28 :: [x86_64] #100 libspnav.git 1.2-alt1: build start
2025-Mar-30 18:57:28 :: [i586] #100 libspnav.git 1.2-alt1: build start
2025-Mar-30 18:57:28 :: [aarch64] #100 libspnav.git 1.2-alt1: build start
[i586] patching file Makefile.in
[i586] Hunk #1 FAILED at 10.
[i586] 1 out of 1 hunk FAILED -- saving rejects to file Makefile.in.rej
2025-Mar-30 18:57:43 :: [i586] libspnav.git 1.2-alt1: remote: build failed
2025-Mar-30 18:57:43 :: [i586] #100 libspnav.git 1.2-alt1: build FAILED
2025-Mar-30 18:57:43 :: [i586] requesting cancellation of task processing
[x86_64] patching file Makefile.in
[x86_64] Hunk #1 FAILED at 10.
[x86_64] 1 out of 1 hunk FAILED -- saving rejects to file Makefile.in.rej
2025-Mar-30 18:57:44 :: [x86_64] libspnav.git 1.2-alt1: remote: build failed
2025-Mar-30 18:57:44 :: [x86_64] #100 libspnav.git 1.2-alt1: build FAILED
[aarch64] patching file Makefile.in
[aarch64] Hunk #1 FAILED at 10.
[aarch64] 1 out of 1 hunk FAILED -- saving rejects to file Makefile.in.rej
2025-Mar-30 18:57:53 :: [aarch64] libspnav.git 1.2-alt1: remote: build failed
2025-Mar-30 18:57:53 :: [aarch64] #100 libspnav.git 1.2-alt1: build FAILED
2025-Mar-30 18:57:43 :: [i586] build FAILED
2025-Mar-30 18:57:44 :: [x86_64] build FAILED
2025-Mar-30 18:57:53 :: [aarch64] build FAILED
2025-Mar-30 18:57:53 :: task #379723 for sisyphus FAILED
^ permalink raw reply [flat|nested] 2+ messages in thread
* [#379723] DONE (try 2) libspnav.git=1.2-alt1
2025-03-30 18:57 [#379723] FAILED libspnav.git=1.2-alt1 Girar awaiter (cas)
@ 2025-03-31 9:25 ` Girar pender (cas)
0 siblings, 0 replies; 2+ messages in thread
From: Girar pender (cas) @ 2025-03-31 9:25 UTC (permalink / raw)
To: Andrey Cherepanov; +Cc: sisyphus-incominger, girar-builder-sisyphus
https://git.altlinux.org/tasks/archive/done/_370/379723/logs/events.2.2.log
https://packages.altlinux.org/tasks/379723
subtask name aarch64 i586 x86_64
#200 libspnav 38 27 27
2025-Mar-31 09:20:39 :: task #379723 for sisyphus resumed by cas:
#100 removed
#200 build 1.2-alt1 from /people/cas/packages/libspnav.git fetched at 2025-Mar-31 09:12:49
2025-Mar-31 09:20:39 :: waiting for a shared lock on sisyphus
2025-Mar-31 09:20:44 :: acquired a shared lock on sisyphus
2025-Mar-31 09:20:46 :: [aarch64] #200 libspnav.git 1.2-alt1: build start
2025-Mar-31 09:20:46 :: [i586] #200 libspnav.git 1.2-alt1: build start
2025-Mar-31 09:20:46 :: [x86_64] #200 libspnav.git 1.2-alt1: build start
2025-Mar-31 09:20:55 :: [i586] #200 libspnav.git 1.2-alt1: build OK (cached)
2025-Mar-31 09:20:56 :: [x86_64] #200 libspnav.git 1.2-alt1: build OK (cached)
2025-Mar-31 09:21:03 :: [aarch64] #200 libspnav.git 1.2-alt1: build OK (cached)
2025-Mar-31 09:21:15 :: #200: libspnav.git 1.2-alt1: build check OK
2025-Mar-31 09:21:16 :: build check OK
2025-Mar-31 09:21:18 :: noarch check OK
2025-Mar-31 09:21:20 :: plan: src +1 -1 =20039, aarch64 +3 -3 =34826, i586 +3 -3 =33693, x86_64 +3 -3 =35632
#200 libspnav 1.1-alt1 -> 1.2-alt1
Sun Mar 30 2025 Andrey Cherepanov <cas@altlinux> 1.2-alt1
- New version.
2025-Mar-31 09:22:01 :: patched apt indices
2025-Mar-31 09:22:11 :: created next repo
2025-Mar-31 09:22:27 :: duplicate provides check OK
2025-Mar-31 09:23:07 :: dependencies check OK
2025-Mar-31 09:23:08 :: [i586] no need to repeat ELF symbols check
2025-Mar-31 09:23:41 :: [x86_64 i586 aarch64] ELF symbols check OK
2025-Mar-31 09:23:52 :: [i586] #200 libspnav: install check OK (cached)
2025-Mar-31 09:23:52 :: [x86_64] #200 libspnav: install check OK (cached)
2025-Mar-31 09:23:56 :: [i586] #200 libspnav-debuginfo: install check OK (cached)
2025-Mar-31 09:23:57 :: [x86_64] #200 libspnav-debuginfo: install check OK (cached)
2025-Mar-31 09:24:00 :: [i586] #200 libspnav-devel: install check OK (cached)
2025-Mar-31 09:24:00 :: [aarch64] #200 libspnav: install check OK (cached)
2025-Mar-31 09:24:01 :: [x86_64] #200 libspnav-devel: install check OK (cached)
2025-Mar-31 09:24:08 :: [aarch64] #200 libspnav-debuginfo: install check OK (cached)
2025-Mar-31 09:24:16 :: [aarch64] #200 libspnav-devel: install check OK (cached)
2025-Mar-31 09:24:17 :: [x86_64-i586] plan: #0 +2 -2 =11597
2025-Mar-31 09:24:32 :: [x86_64-i586] generated apt indices
2025-Mar-31 09:24:33 :: [x86_64-i586] created next repo
2025-Mar-31 09:24:44 :: [x86_64-i586] dependencies check OK
2025-Mar-31 09:24:45 :: gears inheritance check OK
2025-Mar-31 09:24:46 :: srpm inheritance check OK
girar-check-perms: access to libspnav ALLOWED for cas: project leader
check-subtask-perms: #200: libspnav: allowed for cas
2025-Mar-31 09:24:46 :: acl check OK
2025-Mar-31 09:24:58 :: created contents_index files
2025-Mar-31 09:25:05 :: created hash files: aarch64 i586 src x86_64-i586 x86_64
2025-Mar-31 09:25:07 :: task #379723 for sisyphus TESTED
2025-Mar-31 09:25:08 :: task is ready for commit
2025-Mar-31 09:25:12 :: repo clone OK
2025-Mar-31 09:25:12 :: packages update OK
2025-Mar-31 09:25:19 :: [x86_64 i586 aarch64] update OK
2025-Mar-31 09:25:19 :: [x86_64-i586] update OK
2025-Mar-31 09:25:20 :: repo update OK
2025-Mar-31 09:25:30 :: repo save OK
2025-Mar-31 09:25:30 :: src index update OK
2025-Mar-31 09:25:30 :: updated /gears/l/libspnav.git branch `sisyphus'
2025-Mar-31 09:25:42 :: gears update OK
2025-Mar-31 09:25:42 :: task #379723 for sisyphus DONE
^ permalink raw reply [flat|nested] 2+ messages in thread
end of thread, other threads:[~2025-03-31 9:25 UTC | newest]
Thread overview: 2+ messages (download: mbox.gz / follow: Atom feed)
-- links below jump to the message on this page --
2025-03-30 18:57 [#379723] FAILED libspnav.git=1.2-alt1 Girar awaiter (cas)
2025-03-31 9:25 ` [#379723] DONE (try 2) libspnav.git=1.2-alt1 Girar pender (cas)
ALT Linux Girar Builder robot reports
This inbox may be cloned and mirrored by anyone:
git clone --mirror http://lore.altlinux.org/sisyphus-incominger/0 sisyphus-incominger/git/0.git
# If you have public-inbox 1.1+ installed, you may
# initialize and index your mirror using the following commands:
public-inbox-init -V2 sisyphus-incominger sisyphus-incominger/ http://lore.altlinux.org/sisyphus-incominger \
sisyphus-incominger@lists.altlinux.org sisyphus-incominger@lists.altlinux.ru sisyphus-incominger@lists.altlinux.com
public-inbox-index sisyphus-incominger
Example config snippet for mirrors.
Newsgroup available over NNTP:
nntp://lore.altlinux.org/org.altlinux.lists.sisyphus-incominger
AGPL code for this site: git clone https://public-inbox.org/public-inbox.git