ALT Linux Girar Builder robot reports
 help / color / mirror / Atom feed
* [#379420] [test-only] FAILED python3-module-scipy.git=1.11.4-alt4
@ 2025-03-27 14:07 Girar awaiter (qualimock)
  2025-03-27 14:43 ` [#379420] TESTED (try 2) python3-module-scipy.git=1.11.4-alt4 Girar awaiter (qualimock)
                   ` (2 more replies)
  0 siblings, 3 replies; 4+ messages in thread
From: Girar awaiter (qualimock) @ 2025-03-27 14:07 UTC (permalink / raw)
  To: Alexey Volkov; +Cc: sisyphus-incominger, girar-builder-sisyphus

[-- Warning: decoded text below may be mangled, UTF-8 assumed --]
[-- Attachment #1: Type: text/plain; charset=unknown-8bit, Size: 6054 bytes --]

https://git.altlinux.org/tasks/379420/logs/events.1.1.log
https://packages.altlinux.org/tasks/379420

subtask  name                  aarch64    i586  x86_64
   #100  python3-module-scipy     6:48  failed    3:56

2025-Mar-27 14:00:38 :: test-only task #379420 for sisyphus started by qualimock:
#100 build 1.11.4-alt4 from /people/qualimock/packages/python3-module-scipy.git fetched at 2025-Mar-27 14:00:30
2025-Mar-27 14:00:40 :: [x86_64] #100 python3-module-scipy.git 1.11.4-alt4: build start
2025-Mar-27 14:00:40 :: [i586] #100 python3-module-scipy.git 1.11.4-alt4: build start
2025-Mar-27 14:00:40 :: [aarch64] #100 python3-module-scipy.git 1.11.4-alt4: build start
[i586] scipy/interpolate/dfitpackmodule.c:2728:155: note: expected ‘F_INT *’ {aka ‘long int *’} but argument is of type ‘int *’
[i586] scipy/interpolate/dfitpackmodule.c:2728:162: error: passing argument 26 of ‘f2py_func’ from incompatible pointer type [-Wincompatible-pointer-types]
[i586]  2728 |                 (*f2py_func)(&iopt,x,y,w,&m,&xb,&xe,&k,&s,&nest,&tol,&maxit,&k1,&k2,&n,t,c,&fp,fpint,wrk,wrk+nest,wrk+nest*k2,wrk+nest*2*k2,wrk+nest*3*k2,nrdata,&ier) ;
[i586] --
[i586] scipy/interpolate/dfitpackmodule.c: In function ‘f2py_rout_dfitpack_fpcurf1’:
[i586] scipy/interpolate/dfitpackmodule.c:3110:30: error: passing argument 1 of ‘f2py_func’ from incompatible pointer type [-Wincompatible-pointer-types]
[i586]  3110 |                 (*f2py_func)(&iopt,x,y,w,&m,&xb,&xe,&k,&s,&nest,&tol,&maxit,&k1,&k2,&n,t,c,&fp,fpint,wrk,wrk+nest,wrk+nest*k2,wrk+nest*2*k2,wrk+nest*3*k2,nrdata,&ier) ;
[i586] --
[i586] scipy/interpolate/dfitpackmodule.c:3110:30: note: expected ‘F_INT *’ {aka ‘long int *’} but argument is of type ‘int *’
[i586] scipy/interpolate/dfitpackmodule.c:3110:42: error: passing argument 5 of ‘f2py_func’ from incompatible pointer type [-Wincompatible-pointer-types]
[i586]  3110 |                 (*f2py_func)(&iopt,x,y,w,&m,&xb,&xe,&k,&s,&nest,&tol,&maxit,&k1,&k2,&n,t,c,&fp,fpint,wrk,wrk+nest,wrk+nest*k2,wrk+nest*2*k2,wrk+nest*3*k2,nrdata,&ier) ;
[i586] --
[i586] scipy/interpolate/dfitpackmodule.c:3110:42: note: expected ‘F_INT *’ {aka ‘long int *’} but argument is of type ‘int *’
[i586] scipy/interpolate/dfitpackmodule.c:3110:53: error: passing argument 8 of ‘f2py_func’ from incompatible pointer type [-Wincompatible-pointer-types]
[i586]  3110 |                 (*f2py_func)(&iopt,x,y,w,&m,&xb,&xe,&k,&s,&nest,&tol,&maxit,&k1,&k2,&n,t,c,&fp,fpint,wrk,wrk+nest,wrk+nest*k2,wrk+nest*2*k2,wrk+nest*3*k2,nrdata,&ier) ;
[i586] --
[i586] scipy/interpolate/dfitpackmodule.c:3110:53: note: expected ‘F_INT *’ {aka ‘long int *’} but argument is of type ‘int *’
[i586] scipy/interpolate/dfitpackmodule.c:3110:59: error: passing argument 10 of ‘f2py_func’ from incompatible pointer type [-Wincompatible-pointer-types]
[i586]  3110 |                 (*f2py_func)(&iopt,x,y,w,&m,&xb,&xe,&k,&s,&nest,&tol,&maxit,&k1,&k2,&n,t,c,&fp,fpint,wrk,wrk+nest,wrk+nest*k2,wrk+nest*2*k2,wrk+nest*3*k2,nrdata,&ier) ;
[i586] --
[i586] scipy/interpolate/dfitpackmodule.c:3110:59: note: expected ‘F_INT *’ {aka ‘long int *’} but argument is of type ‘int *’
[i586] scipy/interpolate/dfitpackmodule.c:3110:70: error: passing argument 12 of ‘f2py_func’ from incompatible pointer type [-Wincompatible-pointer-types]
[i586]  3110 |                 (*f2py_func)(&iopt,x,y,w,&m,&xb,&xe,&k,&s,&nest,&tol,&maxit,&k1,&k2,&n,t,c,&fp,fpint,wrk,wrk+nest,wrk+nest*k2,wrk+nest*2*k2,wrk+nest*3*k2,nrdata,&ier) ;
[i586] --
[i586] scipy/interpolate/dfitpackmodule.c:3110:70: note: expected ‘F_INT *’ {aka ‘long int *’} but argument is of type ‘int *’
[i586] scipy/interpolate/dfitpackmodule.c:3110:77: error: passing argument 13 of ‘f2py_func’ from incompatible pointer type [-Wincompatible-pointer-types]
[i586]  3110 |                 (*f2py_func)(&iopt,x,y,w,&m,&xb,&xe,&k,&s,&nest,&tol,&maxit,&k1,&k2,&n,t,c,&fp,fpint,wrk,wrk+nest,wrk+nest*k2,wrk+nest*2*k2,wrk+nest*3*k2,nrdata,&ier) ;
[i586] --
[i586] scipy/interpolate/dfitpackmodule.c:3110:77: note: expected ‘F_INT *’ {aka ‘long int *’} but argument is of type ‘int *’
[i586] scipy/interpolate/dfitpackmodule.c:3110:81: error: passing argument 14 of ‘f2py_func’ from incompatible pointer type [-Wincompatible-pointer-types]
[i586]  3110 |                 (*f2py_func)(&iopt,x,y,w,&m,&xb,&xe,&k,&s,&nest,&tol,&maxit,&k1,&k2,&n,t,c,&fp,fpint,wrk,wrk+nest,wrk+nest*k2,wrk+nest*2*k2,wrk+nest*3*k2,nrdata,&ier) ;
[i586] --
[i586] scipy/interpolate/dfitpackmodule.c:3110:81: note: expected ‘F_INT *’ {aka ‘long int *’} but argument is of type ‘int *’
[i586] scipy/interpolate/dfitpackmodule.c:3110:85: error: passing argument 15 of ‘f2py_func’ from incompatible pointer type [-Wincompatible-pointer-types]
[i586]  3110 |                 (*f2py_func)(&iopt,x,y,w,&m,&xb,&xe,&k,&s,&nest,&tol,&maxit,&k1,&k2,&n,t,c,&fp,fpint,wrk,wrk+nest,wrk+nest*k2,wrk+nest*2*k2,wrk+nest*3*k2,nrdata,&ier) ;
[i586] --
[i586] scipy/interpolate/dfitpackmodule.c:3110:85: note: expected ‘F_INT *’ {aka ‘long int *’} but argument is of type ‘int *’
[i586] scipy/interpolate/dfitpackmodule.c:3110:155: error: passing argument 25 of ‘f2py_func’ from incompatible pointer type [-Wincompatible-pointer-types]
[i586]  3110 |                 (*f2py_func)(&iopt,x,y,w,&m,&xb,&xe,&k,&s,&nest,&tol,&maxit,&k1,&k2,&n,t,c,&fp,fpint,wrk,wrk+nest,wrk+nest*k2,wrk+nest*2*k2,wrk+nest*3*k2,nrdata,&ier) ;
2025-Mar-27 14:02:06 :: [i586] python3-module-scipy.git 1.11.4-alt4: remote: build failed
2025-Mar-27 14:02:06 :: [i586] #100 python3-module-scipy.git 1.11.4-alt4: build FAILED
2025-Mar-27 14:02:06 :: [i586] requesting cancellation of task processing
2025-Mar-27 14:04:36 :: [x86_64] #100 python3-module-scipy.git 1.11.4-alt4: build OK
2025-Mar-27 14:07:28 :: [aarch64] #100 python3-module-scipy.git 1.11.4-alt4: build OK
2025-Mar-27 14:02:06 :: [i586] build FAILED
2025-Mar-27 14:07:29 :: task #379420 for sisyphus FAILED


^ permalink raw reply	[flat|nested] 4+ messages in thread

end of thread, other threads:[~2025-04-02 12:13 UTC | newest]

Thread overview: 4+ messages (download: mbox.gz / follow: Atom feed)
-- links below jump to the message on this page --
2025-03-27 14:07 [#379420] [test-only] FAILED python3-module-scipy.git=1.11.4-alt4 Girar awaiter (qualimock)
2025-03-27 14:43 ` [#379420] TESTED (try 2) python3-module-scipy.git=1.11.4-alt4 Girar awaiter (qualimock)
2025-04-01 13:35 ` [#379420] EPERM (try 3) python3-module-scipy.git=1.11.4-alt4 Girar awaiter (qualimock)
2025-04-02 12:13 ` [#379420] DONE (try 4) python3-module-scipy.git=1.11.4-alt4 Girar pender (qualimock)

ALT Linux Girar Builder robot reports

This inbox may be cloned and mirrored by anyone:

	git clone --mirror http://lore.altlinux.org/sisyphus-incominger/0 sisyphus-incominger/git/0.git

	# If you have public-inbox 1.1+ installed, you may
	# initialize and index your mirror using the following commands:
	public-inbox-init -V2 sisyphus-incominger sisyphus-incominger/ http://lore.altlinux.org/sisyphus-incominger \
		sisyphus-incominger@lists.altlinux.org sisyphus-incominger@lists.altlinux.ru sisyphus-incominger@lists.altlinux.com
	public-inbox-index sisyphus-incominger

Example config snippet for mirrors.
Newsgroup available over NNTP:
	nntp://lore.altlinux.org/org.altlinux.lists.sisyphus-incominger


AGPL code for this site: git clone https://public-inbox.org/public-inbox.git