ALT Linux Girar Builder robot reports
 help / color / mirror / Atom feed
* [#379419] FAILED zot.git=2.1.2-alt1
@ 2025-03-27 13:34 Girar awaiter (gamzin)
  2025-03-27 14:10 ` [#379419] EPERM (try 2) zot.git=2.1.2-alt1 Girar awaiter (gamzin)
                   ` (2 more replies)
  0 siblings, 3 replies; 4+ messages in thread
From: Girar awaiter (gamzin) @ 2025-03-27 13:34 UTC (permalink / raw)
  To: Aleksandr Gamzin; +Cc: sisyphus-incominger, girar-builder-sisyphus

https://git.altlinux.org/tasks/379419/logs/events.1.1.log
https://packages.altlinux.org/tasks/379419

subtask  name  aarch64    i586  x86_64
   #100  zot      7:37  failed    4:26

2025-Mar-27 13:26:27 :: task #379419 for sisyphus started by gamzin:
#100 build 2.1.2-alt1 from /people/gamzin/packages/zot.git fetched at 2025-Mar-27 13:25:30
2025-Mar-27 13:26:28 :: [aarch64] #100 zot.git 2.1.2-alt1: build start
2025-Mar-27 13:26:28 :: [x86_64] #100 zot.git 2.1.2-alt1: build start
2025-Mar-27 13:26:28 :: [i586] #100 zot.git 2.1.2-alt1: build start
[i586] github.com/aquasecurity/trivy/pkg/fanal/analyzer/pkg/rpm
[i586] github.com/aquasecurity/trivy/pkg/fanal/analyzer/all
[i586] github.com/aquasecurity/trivy/pkg/scanner/local
[i586] github.com/aquasecurity/trivy/pkg/scanner
[i586] github.com/aquasecurity/trivy/pkg/commands/artifact
[i586] github.com/containers/image/v5/pkg/blobinfocache/sqlite
[i586] github.com/containers/image/v5/pkg/blobinfocache
[i586] github.com/containers/image/v5/copy
[i586] make: *** [Makefile:172: binary] Error 1
[i586] make: Leaving directory '/usr/src/RPM/BUILD/zot-2.1.2/.build/src/github.com/project-zot/zot'
2025-Mar-27 13:29:49 :: [i586] zot.git 2.1.2-alt1: remote: build failed
2025-Mar-27 13:29:49 :: [i586] #100 zot.git 2.1.2-alt1: build FAILED
2025-Mar-27 13:29:49 :: [i586] requesting cancellation of task processing
2025-Mar-27 13:30:54 :: [x86_64] #100 zot.git 2.1.2-alt1: build OK
2025-Mar-27 13:34:05 :: [aarch64] #100 zot.git 2.1.2-alt1: build OK
2025-Mar-27 13:29:49 :: [i586] build FAILED
2025-Mar-27 13:34:05 :: task #379419 for sisyphus FAILED


^ permalink raw reply	[flat|nested] 4+ messages in thread

* [#379419] EPERM (try 2) zot.git=2.1.2-alt1
  2025-03-27 13:34 [#379419] FAILED zot.git=2.1.2-alt1 Girar awaiter (gamzin)
@ 2025-03-27 14:10 ` Girar awaiter (gamzin)
  2025-03-28 10:32 ` [#379419] FAILED (try 3) zot.git=2.1.2-alt1 Girar awaiter (gamzin)
  2025-03-28 10:43 ` [#379419] FAILED (try 4) zot.git=2.1.2-alt1 Girar awaiter (gamzin)
  2 siblings, 0 replies; 4+ messages in thread
From: Girar awaiter (gamzin) @ 2025-03-27 14:10 UTC (permalink / raw)
  To: Aleksandr Gamzin
  Cc: sisyphus-incominger, Alexander Stepchenko, girar-builder-sisyphus

https://git.altlinux.org/tasks/379419/logs/events.2.1.log
https://packages.altlinux.org/tasks/379419

subtask  name  aarch64  i586  x86_64
   #200  zot      7:29     -    4:21

2025-Mar-27 13:58:26 :: task #379419 for sisyphus resumed by gamzin:
#100 removed
#200 build 2.1.2-alt1 from /people/gamzin/packages/zot.git fetched at 2025-Mar-27 13:58:07
2025-Mar-27 13:58:28 :: [i586] #200 zot.git 2.1.2-alt1: build start
2025-Mar-27 13:58:28 :: [x86_64] #200 zot.git 2.1.2-alt1: build start
2025-Mar-27 13:58:28 :: [aarch64] #200 zot.git 2.1.2-alt1: build start
2025-Mar-27 13:58:41 :: [i586] #200 zot.git 2.1.2-alt1: build SKIPPED
2025-Mar-27 14:02:49 :: [x86_64] #200 zot.git 2.1.2-alt1: build OK
2025-Mar-27 14:05:57 :: [aarch64] #200 zot.git 2.1.2-alt1: build OK
2025-Mar-27 14:06:07 :: #200: zot.git 2.1.2-alt1: build check OK
2025-Mar-27 14:06:08 :: build check OK
2025-Mar-27 14:06:23 :: noarch check OK
2025-Mar-27 14:06:25 :: plan: src +1 -1 =20030, aarch64 +2 -2 =34817, i586 +0 -2 =33684, x86_64 +2 -2 =35623
#200 zot 2.1.0-alt1 -> 2.1.2-alt1
 Thu Mar 27 2025 Aleksandr Gamzin <gamzin@altlinux> 2.1.2-alt1
 - 2.1.0 -> 2.1.2
 - Change trivy-db repository to altlinux.space
2025-Mar-27 14:07:07 :: patched apt indices
2025-Mar-27 14:07:16 :: created next repo
2025-Mar-27 14:07:25 :: duplicate provides check OK
2025-Mar-27 14:08:02 :: dependencies check OK
2025-Mar-27 14:08:39 :: [x86_64 i586 aarch64] ELF symbols check OK
	x86_64: zot=2.1.2-alt1 post-install unowned files:
 /usr/share/fish
 /usr/share/fish/vendor_completions.d
 /usr/share/zsh
 /usr/share/zsh/site-functions
2025-Mar-27 14:08:57 :: [x86_64] #200 zot: install check OK
	aarch64: zot=2.1.2-alt1 post-install unowned files:
 /usr/share/fish
 /usr/share/fish/vendor_completions.d
 /usr/share/zsh
 /usr/share/zsh/site-functions
2025-Mar-27 14:09:07 :: [aarch64] #200 zot: install check OK
2025-Mar-27 14:09:10 :: [x86_64] #200 zot-debuginfo: install check OK
2025-Mar-27 14:09:27 :: [aarch64] #200 zot-debuginfo: install check OK
2025-Mar-27 14:09:43 :: [x86_64-i586] generated apt indices
2025-Mar-27 14:09:43 :: [x86_64-i586] created next repo
2025-Mar-27 14:09:53 :: [x86_64-i586] dependencies check OK
2025-Mar-27 14:09:54 :: gears inheritance check OK
2025-Mar-27 14:09:54 :: srpm inheritance check OK
girar-check-perms: access to zot DENIED for gamzin: does not belong to maintainers list yet
check-subtask-perms: #200: zot: Operation not permitted
2025-Mar-27 14:09:55 :: acl check FAILED
2025-Mar-27 14:10:06 :: created contents_index files
2025-Mar-27 14:10:14 :: created hash files: aarch64 i586 src x86_64
2025-Mar-27 14:10:16 :: task #379419 for sisyphus EPERM


^ permalink raw reply	[flat|nested] 4+ messages in thread

* [#379419] FAILED (try 3) zot.git=2.1.2-alt1
  2025-03-27 13:34 [#379419] FAILED zot.git=2.1.2-alt1 Girar awaiter (gamzin)
  2025-03-27 14:10 ` [#379419] EPERM (try 2) zot.git=2.1.2-alt1 Girar awaiter (gamzin)
@ 2025-03-28 10:32 ` Girar awaiter (gamzin)
  2025-03-28 10:43 ` [#379419] FAILED (try 4) zot.git=2.1.2-alt1 Girar awaiter (gamzin)
  2 siblings, 0 replies; 4+ messages in thread
From: Girar awaiter (gamzin) @ 2025-03-28 10:32 UTC (permalink / raw)
  To: Aleksandr Gamzin
  Cc: sisyphus-incominger, Alexander Stepchenko, girar-builder-sisyphus

https://git.altlinux.org/tasks/379419/logs/events.3.1.log
https://packages.altlinux.org/tasks/379419

subtask  name  aarch64    i586  x86_64
   #300  zot      7:46  failed    4:22

2025-Mar-28 10:25:07 :: task #379419 for sisyphus resumed by gamzin:
#100 removed
#200 removed
#300 build 2.1.2-alt1 from /people/gamzin/packages/zot.git fetched at 2025-Mar-28 10:24:45
2025-Mar-28 10:25:09 :: [i586] #300 zot.git 2.1.2-alt1: build start
2025-Mar-28 10:25:09 :: [aarch64] #300 zot.git 2.1.2-alt1: build start
2025-Mar-28 10:25:09 :: [x86_64] #300 zot.git 2.1.2-alt1: build start
[i586] github.com/aquasecurity/trivy/pkg/fanal/analyzer/pkg/rpm
[i586] github.com/aquasecurity/trivy/pkg/fanal/analyzer/all
[i586] github.com/aquasecurity/trivy/pkg/scanner/local
[i586] github.com/aquasecurity/trivy/pkg/scanner
[i586] github.com/aquasecurity/trivy/pkg/commands/artifact
[i586] github.com/containers/image/v5/pkg/blobinfocache/sqlite
[i586] github.com/containers/image/v5/pkg/blobinfocache
[i586] github.com/containers/image/v5/copy
[i586] make: *** [Makefile:172: binary] Error 1
[i586] make: Leaving directory '/usr/src/RPM/BUILD/zot-2.1.2/.build/src/github.com/project-zot/zot'
2025-Mar-28 10:28:30 :: [i586] zot.git 2.1.2-alt1: remote: build failed
2025-Mar-28 10:28:30 :: [i586] #300 zot.git 2.1.2-alt1: build FAILED
2025-Mar-28 10:28:30 :: [i586] requesting cancellation of task processing
2025-Mar-28 10:29:31 :: [x86_64] #300 zot.git 2.1.2-alt1: build OK
2025-Mar-28 10:32:55 :: [aarch64] #300 zot.git 2.1.2-alt1: build OK
2025-Mar-28 10:28:30 :: [i586] build FAILED
2025-Mar-28 10:32:55 :: task #379419 for sisyphus FAILED


^ permalink raw reply	[flat|nested] 4+ messages in thread

* [#379419] FAILED (try 4) zot.git=2.1.2-alt1
  2025-03-27 13:34 [#379419] FAILED zot.git=2.1.2-alt1 Girar awaiter (gamzin)
  2025-03-27 14:10 ` [#379419] EPERM (try 2) zot.git=2.1.2-alt1 Girar awaiter (gamzin)
  2025-03-28 10:32 ` [#379419] FAILED (try 3) zot.git=2.1.2-alt1 Girar awaiter (gamzin)
@ 2025-03-28 10:43 ` Girar awaiter (gamzin)
  2 siblings, 0 replies; 4+ messages in thread
From: Girar awaiter (gamzin) @ 2025-03-28 10:43 UTC (permalink / raw)
  To: Aleksandr Gamzin
  Cc: sisyphus-incominger, Alexander Stepchenko, girar-builder-sisyphus

https://git.altlinux.org/tasks/379419/logs/events.4.1.log
https://packages.altlinux.org/tasks/379419

subtask  name  aarch64    i586  x86_64
   #400  zot      7:40  failed    4:23

2025-Mar-28 10:35:45 :: task #379419 for sisyphus resumed by gamzin:
#100 removed
#200 removed
#300 removed
#400 build 2.1.2-alt1 from /people/gamzin/packages/zot.git fetched at 2025-Mar-28 10:35:27
2025-Mar-28 10:35:46 :: [i586] #400 zot.git 2.1.2-alt1: build start
2025-Mar-28 10:35:46 :: [x86_64] #400 zot.git 2.1.2-alt1: build start
2025-Mar-28 10:35:46 :: [aarch64] #400 zot.git 2.1.2-alt1: build start
[i586] github.com/aquasecurity/trivy/pkg/fanal/analyzer/pkg/rpm
[i586] github.com/aquasecurity/trivy/pkg/fanal/analyzer/all
[i586] github.com/aquasecurity/trivy/pkg/scanner/local
[i586] github.com/aquasecurity/trivy/pkg/scanner
[i586] github.com/aquasecurity/trivy/pkg/commands/artifact
[i586] github.com/containers/image/v5/pkg/blobinfocache/sqlite
[i586] github.com/containers/image/v5/pkg/blobinfocache
[i586] github.com/containers/image/v5/copy
[i586] make: *** [Makefile:172: binary] Error 1
[i586] make: Leaving directory '/usr/src/RPM/BUILD/zot-2.1.2/.build/src/github.com/project-zot/zot'
2025-Mar-28 10:39:08 :: [i586] zot.git 2.1.2-alt1: remote: build failed
2025-Mar-28 10:39:08 :: [i586] #400 zot.git 2.1.2-alt1: build FAILED
2025-Mar-28 10:39:09 :: [i586] requesting cancellation of task processing
2025-Mar-28 10:40:09 :: [x86_64] #400 zot.git 2.1.2-alt1: build OK
2025-Mar-28 10:43:26 :: [aarch64] #400 zot.git 2.1.2-alt1: build OK
2025-Mar-28 10:39:09 :: [i586] build FAILED
2025-Mar-28 10:43:26 :: task #379419 for sisyphus FAILED


^ permalink raw reply	[flat|nested] 4+ messages in thread

end of thread, other threads:[~2025-03-28 10:43 UTC | newest]

Thread overview: 4+ messages (download: mbox.gz / follow: Atom feed)
-- links below jump to the message on this page --
2025-03-27 13:34 [#379419] FAILED zot.git=2.1.2-alt1 Girar awaiter (gamzin)
2025-03-27 14:10 ` [#379419] EPERM (try 2) zot.git=2.1.2-alt1 Girar awaiter (gamzin)
2025-03-28 10:32 ` [#379419] FAILED (try 3) zot.git=2.1.2-alt1 Girar awaiter (gamzin)
2025-03-28 10:43 ` [#379419] FAILED (try 4) zot.git=2.1.2-alt1 Girar awaiter (gamzin)

ALT Linux Girar Builder robot reports

This inbox may be cloned and mirrored by anyone:

	git clone --mirror http://lore.altlinux.org/sisyphus-incominger/0 sisyphus-incominger/git/0.git

	# If you have public-inbox 1.1+ installed, you may
	# initialize and index your mirror using the following commands:
	public-inbox-init -V2 sisyphus-incominger sisyphus-incominger/ http://lore.altlinux.org/sisyphus-incominger \
		sisyphus-incominger@lists.altlinux.org sisyphus-incominger@lists.altlinux.ru sisyphus-incominger@lists.altlinux.com
	public-inbox-index sisyphus-incominger

Example config snippet for mirrors.
Newsgroup available over NNTP:
	nntp://lore.altlinux.org/org.altlinux.lists.sisyphus-incominger


AGPL code for this site: git clone https://public-inbox.org/public-inbox.git