ALT Linux Girar Builder robot reports
 help / color / mirror / Atom feed
* [#379408] [test-only] FAILED alteratorctl.git=0.1.4-alt1
@ 2025-03-27 12:48 Girar awaiter (hromovpi)
  2025-03-27 13:00 ` [#379408] TESTED (try 2) alteratorctl.git=0.1.4-alt1 Girar awaiter (hromovpi)
  2025-03-27 13:05 ` [#379408] EPERM (try 3) alteratorctl.git=0.1.4-alt1 Girar awaiter (hromovpi)
  0 siblings, 2 replies; 3+ messages in thread
From: Girar awaiter (hromovpi) @ 2025-03-27 12:48 UTC (permalink / raw)
  To: Pavel Khromov; +Cc: sisyphus-incominger, girar-builder-sisyphus

https://git.altlinux.org/tasks/379408/logs/events.1.1.log
https://packages.altlinux.org/tasks/379408

subtask  name          aarch64    i586  x86_64
   #100  alteratorctl   failed  failed  failed

2025-Mar-27 12:48:25 :: test-only task #379408 for sisyphus started by hromovpi:
#100 build 0.1.4-alt1 from /people/hromovpi/packages/alteratorctl.git fetched at 2025-Mar-27 12:48:05
2025-Mar-27 12:48:27 :: [aarch64] #100 alteratorctl.git 0.1.4-alt1: build start
2025-Mar-27 12:48:27 :: [x86_64] #100 alteratorctl.git 0.1.4-alt1: build start
2025-Mar-27 12:48:27 :: [i586] #100 alteratorctl.git 0.1.4-alt1: build start
[i586] --   Found dbus-glib-1, version 0.110
[i586] Package libsystemd was not found in the pkg-config search path.
[i586] Perhaps you should add the directory containing `libsystemd.pc'
[i586] to the PKG_CONFIG_PATH environment variable
[i586] Package 'libsystemd', required by 'dbus-1', not found
[i586] Package libsystemd was not found in the pkg-config search path.
[i586] Perhaps you should add the directory containing `libsystemd.pc'
[i586] to the PKG_CONFIG_PATH environment variable
[i586] Package 'libsystemd', required by 'dbus-1', not found
[i586] Package libsystemd was not found in the pkg-config search path.
[i586] Perhaps you should add the directory containing `libsystemd.pc'
[i586] to the PKG_CONFIG_PATH environment variable
[i586] Package 'libsystemd', required by 'dbus-1', not found
[i586] Package libsystemd was not found in the pkg-config search path.
[i586] Perhaps you should add the directory containing `libsystemd.pc'
[i586] to the PKG_CONFIG_PATH environment variable
[i586] Package 'libsystemd', required by 'dbus-1', not found
[i586] -- Checking for module 'libtoml'
[i586] --
[i586] -- Checking for modules 'polkit-agent-1;polkit-gobject-1'
[i586] --   No package 'polkit-agent-1' found
[i586] --   No package 'polkit-gobject-1' found
[i586] CMake Error at /usr/share/cmake/Modules/FindPkgConfig.cmake:645 (message):
[x86_64] --   Found dbus-glib-1, version 0.110
[x86_64] Package libsystemd was not found in the pkg-config search path.
[x86_64] Perhaps you should add the directory containing `libsystemd.pc'
[x86_64] to the PKG_CONFIG_PATH environment variable
[x86_64] Package 'libsystemd', required by 'dbus-1', not found
[x86_64] Package libsystemd was not found in the pkg-config search path.
[x86_64] Perhaps you should add the directory containing `libsystemd.pc'
[x86_64] to the PKG_CONFIG_PATH environment variable
[x86_64] Package 'libsystemd', required by 'dbus-1', not found
[x86_64] Package libsystemd was not found in the pkg-config search path.
[x86_64] Perhaps you should add the directory containing `libsystemd.pc'
[x86_64] to the PKG_CONFIG_PATH environment variable
[x86_64] Package 'libsystemd', required by 'dbus-1', not found
[x86_64] Package libsystemd was not found in the pkg-config search path.
[x86_64] Perhaps you should add the directory containing `libsystemd.pc'
[x86_64] to the PKG_CONFIG_PATH environment variable
[x86_64] Package 'libsystemd', required by 'dbus-1', not found
[x86_64] -- Checking for module 'libtoml'
[x86_64] --
[x86_64] -- Checking for modules 'polkit-agent-1;polkit-gobject-1'
[x86_64] --   No package 'polkit-agent-1' found
[x86_64] --   No package 'polkit-gobject-1' found
[x86_64] CMake Error at /usr/share/cmake/Modules/FindPkgConfig.cmake:645 (message):
2025-Mar-27 12:48:45 :: [i586] alteratorctl.git 0.1.4-alt1: remote: build failed
2025-Mar-27 12:48:45 :: [x86_64] alteratorctl.git 0.1.4-alt1: remote: build failed
2025-Mar-27 12:48:45 :: [i586] #100 alteratorctl.git 0.1.4-alt1: build FAILED
2025-Mar-27 12:48:45 :: [x86_64] #100 alteratorctl.git 0.1.4-alt1: build FAILED
2025-Mar-27 12:48:45 :: [x86_64] requesting cancellation of task processing
[aarch64] --   Found dbus-glib-1, version 0.110
[aarch64] Package libsystemd was not found in the pkg-config search path.
[aarch64] Perhaps you should add the directory containing `libsystemd.pc'
[aarch64] to the PKG_CONFIG_PATH environment variable
[aarch64] Package 'libsystemd', required by 'dbus-1', not found
[aarch64] Package libsystemd was not found in the pkg-config search path.
[aarch64] Perhaps you should add the directory containing `libsystemd.pc'
[aarch64] to the PKG_CONFIG_PATH environment variable
[aarch64] Package 'libsystemd', required by 'dbus-1', not found
[aarch64] Package libsystemd was not found in the pkg-config search path.
[aarch64] Perhaps you should add the directory containing `libsystemd.pc'
[aarch64] to the PKG_CONFIG_PATH environment variable
[aarch64] Package 'libsystemd', required by 'dbus-1', not found
[aarch64] Package libsystemd was not found in the pkg-config search path.
[aarch64] Perhaps you should add the directory containing `libsystemd.pc'
[aarch64] to the PKG_CONFIG_PATH environment variable
[aarch64] Package 'libsystemd', required by 'dbus-1', not found
[aarch64] -- Checking for module 'libtoml'
[aarch64] --
[aarch64] -- Checking for modules 'polkit-agent-1;polkit-gobject-1'
[aarch64] --   No package 'polkit-agent-1' found
[aarch64] --   No package 'polkit-gobject-1' found
[aarch64] CMake Error at /usr/share/cmake/Modules/FindPkgConfig.cmake:645 (message):
2025-Mar-27 12:48:56 :: [aarch64] alteratorctl.git 0.1.4-alt1: remote: build failed
2025-Mar-27 12:48:56 :: [aarch64] #100 alteratorctl.git 0.1.4-alt1: build FAILED
2025-Mar-27 12:48:45 :: [i586] build FAILED
2025-Mar-27 12:48:45 :: [x86_64] build FAILED
2025-Mar-27 12:48:56 :: [aarch64] build FAILED
2025-Mar-27 12:48:56 :: task #379408 for sisyphus FAILED


^ permalink raw reply	[flat|nested] 3+ messages in thread

end of thread, other threads:[~2025-03-27 13:05 UTC | newest]

Thread overview: 3+ messages (download: mbox.gz / follow: Atom feed)
-- links below jump to the message on this page --
2025-03-27 12:48 [#379408] [test-only] FAILED alteratorctl.git=0.1.4-alt1 Girar awaiter (hromovpi)
2025-03-27 13:00 ` [#379408] TESTED (try 2) alteratorctl.git=0.1.4-alt1 Girar awaiter (hromovpi)
2025-03-27 13:05 ` [#379408] EPERM (try 3) alteratorctl.git=0.1.4-alt1 Girar awaiter (hromovpi)

ALT Linux Girar Builder robot reports

This inbox may be cloned and mirrored by anyone:

	git clone --mirror http://lore.altlinux.org/sisyphus-incominger/0 sisyphus-incominger/git/0.git

	# If you have public-inbox 1.1+ installed, you may
	# initialize and index your mirror using the following commands:
	public-inbox-init -V2 sisyphus-incominger sisyphus-incominger/ http://lore.altlinux.org/sisyphus-incominger \
		sisyphus-incominger@lists.altlinux.org sisyphus-incominger@lists.altlinux.ru sisyphus-incominger@lists.altlinux.com
	public-inbox-index sisyphus-incominger

Example config snippet for mirrors.
Newsgroup available over NNTP:
	nntp://lore.altlinux.org/org.altlinux.lists.sisyphus-incominger


AGPL code for this site: git clone https://public-inbox.org/public-inbox.git