* [#379319] [test-only] FAILED alterator-usbmount.git=0.1.3-alt1
@ 2025-03-26 13:01 Girar awaiter (proskur)
2025-03-26 13:19 ` [#379319] TESTED (try 2) alterator-usbmount.git=0.1.3-alt1 Girar awaiter (proskur)
` (2 more replies)
0 siblings, 3 replies; 4+ messages in thread
From: Girar awaiter (proskur) @ 2025-03-26 13:01 UTC (permalink / raw)
To: Oleg Proskurin; +Cc: sisyphus-incominger, girar-builder-sisyphus
https://git.altlinux.org/tasks/379319/logs/events.1.1.log
https://packages.altlinux.org/tasks/379319
subtask name aarch64 i586 x86_64
#100 alterator-usbmount failed failed failed
2025-Mar-26 13:01:34 :: test-only task #379319 for sisyphus started by proskur:
#100 build 0.1.3-alt1 from /people/proskur/packages/alterator-usbmount.git fetched at 2025-Mar-26 13:01:03
2025-Mar-26 13:01:36 :: [i586] #100 alterator-usbmount.git 0.1.3-alt1: build start
2025-Mar-26 13:01:36 :: [x86_64] #100 alterator-usbmount.git 0.1.3-alt1: build start
2025-Mar-26 13:01:36 :: [aarch64] #100 alterator-usbmount.git 0.1.3-alt1: build start
[i586] warning: Macro %gpl2plus not found
[i586] warning: Macro %cmake not found
[i586] warning: Macro %cmake_build not found
[i586] warning: Macro %cmake_install not found
[i586] Reading Package Lists...
[i586] Building Dependency Tree...
[i586] MI2a: marked for install (shallow): gcc-c++
[i586] MI2a: satisfying Depends: gcc14-c++ (NULL)
[i586] MI2a: maybe install (a direct target): gcc14-c++ 14.2.1-alt1:sisyphus+360995.100.1.1@1730131612
[i586] MI2a: target SELECTED: gcc14-c++ 14.2.1-alt1:sisyphus+360995.100.1.1@1730131612
[i586] MI2a: requesting to install gcc14-c++ (unspec'd ver; inspect with Debug::pkgMark-shallow)
[i586] MI2a: marked for install (shallow): gcc14-c++
[i586] MI2a: satisfying Depends: libstdc++14-devel = 14.2.1-alt1:sisyphus+360995.100.1.1
[i586] MI2a: maybe install (a direct target): libstdc++14-devel 14.2.1-alt1:sisyphus+360995.100.1.1@1730131612
[i586] MI2a: target SELECTED: libstdc++14-devel 14.2.1-alt1:sisyphus+360995.100.1.1@1730131612
[i586] MI2a: requesting to install libstdc++14-devel (unspec'd ver; inspect with Debug::pkgMark-shallow)
[i586] MI2a: marked for install (shallow): libstdc++14-devel
[i586] MI2a: satisfying PreDepends: gcc-c++-common >= 1.4.7
[i586] MI2a: maybe install (a direct target): gcc-c++-common 1.4.28-alt1:sisyphus+348678.100.1.1@1716396142
[i586] MI2a: target SELECTED: gcc-c++-common 1.4.28-alt1:sisyphus+348678.100.1.1@1716396142
[i586] MI2a: requesting to install gcc-c++-common (unspec'd ver; inspect with Debug::pkgMark-shallow)
[i586] MI2a: marked for install (shallow): gcc-c++-common
[i586] MI2a: marked for install (shallow): cmake
[i586] MI2a: satisfying Depends: rpm-macros-cmake (NULL)
[i586] MI2a: maybe install (a direct target): rpm-macros-cmake 3.29.1-alt1:sisyphus+344518.300.3.1@1712379787
[i586] MI2a: target SELECTED: rpm-macros-cmake 3.29.1-alt1:sisyphus+344518.300.3.1@1712379787
[i586] MI2a: requesting to install rpm-macros-cmake (unspec'd ver; inspect with Debug::pkgMark-shallow)
[i586] MI2a: marked for install (shallow): rpm-macros-cmake
[i586] MI2a: satisfying Depends: libarchive.so.13 >= set:mfws0SCfLRvPUKXi0gkbE0yqsuzVMI88jwJ7kSDXXM11MUSPfvqwmDm2xDogNmeEkAorJTlC2B1ZatQqH4cJ32OndcAjazDxDaNvG6mMdDQthrMI5Ie5skSvbnLedY5O95MlUcFQ1thxqvQWyDvIECoveyzf0x7I3xw6vu1
[i586] MI2a: maybe install (a providing target): libarchive13 3.7.5-alt2:sisyphus+358189.100.1.1@1727162770
[i586] MI2a: target SELECTED: libarchive13 3.7.5-alt2:sisyphus+358189.100.1.1@1727162770
[i586] MI2a: requesting to install libarchive13 (unspec'd ver; inspect with Debug::pkgMark-shallow)
[i586] MI2a: marked for install (shallow): libarchive13
[i586] MI2a: satisfying Depends: libcrypto.so.3 >= set:ql3PXSClcBY9FOuxT2MmWBTjuZAnRZBckPsGEaWp9qs3syAhoLygApfuKoEShvbjoafnDOFhzK75IPaZxvmCZilEjkjo
[i586] MI2a: maybe install (a providing target): libcrypto3 3.3.3-alt1:sisyphus+374381.40.2.1@1739299702
[i586] MI2a: target SELECTED: libcrypto3 3.3.3-alt1:sisyphus+374381.40.2.1@1739299702
[i586] MI2a: requesting to install libcrypto3 (unspec'd ver; inspect with Debug::pkgMark-shallow)
[i586] MI2a: marked for install (shallow): libcrypto3
[i586] MI2a: satisfying Depends: openssl-config >= 3.2.0-alt1
[i586] MI2a: maybe install (a direct target): openssl-config 3.2.0-alt1:sisyphus+366659.140.4.1@1736956949
[i586] MI2a: target SELECTED: openssl-config 3.2.0-alt1:sisyphus+366659.140.4.1@1736956949
[i586] MI2a: requesting to install openssl-config (unspec'd ver; inspect with Debug::pkgMark-shallow)
[i586] MI2a: marked for install (shallow): openssl-config
[i586] MI2a: satisfying Depends: ca-certificates (NULL)
[i586] MI2a: maybe install (a direct target): ca-certificates 2025.02.10-alt1:sisyphus+374228.100.4.1@1739265441
[i586] MI2a: target SELECTED: ca-certificates 2025.02.10-alt1:sisyphus+374228.100.4.1@1739265441
[i586] MI2a: requesting to install ca-certificates (unspec'd ver; inspect with Debug::pkgMark-shallow)
[i586] MI2a: marked for install (shallow): ca-certificates
[i586] MI2a: satisfying Depends: ca-trust (NULL)
[i586] MI2a: maybe install (a direct target): ca-trust 0.2.0-alt1:sisyphus+344843.100.1.1@1712743326
[i586] MI2a: target SELECTED: ca-trust 0.2.0-alt1:sisyphus+344843.100.1.1@1712743326
[i586] MI2a: requesting to install ca-trust (unspec'd ver; inspect with Debug::pkgMark-shallow)
[i586] MI2a: marked for install (shallow): ca-trust
[i586] MI2a: satisfying Depends: p11-kit-trust (NULL)
[i586] MI2a: maybe install (a direct target): p11-kit-trust 1:0.25.5-alt1:sisyphus+352553.100.1.1@1720622586
[i586] MI2a: target SELECTED: p11-kit-trust 1:0.25.5-alt1:sisyphus+352553.100.1.1@1720622586
[i586] MI2a: requesting to install p11-kit-trust (unspec'd ver; inspect with Debug::pkgMark-shallow)
[i586] MI2a: marked for install (shallow): p11-kit-trust
[i586] MI2a: satisfying Depends: /etc/alternatives/packages.d (NULL)
[i586] MI2a: maybe install (a providing target): alternatives 0.5.3-alt1:sisyphus+371878.100.1.1@1737988822
[i586] MI2a: target SELECTED: alternatives 0.5.3-alt1:sisyphus+371878.100.1.1@1737988822
[i586] MI2a: requesting to install alternatives (unspec'd ver; inspect with Debug::pkgMark-shallow)
[i586] MI2a: marked for install (shallow): alternatives
[i586] MI2a: satisfying Depends: rpm-macros-alternatives = 0.5.3-alt1:sisyphus+371878.100.1.1
[i586] MI2a: maybe install (a direct target): rpm-macros-alternatives 0.5.3-alt1:sisyphus+371878.100.1.1@1737988822
[i586] MI2a: target SELECTED: rpm-macros-alternatives 0.5.3-alt1:sisyphus+371878.100.1.1@1737988822
[i586] MI2a: requesting to install rpm-macros-alternatives (unspec'd ver; inspect with Debug::pkgMark-shallow)
[i586] MI2a: marked for install (shallow): rpm-macros-alternatives
[i586] MI2a: satisfying Depends: libtasn1.so.6 >= set:jfRaXblmF8mf5SLNNXDA2CDacDxCZqQOspDh1
[i586] MI2a: maybe install (a providing target): libtasn1 4.20.0-alt2:sisyphus+375829.100.1.1@1740299335
[i586] MI2a: target SELECTED: libtasn1 4.20.0-alt2:sisyphus+375829.100.1.1@1740299335
[i586] MI2a: requesting to install libtasn1 (unspec'd ver; inspect with Debug::pkgMark-shallow)
[i586] MI2a: marked for install (shallow): libtasn1
[i586] MI2a: satisfying Depends: libp11-kit = 1:0.25.5-alt1:sisyphus+352553.100.1.1
[i586] MI2a: maybe install (a direct target): libp11-kit 1:0.25.5-alt1:sisyphus+352553.100.1.1@1720622586
[i586] MI2a: target SELECTED: libp11-kit 1:0.25.5-alt1:sisyphus+352553.100.1.1@1720622586
[i586] MI2a: requesting to install libp11-kit (unspec'd ver; inspect with Debug::pkgMark-shallow)
[i586] MI2a: marked for install (shallow): libp11-kit
[i586] MI2a: satisfying Depends: libcurl.so.4 >= set:kgZtdjewuBSOM3YXjuKGePG56ZAe
[i586] MI2a: maybe install (a providing target): libcurl 8.12.1-alt1:sisyphus+374517.100.1.1@1739435639
[i586] MI2a: target SELECTED: libcurl 8.12.1-alt1:sisyphus+374517.100.1.1@1739435639
[i586] MI2a: requesting to install libcurl (unspec'd ver; inspect with Debug::pkgMark-shallow)
[i586] MI2a: marked for install (shallow): libcurl
[i586] MI2a: satisfying Depends: libbrotlidec.so.1 >= set:heroOawuYbTK8
[i586] MI2a: maybe install (a providing target): libbrotlidec 1.1.0-alt1:sisyphus+328501.100.1.1@1693598420
[i586] MI2a: target SELECTED: libbrotlidec 1.1.0-alt1:sisyphus+328501.100.1.1@1693598420
[i586] MI2a: requesting to install libbrotlidec (unspec'd ver; inspect with Debug::pkgMark-shallow)
[i586] MI2a: marked for install (shallow): libbrotlidec
[i586] MI2a: satisfying Depends: libbrotlicommon = 1.1.0-alt1:sisyphus+328501.100.1.1
[i586] MI2a: maybe install (a direct target): libbrotlicommon 1.1.0-alt1:sisyphus+328501.100.1.1@1693598420
[i586] MI2a: target SELECTED: libbrotlicommon 1.1.0-alt1:sisyphus+328501.100.1.1@1693598420
[i586] MI2a: requesting to install libbrotlicommon (unspec'd ver; inspect with Debug::pkgMark-shallow)
[i586] MI2a: marked for install (shallow): libbrotlicommon
[i586] MI2a: satisfying Depends: libgnutls.so.30 >= set:ohWzKsl3gEhunQQpmsYd9i7QCtiGyfZ1Iaw1tOFZbdeEKESximCRPnIehs3AEMQXZ0e8KN9yV59f8Zeu5QHTtKkulI9mjuLg9NIizyZhpZCsx8sGEZDBhhgZvpnajdZvocWora9BdPXEcA4Z2ghEYo7SHlnQVUueZmZ3mRKhNiuOM9tTy3ea4NtLvppyZ1rbmbbGWLShwembtEyVtUcNpLjugdka8b4
[i586] MI2a: maybe install (a providing target): libgnutls30 3.8.9-alt1:sisyphus+375558.200.1.1@1740143098
[i586] MI2a: target SELECTED: libgnutls30 3.8.9-alt1:sisyphus+375558.200.1.1@1740143098
[i586] MI2a: requesting to install libgnutls30 (unspec'd ver; inspect with Debug::pkgMark-shallow)
[i586] MI2a: marked for install (shallow): libgnutls30
[i586] MI2a: satisfying Depends: libhogweed.so.6 >= set:mfnnj2ZgBdeg17M87tPneezLu1hRaAv7Mvee2P332bHTaZjeCozdeChKl8zpQyflmS6Vy6tRmgHXyW1dkybK4gSLUc4ZqST6Otwai2tAwz0231mJ0KXX1SRmE5Wv1xA3elkz1fS4ARIDtHglVAVYGsrdTpOlAk7oFZ51ji2BIsI0W6X7ePZg
[i586] MI2a: maybe install (a providing target): libhogweed6 3.10.1-alt1:sisyphus+372008.100.1.1@1738078268
[i586] MI2a: target SELECTED: libhogweed6 3.10.1-alt1:sisyphus+372008.100.1.1@1738078268
[i586] MI2a: requesting to install libhogweed6 (unspec'd ver; inspect with Debug::pkgMark-shallow)
[i586] MI2a: marked for install (shallow): libhogweed6
[i586] MI2a: satisfying Depends: libnettle8 = 3.10.1-alt1:sisyphus+372008.100.1.1
[i586] MI2a: maybe install (a direct target): libnettle8 3.10.1-alt1:sisyphus+372008.100.1.1@1738078268
[i586] MI2a: target SELECTED: libnettle8 3.10.1-alt1:sisyphus+372008.100.1.1@1738078268
[i586] MI2a: requesting to install libnettle8 (unspec'd ver; inspect with Debug::pkgMark-shallow)
[i586] MI2a: marked for install (shallow): libnettle8
[i586] MI2a: satisfying Depends: libidn2.so.0 >= set:ifaFMURofX11
[i586] MI2a: maybe install (a providing target): libidn2 2.3.7-alt1:sisyphus+339505.100.1.2@1706718975
[i586] MI2a: target SELECTED: libidn2 2.3.7-alt1:sisyphus+339505.100.1.2@1706718975
[i586] MI2a: requesting to install libidn2 (unspec'd ver; inspect with Debug::pkgMark-shallow)
[i586] MI2a: marked for install (shallow): libidn2
[i586] MI2a: satisfying Depends: libgsasl.so.18 >= set:jfNMMjxjlLiKUyEAZvcPMCX3
[i586] MI2a: maybe install (a providing target): libgsasl18 2.2.1-alt2:sisyphus+359713.200.2.1@1728905438
[i586] MI2a: target SELECTED: libgsasl18 2.2.1-alt2:sisyphus+359713.200.2.1@1728905438
[i586] MI2a: requesting to install libgsasl18 (unspec'd ver; inspect with Debug::pkgMark-shallow)
[i586] MI2a: marked for install (shallow): libgsasl18
[i586] MI2a: satisfying Depends: libgssapi_krb5.so.2 >= set:lgUI5pnpbNsJUr9F0ECN6LIbSVz7j3UNHAXVG0YYmbjijMyN
[i586] MI2a: maybe install (a providing target): libkrb5 1.21.3-alt2:sisyphus+351857.100.1.1@1719735219
[i586] MI2a: target SELECTED: libkrb5 1.21.3-alt2:sisyphus+351857.100.1.1@1719735219
[i586] MI2a: requesting to install libkrb5 (unspec'd ver; inspect with Debug::pkgMark-shallow)
[i586] MI2a: marked for install (shallow): libkrb5
[i586] MI2a: satisfying Depends: libcom_err.so.2 >= set:ifPl8xIvqFmQe8JQo3
[i586] MI2a: maybe install (a providing target): libcom_err 1.47.1.0.10.ad56-alt2:sisyphus+363497.200.3.1@1732729916
[i586] MI2a: target SELECTED: libcom_err 1.47.1.0.10.ad56-alt2:sisyphus+363497.200.3.1@1732729916
[i586] MI2a: requesting to install libcom_err (unspec'd ver; inspect with Debug::pkgMark-shallow)
[i586] MI2a: marked for install (shallow): libcom_err
[i586] MI2a: satisfying Depends: libkeyutils.so.1 >= set:jfWn12U6KThBXgruPLZ68yYZt2
[i586] MI2a: maybe install (a providing target): libkeyutils 1.6.3-alt1:sisyphus+346336.200.2.2@1716472658
[i586] MI2a: target SELECTED: libkeyutils 1.6.3-alt1:sisyphus+346336.200.2.2@1716472658
[i586] MI2a: requesting to install libkeyutils (unspec'd ver; inspect with Debug::pkgMark-shallow)
[i586] MI2a: marked for install (shallow): libkeyutils
[i586] MI2a: satisfying Depends: liblmdb.so.0 >= set:kfalKd4xYAkaAG2MqeH0wB2F4kTaBEo1iv0KFpxVmqzFIV6HJ0
[i586] MI2a: maybe install (a providing target): liblmdb 0.9.33-alt1:sisyphus+360625.100.1.1@1729819639
[i586] MI2a: target SELECTED: liblmdb 0.9.33-alt1:sisyphus+360625.100.1.1@1729819639
[i586] MI2a: requesting to install liblmdb (unspec'd ver; inspect with Debug::pkgMark-shallow)
[i586] MI2a: marked for install (shallow): liblmdb
[i586] MI2a: satisfying Depends: libssl.so.3 >= set:niiRRjOfYK5wgPZ2bvml1CcuMKm8fC0YcLKKRbpcI0BcryMK5hoYIwxo3
[i586] MI2a: maybe install (a providing target): libssl3 3.3.3-alt1:sisyphus+374381.40.2.1@1739299702
[i586] MI2a: target SELECTED: libssl3 3.3.3-alt1:sisyphus+374381.40.2.1@1739299702
[i586] MI2a: requesting to install libssl3 (unspec'd ver; inspect with Debug::pkgMark-shallow)
[i586] MI2a: marked for install (shallow): libssl3
[i586] MI2a: satisfying Depends: libverto.so.1 >= set:jfI5MRvI6tmNn0zwQdb68Gk0
[i586] MI2a: maybe install (a providing target): libverto 0.3.2-alt1_1:sisyphus+321176.2200.10.2@1684806164
[i586] MI2a: target SELECTED: libverto 0.3.2-alt1_1:sisyphus+321176.2200.10.2@1684806164
[i586] MI2a: requesting to install libverto (unspec'd ver; inspect with Debug::pkgMark-shallow)
[i586] MI2a: marked for install (shallow): libverto
[i586] MI2a: satisfying Depends: libidn.so.12 >= set:kiBXars6
[i586] MI2a: maybe install (a providing target): libidn 1.37-alt2:sisyphus+300849.100.1.1@1653769693
[i586] MI2a: target SELECTED: libidn 1.37-alt2:sisyphus+300849.100.1.1@1653769693
[i586] MI2a: requesting to install libidn (unspec'd ver; inspect with Debug::pkgMark-shallow)
[i586] MI2a: marked for install (shallow): libidn
[i586] MI2a: satisfying Depends: libntlm.so.0 >= set:hfknJM1
[i586] MI2a: maybe install (a providing target): libntlm 1.5-alt1:sisyphus+278100.3300.1.1@1626059663
[i586] MI2a: target SELECTED: libntlm 1.5-alt1:sisyphus+278100.3300.1.1@1626059663
[i586] MI2a: requesting to install libntlm (unspec'd ver; inspect with Debug::pkgMark-shallow)
[i586] MI2a: marked for install (shallow): libntlm
[i586] MI2a: satisfying Depends: liblber.so.2 >= set:liRJP9c9FzZ8q5FR
[i586] MI2a: maybe install (a providing target): libldap2 2.6.9-alt2:sisyphus+367501.300.4.1@1735841767
[i586] MI2a: target SELECTED: libldap2 2.6.9-alt2:sisyphus+367501.300.4.1@1735841767
[i586] MI2a: requesting to install libldap2 (unspec'd ver; inspect with Debug::pkgMark-shallow)
[i586] MI2a: marked for install (shallow): libldap2
[i586] MI2a: satisfying Depends: libsasl2.so.3 >= set:lhKAh7QjCM36Vnr6MdFxFf8LIcZsS1kl0wH7Iyp
[i586] MI2a: maybe install (a providing target): libsasl2-3 2.1.28-alt2.1:sisyphus+367419.100.1.1@1735482553
[i586] MI2a: target SELECTED: libsasl2-3 2.1.28-alt2.1:sisyphus+367419.100.1.1@1735482553
[i586] MI2a: requesting to install libsasl2-3 (unspec'd ver; inspect with Debug::pkgMark-shallow)
[i586] MI2a: marked for install (shallow): libsasl2-3
[i586] MI2a: satisfying Depends: openldap-common = 2.6.9-alt2:sisyphus+367501.300.4.1
[i586] MI2a: maybe install (a direct target): openldap-common 2.6.9-alt2:sisyphus+367501.300.4.1@1735841751
[i586] MI2a: target SELECTED: openldap-common 2.6.9-alt2:sisyphus+367501.300.4.1@1735841751
[i586] MI2a: requesting to install openldap-common (unspec'd ver; inspect with Debug::pkgMark-shallow)
[i586] MI2a: marked for install (shallow): openldap-common
[i586] MI2a: satisfying Depends: libnghttp2.so.14 >= set:lfKRgJ8UKsv8mdZbLF8UZpCjqzxjS4uXpINNNC9lNPxPEJZqw9IfpEB51C0QFeHEVpGv95xGtf4CksgxNiZbJO6CvE4RCQxaKbdf6IG29SZkOus
[i586] MI2a: maybe install (a providing target): libnghttp2 1.65.0-alt1:sisyphus+377060.100.1.1@1741259318
[i586] MI2a: target SELECTED: libnghttp2 1.65.0-alt1:sisyphus+377060.100.1.1@1741259318
[i586] MI2a: requesting to install libnghttp2 (unspec'd ver; inspect with Debug::pkgMark-shallow)
[i586] MI2a: marked for install (shallow): libnghttp2
[i586] MI2a: satisfying Depends: libnghttp3.so.9 >= set:kfOHsymuRovZfZIawj4STEmrF1Xh8iHADhCWQYMeA3u6CuDIW7ipo3
[i586] MI2a: maybe install (a providing target): libnghttp3.9 1.8.0-alt1:sisyphus+375942.100.1.1@1740420760
[i586] MI2a: target SELECTED: libnghttp3.9 1.8.0-alt1:sisyphus+375942.100.1.1@1740420760
[i586] MI2a: requesting to install libnghttp3.9 (unspec'd ver; inspect with Debug::pkgMark-shallow)
[i586] MI2a: marked for install (shallow): libnghttp3.9
[i586] MI2a: satisfying Depends: libngtcp2.so.16 >= set:keggzSiMInQoBwKw3hOFjw6C4r5lyewzRrbvfiZqFvO6xZ2fVcSxD0qyPdhyUVRzsodbhSgNzKYVngELjUy4
[i586] MI2a: maybe install (a providing target): libngtcp2.16 1.11.0-alt2:sisyphus+376238.100.1.1@1740635090
[i586] MI2a: target SELECTED: libngtcp2.16 1.11.0-alt2:sisyphus+376238.100.1.1@1740635090
[i586] MI2a: requesting to install libngtcp2.16 (unspec'd ver; inspect with Debug::pkgMark-shallow)
[i586] MI2a: marked for install (shallow): libngtcp2.16
[i586] MI2a: satisfying Depends: libngtcp2_crypto_gnutls8 = 1.11.0-alt2:sisyphus+376238.100.1.1
[i586] MI2a: maybe install (a direct target): libngtcp2_crypto_gnutls8 1.11.0-alt2:sisyphus+376238.100.1.1@1740635090
[i586] MI2a: target SELECTED: libngtcp2_crypto_gnutls8 1.11.0-alt2:sisyphus+376238.100.1.1@1740635090
[i586] MI2a: requesting to install libngtcp2_crypto_gnutls8 (unspec'd ver; inspect with Debug::pkgMark-shallow)
[i586] MI2a: marked for install (shallow): libngtcp2_crypto_gnutls8
[i586] MI2a: satisfying Depends: libpsl.so.5 >= set:ifo8sG4NYozTZj0
[i586] MI2a: maybe install (a providing target): libpsl 0.21.5-alt1:sisyphus+338474.100.1.1@1705684771
[i586] MI2a: target SELECTED: libpsl 0.21.5-alt1:sisyphus+338474.100.1.1@1705684771
[i586] MI2a: requesting to install libpsl (unspec'd ver; inspect with Debug::pkgMark-shallow)
[i586] MI2a: marked for install (shallow): libpsl
[i586] MI2a: satisfying Depends: publicsuffix-list-dafsa (NULL)
[i586] MI2a: maybe install (a direct target): publicsuffix-list-dafsa 20250131-alt1:sisyphus+373297.100.1.1@1738767834
[i586] MI2a: target SELECTED: publicsuffix-list-dafsa 20250131-alt1:sisyphus+373297.100.1.1@1738767834
[i586] MI2a: requesting to install publicsuffix-list-dafsa (unspec'd ver; inspect with Debug::pkgMark-shallow)
[i586] MI2a: marked for install (shallow): publicsuffix-list-dafsa
[i586] MI2a: satisfying Depends: libssh2.so.1 >= set:lfFi2ZJdCZnNQqC7FxZHyYYVCMxI4j1759y3AVs98cSjdm6BZrMSTPA4BKYeWR49vSI0JGO8E3yldZ5j77X8z3joPyGVoiqovNAwPc5RvPDTKNRR6pS6H80qi1nxAdsxOdZERlIwndLqIyuVb
[i586] MI2a: maybe install (a providing target): libssh2 1.11.0-alt2:sisyphus+339356.100.1.1@1706593140
[i586] MI2a: target SELECTED: libssh2 1.11.0-alt2:sisyphus+339356.100.1.1@1706593140
[i586] MI2a: requesting to install libssh2 (unspec'd ver; inspect with Debug::pkgMark-shallow)
[i586] MI2a: marked for install (shallow): libssh2
[i586] MI2a: satisfying Depends: libexpat.so.1 >= set:kgE3cnblKboj81fLUjE91hdZC3R0
[i586] MI2a: maybe install (a providing target): libexpat 2.7.0-alt1:sisyphus+379221.100.1.1@1742909198
[i586] MI2a: target SELECTED: libexpat 2.7.0-alt1:sisyphus+379221.100.1.1@1742909198
[i586] MI2a: requesting to install libexpat (unspec'd ver; inspect with Debug::pkgMark-shallow)
[i586] MI2a: marked for install (shallow): libexpat
[i586] MI2a: satisfying Depends: libjsoncpp.so.24 >= set:mfWdNr9hSTEj33pgekkWiZ5gxiSrhe4i6fCrcyUrA0F5fpZ04ebvZEaLNDQoZ1XGHPAxHVDJ5aZcZxQ50lSKoeaxt2eezKhzTXqFID2IlhAHvrZGslZEcfuuF33wZIrSMlecs5lHGJ0BF56nkfq8fK9xXC8woBKNtsUkXAQIV986ooAGe4BrsbMFVYUMNHZ8JKoGy85OFEz98XUY7
[i586] MI2a: maybe install (a providing target): libjsoncpp24 1.9.4-alt2:sisyphus+346331.200.2.1@1716448553
[i586] MI2a: target SELECTED: libjsoncpp24 1.9.4-alt2:sisyphus+346331.200.2.1@1716448553
[i586] MI2a: requesting to install libjsoncpp24 (unspec'd ver; inspect with Debug::pkgMark-shallow)
[i586] MI2a: marked for install (shallow): libjsoncpp24
[i586] MI2a: satisfying Depends: librhash.so.0 >= set:ifDyZ6eqLIBMAAMoeF3
[i586] MI2a: maybe install (a providing target): librhash 1.3.5-alt3:sisyphus+286141.40.2.1@1632982456
[i586] MI2a: target SELECTED: librhash 1.3.5-alt3:sisyphus+286141.40.2.1@1632982456
[i586] MI2a: requesting to install librhash (unspec'd ver; inspect with Debug::pkgMark-shallow)
[i586] MI2a: marked for install (shallow): librhash
[i586] MI2a: satisfying Depends: libuv.so.1 >= set:mhRqUeic58tAOj8qzoZvhgcZFirSpyDd3iNFI57V8pPeIZrSvAPv9Z9Udh8e5kJuikPvq0
[i586] MI2a: maybe install (a providing target): libuv 1.50.0-alt1:sisyphus+377760.100.1.1@1741795923
[i586] MI2a: target SELECTED: libuv 1.50.0-alt1:sisyphus+377760.100.1.1@1741795923
[i586] MI2a: requesting to install libuv (unspec'd ver; inspect with Debug::pkgMark-shallow)
[i586] MI2a: marked for install (shallow): libuv
[i586] MI2a: satisfying Depends: cmake-modules = 3.31.6-alt1:sisyphus+377691.100.1.1
[i586] MI2a: maybe install (a direct target): cmake-modules 3.31.6-alt1:sisyphus+377691.100.1.1@1741730513
[i586] MI2a: target SELECTED: cmake-modules 3.31.6-alt1:sisyphus+377691.100.1.1@1741730513
[i586] MI2a: requesting to install cmake-modules (unspec'd ver; inspect with Debug::pkgMark-shallow)
[i586] MI2a: marked for install (shallow): cmake-modules
[i586] MI2a: marked for install (shallow): boost-devel-headers
[i586] MI2a: satisfying Depends: boost-devel = 1:1.86.0-alt2:sisyphus+375553.1040.4.1
[i586] MI2a: maybe install (a direct target): boost-devel 1:1.86.0-alt2:sisyphus+375553.1040.4.1@1740170900
[i586] MI2a: target SELECTED: boost-devel 1:1.86.0-alt2:sisyphus+375553.1040.4.1@1740170900
[i586] MI2a: requesting to install boost-devel (unspec'd ver; inspect with Debug::pkgMark-shallow)
[i586] MI2a: marked for install (shallow): boost-devel
[i586] MI2a: satisfying Depends: libquadmath-devel (NULL)
[i586] MI2a: maybe install (a direct target): libquadmath-devel 14-alt1:sisyphus+360995.300.1.1@1730139881
[i586] MI2a: target SELECTED: libquadmath-devel 14-alt1:sisyphus+360995.300.1.1@1730139881
[i586] MI2a: requesting to install libquadmath-devel (unspec'd ver; inspect with Debug::pkgMark-shallow)
[i586] MI2a: marked for install (shallow): libquadmath-devel
[i586] MI2a: satisfying Depends: libquadmath14-devel (NULL)
[i586] MI2a: maybe install (a direct target): libquadmath14-devel 14.2.1-alt1:sisyphus+360995.100.1.1@1730131612
[i586] MI2a: target SELECTED: libquadmath14-devel 14.2.1-alt1:sisyphus+360995.100.1.1@1730131612
[i586] MI2a: requesting to install libquadmath14-devel (unspec'd ver; inspect with Debug::pkgMark-shallow)
[i586] MI2a: marked for install (shallow): libquadmath14-devel
[i586] MI2a: satisfying Depends: libquadmath0 = 14.2.1-alt1:sisyphus+360995.100.1.1
[i586] MI2a: maybe install (a direct target): libquadmath0 14.2.1-alt1:sisyphus+360995.100.1.1@1730131612
[i586] MI2a: target SELECTED: libquadmath0 14.2.1-alt1:sisyphus+360995.100.1.1@1730131612
[i586] MI2a: requesting to install libquadmath0 (unspec'd ver; inspect with Debug::pkgMark-shallow)
[i586] MI2a: marked for install (shallow): libquadmath0
[i586] MI2a: satisfying Depends: libboost_atomic1.86.0 = 1:1.86.0-alt2:sisyphus+375553.1040.4.1
[i586] MI2a: maybe install (a direct target): libboost_atomic1.86.0 1:1.86.0-alt2:sisyphus+375553.1040.4.1@1740170900
[i586] MI2a: target SELECTED: libboost_atomic1.86.0 1:1.86.0-alt2:sisyphus+375553.1040.4.1@1740170900
[i586] MI2a: requesting to install libboost_atomic1.86.0 (unspec'd ver; inspect with Debug::pkgMark-shallow)
[i586] MI2a: marked for install (shallow): libboost_atomic1.86.0
[i586] MI2a: satisfying Depends: libboost_system1.86.0 = 1:1.86.0-alt2:sisyphus+375553.1040.4.1
[i586] MI2a: maybe install (a direct target): libboost_system1.86.0 1:1.86.0-alt2:sisyphus+375553.1040.4.1@1740170900
[i586] MI2a: target SELECTED: libboost_system1.86.0 1:1.86.0-alt2:sisyphus+375553.1040.4.1@1740170900
[i586] MI2a: requesting to install libboost_system1.86.0 (unspec'd ver; inspect with Debug::pkgMark-shallow)
[i586] MI2a: marked for install (shallow): libboost_system1.86.0
[i586] MI2a: satisfying Depends: libboost_charconv1.86.0 = 1:1.86.0-alt2:sisyphus+375553.1040.4.1
[i586] MI2a: maybe install (a direct target): libboost_charconv1.86.0 1:1.86.0-alt2:sisyphus+375553.1040.4.1@1740170900
[i586] MI2a: target SELECTED: libboost_charconv1.86.0 1:1.86.0-alt2:sisyphus+375553.1040.4.1@1740170900
[i586] MI2a: requesting to install libboost_charconv1.86.0 (unspec'd ver; inspect with Debug::pkgMark-shallow)
[i586] MI2a: marked for install (shallow): libboost_charconv1.86.0
[i586] MI2a: satisfying Depends: libboost_container1.86.0 = 1:1.86.0-alt2:sisyphus+375553.1040.4.1
[i586] MI2a: maybe install (a direct target): libboost_container1.86.0 1:1.86.0-alt2:sisyphus+375553.1040.4.1@1740170900
[i586] MI2a: target SELECTED: libboost_container1.86.0 1:1.86.0-alt2:sisyphus+375553.1040.4.1@1740170900
[i586] MI2a: requesting to install libboost_container1.86.0 (unspec'd ver; inspect with Debug::pkgMark-shallow)
[i586] MI2a: marked for install (shallow): libboost_container1.86.0
[i586] MI2a: satisfying Depends: libboost_contract1.86.0 = 1:1.86.0-alt2:sisyphus+375553.1040.4.1
[i586] MI2a: maybe install (a direct target): libboost_contract1.86.0 1:1.86.0-alt2:sisyphus+375553.1040.4.1@1740170900
[i586] MI2a: target SELECTED: libboost_contract1.86.0 1:1.86.0-alt2:sisyphus+375553.1040.4.1@1740170900
[i586] MI2a: requesting to install libboost_contract1.86.0 (unspec'd ver; inspect with Debug::pkgMark-shallow)
[i586] MI2a: marked for install (shallow): libboost_contract1.86.0
[i586] MI2a: satisfying Depends: libboost_date_time1.86.0 = 1:1.86.0-alt2:sisyphus+375553.1040.4.1
[i586] MI2a: maybe install (a direct target): libboost_date_time1.86.0 1:1.86.0-alt2:sisyphus+375553.1040.4.1@1740170900
[i586] MI2a: target SELECTED: libboost_date_time1.86.0 1:1.86.0-alt2:sisyphus+375553.1040.4.1@1740170900
[i586] MI2a: requesting to install libboost_date_time1.86.0 (unspec'd ver; inspect with Debug::pkgMark-shallow)
[i586] MI2a: marked for install (shallow): libboost_date_time1.86.0
[i586] MI2a: satisfying Depends: libboost_graph1.86.0 = 1:1.86.0-alt2:sisyphus+375553.1040.4.1
[i586] MI2a: maybe install (a direct target): libboost_graph1.86.0 1:1.86.0-alt2:sisyphus+375553.1040.4.1@1740170900
[i586] MI2a: target SELECTED: libboost_graph1.86.0 1:1.86.0-alt2:sisyphus+375553.1040.4.1@1740170900
[i586] MI2a: requesting to install libboost_graph1.86.0 (unspec'd ver; inspect with Debug::pkgMark-shallow)
[i586] MI2a: marked for install (shallow): libboost_graph1.86.0
[i586] MI2a: satisfying Depends: libboost_regex1.86.0 = 1:1.86.0-alt2:sisyphus+375553.1040.4.1
[i586] MI2a: maybe install (a direct target): libboost_regex1.86.0 1:1.86.0-alt2:sisyphus+375553.1040.4.1@1740170900
[i586] MI2a: target SELECTED: libboost_regex1.86.0 1:1.86.0-alt2:sisyphus+375553.1040.4.1@1740170900
[i586] MI2a: requesting to install libboost_regex1.86.0 (unspec'd ver; inspect with Debug::pkgMark-shallow)
[i586] MI2a: marked for install (shallow): libboost_regex1.86.0
[i586] MI2a: satisfying Depends: libboost_json1.86.0 = 1:1.86.0-alt2:sisyphus+375553.1040.4.1
[i586] MI2a: maybe install (a direct target): libboost_json1.86.0 1:1.86.0-alt2:sisyphus+375553.1040.4.1@1740170900
[i586] MI2a: target SELECTED: libboost_json1.86.0 1:1.86.0-alt2:sisyphus+375553.1040.4.1@1740170900
[i586] MI2a: requesting to install libboost_json1.86.0 (unspec'd ver; inspect with Debug::pkgMark-shallow)
[i586] MI2a: marked for install (shallow): libboost_json1.86.0
[i586] MI2a: satisfying Depends: libboost_iostreams1.86.0 = 1:1.86.0-alt2:sisyphus+375553.1040.4.1
[i586] MI2a: maybe install (a direct target): libboost_iostreams1.86.0 1:1.86.0-alt2:sisyphus+375553.1040.4.1@1740170900
[i586] MI2a: target SELECTED: libboost_iostreams1.86.0 1:1.86.0-alt2:sisyphus+375553.1040.4.1@1740170900
[i586] MI2a: requesting to install libboost_iostreams1.86.0 (unspec'd ver; inspect with Debug::pkgMark-shallow)
[i586] MI2a: marked for install (shallow): libboost_iostreams1.86.0
[i586] MI2a: satisfying Depends: libboost_process1.86.0 = 1:1.86.0-alt2:sisyphus+375553.1040.4.1
[i586] MI2a: maybe install (a direct target): libboost_process1.86.0 1:1.86.0-alt2:sisyphus+375553.1040.4.1@1740170900
[i586] MI2a: target SELECTED: libboost_process1.86.0 1:1.86.0-alt2:sisyphus+375553.1040.4.1@1740170900
[i586] MI2a: requesting to install libboost_process1.86.0 (unspec'd ver; inspect with Debug::pkgMark-shallow)
[i586] MI2a: marked for install (shallow): libboost_process1.86.0
[i586] MI2a: satisfying Depends: libboost_filesystem1.86.0 = 1:1.86.0-alt2:sisyphus+375553.1040.4.1
[i586] MI2a: maybe install (a direct target): libboost_filesystem1.86.0 1:1.86.0-alt2:sisyphus+375553.1040.4.1@1740170900
[i586] MI2a: target SELECTED: libboost_filesystem1.86.0 1:1.86.0-alt2:sisyphus+375553.1040.4.1@1740170900
[i586] MI2a: requesting to install libboost_filesystem1.86.0 (unspec'd ver; inspect with Debug::pkgMark-shallow)
[i586] MI2a: marked for install (shallow): libboost_filesystem1.86.0
[i586] MI2a: satisfying Depends: libboost_random1.86.0 = 1:1.86.0-alt2:sisyphus+375553.1040.4.1
[i586] MI2a: maybe install (a direct target): libboost_random1.86.0 1:1.86.0-alt2:sisyphus+375553.1040.4.1@1740170900
[i586] MI2a: target SELECTED: libboost_random1.86.0 1:1.86.0-alt2:sisyphus+375553.1040.4.1@1740170900
[i586] MI2a: requesting to install libboost_random1.86.0 (unspec'd ver; inspect with Debug::pkgMark-shallow)
[i586] MI2a: marked for install (shallow): libboost_random1.86.0
[i586] MI2a: satisfying Depends: libboost_serialization1.86.0 = 1:1.86.0-alt2:sisyphus+375553.1040.4.1
[i586] MI2a: maybe install (a direct target): libboost_serialization1.86.0 1:1.86.0-alt2:sisyphus+375553.1040.4.1@1740170900
[i586] MI2a: target SELECTED: libboost_serialization1.86.0 1:1.86.0-alt2:sisyphus+375553.1040.4.1@1740170900
[i586] MI2a: requesting to install libboost_serialization1.86.0 (unspec'd ver; inspect with Debug::pkgMark-shallow)
[i586] MI2a: marked for install (shallow): libboost_serialization1.86.0
[i586] MI2a: satisfying Depends: libboost_test1.86.0 = 1:1.86.0-alt2:sisyphus+375553.1040.4.1
[i586] MI2a: maybe install (a direct target): libboost_test1.86.0 1:1.86.0-alt2:sisyphus+375553.1040.4.1@1740170900
[i586] MI2a: target SELECTED: libboost_test1.86.0 1:1.86.0-alt2:sisyphus+375553.1040.4.1@1740170900
[i586] MI2a: requesting to install libboost_test1.86.0 (unspec'd ver; inspect with Debug::pkgMark-shallow)
[i586] MI2a: marked for install (shallow): libboost_test1.86.0
[i586] MI2a: satisfying Depends: libboost_timer1.86.0 = 1:1.86.0-alt2:sisyphus+375553.1040.4.1
[i586] MI2a: maybe install (a direct target): libboost_timer1.86.0 1:1.86.0-alt2:sisyphus+375553.1040.4.1@1740170900
[i586] MI2a: target SELECTED: libboost_timer1.86.0 1:1.86.0-alt2:sisyphus+375553.1040.4.1@1740170900
[i586] MI2a: requesting to install libboost_timer1.86.0 (unspec'd ver; inspect with Debug::pkgMark-shallow)
[i586] MI2a: marked for install (shallow): libboost_timer1.86.0
[i586] MI2a: satisfying Depends: libboost_chrono1.86.0 = 1:1.86.0-alt2:sisyphus+375553.1040.4.1
[i586] MI2a: maybe install (a direct target): libboost_chrono1.86.0 1:1.86.0-alt2:sisyphus+375553.1040.4.1@1740170900
[i586] MI2a: target SELECTED: libboost_chrono1.86.0 1:1.86.0-alt2:sisyphus+375553.1040.4.1@1740170900
[i586] MI2a: requesting to install libboost_chrono1.86.0 (unspec'd ver; inspect with Debug::pkgMark-shallow)
[i586] MI2a: marked for install (shallow): libboost_chrono1.86.0
[i586] MI2a: satisfying Depends: libboost_url1.86.0 = 1:1.86.0-alt2:sisyphus+375553.1040.4.1
[i586] MI2a: maybe install (a direct target): libboost_url1.86.0 1:1.86.0-alt2:sisyphus+375553.1040.4.1@1740170900
[i586] MI2a: target SELECTED: libboost_url1.86.0 1:1.86.0-alt2:sisyphus+375553.1040.4.1@1740170900
[i586] MI2a: requesting to install libboost_url1.86.0 (unspec'd ver; inspect with Debug::pkgMark-shallow)
[i586] MI2a: marked for install (shallow): libboost_url1.86.0
[i586] MI2a: satisfying Depends: libboost_nowide1.86.0 = 1:1.86.0-alt2:sisyphus+375553.1040.4.1
[i586] MI2a: maybe install (a direct target): libboost_nowide1.86.0 1:1.86.0-alt2:sisyphus+375553.1040.4.1@1740170900
[i586] MI2a: target SELECTED: libboost_nowide1.86.0 1:1.86.0-alt2:sisyphus+375553.1040.4.1@1740170900
[i586] MI2a: requesting to install libboost_nowide1.86.0 (unspec'd ver; inspect with Debug::pkgMark-shallow)
[i586] MI2a: marked for install (shallow): libboost_nowide1.86.0
[i586] MI2a: satisfying Depends: libboost_stacktrace1.86.0 = 1:1.86.0-alt2:sisyphus+375553.1040.4.1
[i586] MI2a: maybe install (a direct target): libboost_stacktrace1.86.0 1:1.86.0-alt2:sisyphus+375553.1040.4.1@1740170900
[i586] MI2a: target SELECTED: libboost_stacktrace1.86.0 1:1.86.0-alt2:sisyphus+375553.1040.4.1@1740170900
[i586] MI2a: requesting to install libboost_stacktrace1.86.0 (unspec'd ver; inspect with Debug::pkgMark-shallow)
[i586] MI2a: marked for install (shallow): libboost_stacktrace1.86.0
[i586] MI2a: satisfying Depends: libboost_fiber1.86.0 = 1:1.86.0-alt2:sisyphus+375553.1040.4.1
[i586] MI2a: maybe install (a direct target): libboost_fiber1.86.0 1:1.86.0-alt2:sisyphus+375553.1040.4.1@1740170900
[i586] MI2a: target SELECTED: libboost_fiber1.86.0 1:1.86.0-alt2:sisyphus+375553.1040.4.1@1740170900
[i586] MI2a: requesting to install libboost_fiber1.86.0 (unspec'd ver; inspect with Debug::pkgMark-shallow)
[i586] MI2a: marked for install (shallow): libboost_fiber1.86.0
[i586] MI2a: satisfying Depends: libboost_context1.86.0 = 1:1.86.0-alt2:sisyphus+375553.1040.4.1
[i586] MI2a: maybe install (a direct target): libboost_context1.86.0 1:1.86.0-alt2:sisyphus+375553.1040.4.1@1740170900
[i586] MI2a: target SELECTED: libboost_context1.86.0 1:1.86.0-alt2:sisyphus+375553.1040.4.1@1740170900
[i586] MI2a: requesting to install libboost_context1.86.0 (unspec'd ver; inspect with Debug::pkgMark-shallow)
[i586] MI2a: marked for install (shallow): libboost_context1.86.0
[i586] MI2a: satisfying Depends: libboost_type_erasure1.86.0 = 1:1.86.0-alt2:sisyphus+375553.1040.4.1
[i586] MI2a: maybe install (a direct target): libboost_type_erasure1.86.0 1:1.86.0-alt2:sisyphus+375553.1040.4.1@1740170900
[i586] MI2a: target SELECTED: libboost_type_erasure1.86.0 1:1.86.0-alt2:sisyphus+375553.1040.4.1@1740170900
[i586] MI2a: requesting to install libboost_type_erasure1.86.0 (unspec'd ver; inspect with Debug::pkgMark-shallow)
[i586] MI2a: marked for install (shallow): libboost_type_erasure1.86.0
[i586] MI2a: satisfying Depends: libboost_thread1.86.0 = 1:1.86.0-alt2:sisyphus+375553.1040.4.1
[i586] MI2a: maybe install (a direct target): libboost_thread1.86.0 1:1.86.0-alt2:sisyphus+375553.1040.4.1@1740170900
[i586] MI2a: target SELECTED: libboost_thread1.86.0 1:1.86.0-alt2:sisyphus+375553.1040.4.1@1740170900
[i586] MI2a: requesting to install libboost_thread1.86.0 (unspec'd ver; inspect with Debug::pkgMark-shallow)
[i586] MI2a: marked for install (shallow): libboost_thread1.86.0
[i586] Package libsdbus-cpp2-devel has no available version, but exists in the database.
[i586] This typically means that the package was mentioned in a dependency and
[i586] never uploaded, has been obsoleted or is not available with the contents
[i586] of sources.list
[i586] However the following packages replace it:
[i586] libsdbus-cpp-devel
[i586] E: Package libsdbus-cpp2-devel has no installation candidate
[i586] hsh-install: Failed to calculate package file list.
[i586] hsh-install: Failed to generate package file list.
2025-Mar-26 13:01:46 :: [i586] alterator-usbmount.git 0.1.3-alt1: remote: cannot build src.rpm
2025-Mar-26 13:01:46 :: [i586] #100 alterator-usbmount.git 0.1.3-alt1: build FAILED
2025-Mar-26 13:01:46 :: [i586] requesting cancellation of task processing
[x86_64] warning: Macro %gpl2plus not found
[x86_64] warning: Macro %cmake not found
[x86_64] warning: Macro %cmake_build not found
[x86_64] warning: Macro %cmake_install not found
[x86_64] Reading Package Lists...
[x86_64] Building Dependency Tree...
[x86_64] MI2a: marked for install (shallow): gcc-c++
[x86_64] MI2a: satisfying Depends: gcc14-c++ (NULL)
[x86_64] MI2a: maybe install (a direct target): gcc14-c++ 14.2.1-alt1:sisyphus+360995.100.1.1@1730131018
[x86_64] MI2a: target SELECTED: gcc14-c++ 14.2.1-alt1:sisyphus+360995.100.1.1@1730131018
[x86_64] MI2a: requesting to install gcc14-c++ (unspec'd ver; inspect with Debug::pkgMark-shallow)
[x86_64] MI2a: marked for install (shallow): gcc14-c++
[x86_64] MI2a: satisfying Depends: libstdc++14-devel = 14.2.1-alt1:sisyphus+360995.100.1.1
[x86_64] MI2a: maybe install (a direct target): libstdc++14-devel 14.2.1-alt1:sisyphus+360995.100.1.1@1730131018
[x86_64] MI2a: target SELECTED: libstdc++14-devel 14.2.1-alt1:sisyphus+360995.100.1.1@1730131018
[x86_64] MI2a: requesting to install libstdc++14-devel (unspec'd ver; inspect with Debug::pkgMark-shallow)
[x86_64] MI2a: marked for install (shallow): libstdc++14-devel
[x86_64] MI2a: satisfying PreDepends: gcc-c++-common >= 1.4.7
[x86_64] MI2a: maybe install (a direct target): gcc-c++-common 1.4.28-alt1:sisyphus+348678.100.1.1@1716396142
[x86_64] MI2a: target SELECTED: gcc-c++-common 1.4.28-alt1:sisyphus+348678.100.1.1@1716396142
[x86_64] MI2a: requesting to install gcc-c++-common (unspec'd ver; inspect with Debug::pkgMark-shallow)
[x86_64] MI2a: marked for install (shallow): gcc-c++-common
[x86_64] MI2a: marked for install (shallow): cmake
[x86_64] MI2a: satisfying Depends: rpm-macros-cmake (NULL)
[x86_64] MI2a: maybe install (a direct target): rpm-macros-cmake 3.29.1-alt1:sisyphus+344518.300.3.1@1712379787
[x86_64] MI2a: target SELECTED: rpm-macros-cmake 3.29.1-alt1:sisyphus+344518.300.3.1@1712379787
[x86_64] MI2a: requesting to install rpm-macros-cmake (unspec'd ver; inspect with Debug::pkgMark-shallow)
[x86_64] MI2a: marked for install (shallow): rpm-macros-cmake
[x86_64] MI2a: satisfying Depends: libarchive.so.13()(64bit) >= set:mfws0SCfLRvPUKXi0gkbE0yqsuzVMI88jwJ7kSDXXM11MUSPfvqwmDm2xDogNmeEkAorJTlC2B1ZatQqH4cJ32OndcAjazDxDaNvG6mMdDQthrMI5Ie5skSvbnLedY5O95MlUcFQ1thxqvQWyDvIECoveyzf0x7I3xw6vu1
[x86_64] MI2a: maybe install (a providing target): libarchive13 3.7.5-alt2:sisyphus+358189.100.1.1@1727162763
[x86_64] MI2a: target SELECTED: libarchive13 3.7.5-alt2:sisyphus+358189.100.1.1@1727162763
[x86_64] MI2a: requesting to install libarchive13 (unspec'd ver; inspect with Debug::pkgMark-shallow)
[x86_64] MI2a: marked for install (shallow): libarchive13
[x86_64] MI2a: satisfying Depends: libcrypto.so.3()(64bit) >= set:ql3PXSClcBY9FOuxT2MmWBTjuZAnRZBckPsGEaWp9qs3syAhoLygApfuKoEShvbjoafnDOFhzK75IPaZxvmCZilEjkjo
[x86_64] MI2a: maybe install (a providing target): libcrypto3 3.3.3-alt1:sisyphus+374381.40.2.1@1739299401
[x86_64] MI2a: target SELECTED: libcrypto3 3.3.3-alt1:sisyphus+374381.40.2.1@1739299401
[x86_64] MI2a: requesting to install libcrypto3 (unspec'd ver; inspect with Debug::pkgMark-shallow)
[x86_64] MI2a: marked for install (shallow): libcrypto3
[x86_64] MI2a: satisfying Depends: openssl-config >= 3.2.0-alt1
[x86_64] MI2a: maybe install (a direct target): openssl-config 3.2.0-alt1:sisyphus+366659.140.4.1@1736956949
[x86_64] MI2a: target SELECTED: openssl-config 3.2.0-alt1:sisyphus+366659.140.4.1@1736956949
[x86_64] MI2a: requesting to install openssl-config (unspec'd ver; inspect with Debug::pkgMark-shallow)
[x86_64] MI2a: marked for install (shallow): openssl-config
[x86_64] MI2a: satisfying Depends: ca-certificates (NULL)
[x86_64] MI2a: maybe install (a direct target): ca-certificates 2025.02.10-alt1:sisyphus+374228.100.4.1@1739265441
[x86_64] MI2a: target SELECTED: ca-certificates 2025.02.10-alt1:sisyphus+374228.100.4.1@1739265441
[x86_64] MI2a: requesting to install ca-certificates (unspec'd ver; inspect with Debug::pkgMark-shallow)
[x86_64] MI2a: marked for install (shallow): ca-certificates
[x86_64] MI2a: satisfying Depends: ca-trust (NULL)
[x86_64] MI2a: maybe install (a direct target): ca-trust 0.2.0-alt1:sisyphus+344843.100.1.1@1712743326
[x86_64] MI2a: target SELECTED: ca-trust 0.2.0-alt1:sisyphus+344843.100.1.1@1712743326
[x86_64] MI2a: requesting to install ca-trust (unspec'd ver; inspect with Debug::pkgMark-shallow)
[x86_64] MI2a: marked for install (shallow): ca-trust
[x86_64] MI2a: satisfying Depends: p11-kit-trust (NULL)
[x86_64] MI2a: maybe install (a direct target): p11-kit-trust 1:0.25.5-alt1:sisyphus+352553.100.1.1@1720622573
[x86_64] MI2a: target SELECTED: p11-kit-trust 1:0.25.5-alt1:sisyphus+352553.100.1.1@1720622573
[x86_64] MI2a: requesting to install p11-kit-trust (unspec'd ver; inspect with Debug::pkgMark-shallow)
[x86_64] MI2a: marked for install (shallow): p11-kit-trust
[x86_64] MI2a: satisfying Depends: /etc/alternatives/packages.d (NULL)
[x86_64] MI2a: maybe install (a providing target): alternatives 0.5.3-alt1:sisyphus+371878.100.1.1@1737988822
[x86_64] MI2a: target SELECTED: alternatives 0.5.3-alt1:sisyphus+371878.100.1.1@1737988822
[x86_64] MI2a: requesting to install alternatives (unspec'd ver; inspect with Debug::pkgMark-shallow)
[x86_64] MI2a: marked for install (shallow): alternatives
[x86_64] MI2a: satisfying Depends: rpm-macros-alternatives = 0.5.3-alt1:sisyphus+371878.100.1.1
[x86_64] MI2a: maybe install (a direct target): rpm-macros-alternatives 0.5.3-alt1:sisyphus+371878.100.1.1@1737988822
[x86_64] MI2a: target SELECTED: rpm-macros-alternatives 0.5.3-alt1:sisyphus+371878.100.1.1@1737988822
[x86_64] MI2a: requesting to install rpm-macros-alternatives (unspec'd ver; inspect with Debug::pkgMark-shallow)
[x86_64] MI2a: marked for install (shallow): rpm-macros-alternatives
[x86_64] MI2a: satisfying Depends: libtasn1.so.6()(64bit) >= set:jfRaXblmF8mf5SLNNXDA2CDacDxCZqQOspDh1
[x86_64] MI2a: maybe install (a providing target): libtasn1 4.20.0-alt2:sisyphus+375829.100.1.1@1740299335
[x86_64] MI2a: target SELECTED: libtasn1 4.20.0-alt2:sisyphus+375829.100.1.1@1740299335
[x86_64] MI2a: requesting to install libtasn1 (unspec'd ver; inspect with Debug::pkgMark-shallow)
[x86_64] MI2a: marked for install (shallow): libtasn1
[x86_64] MI2a: satisfying Depends: libp11-kit = 1:0.25.5-alt1:sisyphus+352553.100.1.1
[x86_64] MI2a: maybe install (a direct target): libp11-kit 1:0.25.5-alt1:sisyphus+352553.100.1.1@1720622573
[x86_64] MI2a: target SELECTED: libp11-kit 1:0.25.5-alt1:sisyphus+352553.100.1.1@1720622573
[x86_64] MI2a: requesting to install libp11-kit (unspec'd ver; inspect with Debug::pkgMark-shallow)
[x86_64] MI2a: marked for install (shallow): libp11-kit
[x86_64] MI2a: satisfying Depends: libcurl.so.4()(64bit) >= set:kgZtdjewuBSOM3YXjuKGePG56ZAe
[x86_64] MI2a: maybe install (a providing target): libcurl 8.12.1-alt1:sisyphus+374517.100.1.1@1739435598
[x86_64] MI2a: target SELECTED: libcurl 8.12.1-alt1:sisyphus+374517.100.1.1@1739435598
[x86_64] MI2a: requesting to install libcurl (unspec'd ver; inspect with Debug::pkgMark-shallow)
[x86_64] MI2a: marked for install (shallow): libcurl
[x86_64] MI2a: satisfying Depends: libbrotlidec.so.1()(64bit) >= set:heroOawuYbTK8
[x86_64] MI2a: maybe install (a providing target): libbrotlidec 1.1.0-alt1:sisyphus+328501.100.1.1@1693598419
[x86_64] MI2a: target SELECTED: libbrotlidec 1.1.0-alt1:sisyphus+328501.100.1.1@1693598419
[x86_64] MI2a: requesting to install libbrotlidec (unspec'd ver; inspect with Debug::pkgMark-shallow)
[x86_64] MI2a: marked for install (shallow): libbrotlidec
[x86_64] MI2a: satisfying Depends: libbrotlicommon = 1.1.0-alt1:sisyphus+328501.100.1.1
[x86_64] MI2a: maybe install (a direct target): libbrotlicommon 1.1.0-alt1:sisyphus+328501.100.1.1@1693598419
[x86_64] MI2a: target SELECTED: libbrotlicommon 1.1.0-alt1:sisyphus+328501.100.1.1@1693598419
[x86_64] MI2a: requesting to install libbrotlicommon (unspec'd ver; inspect with Debug::pkgMark-shallow)
[x86_64] MI2a: marked for install (shallow): libbrotlicommon
[x86_64] MI2a: satisfying Depends: libgnutls.so.30()(64bit) >= set:ohWzKsl3gEhunQQpmsYd9i7QCtiGyfZ1Iaw1tOFZbdeEKESximCRPnIehs3AEMQXZ0e8KN9yV59f8Zeu5QHTtKkulI9mjuLg9NIizyZhpZCsx8sGEZDBhhgZvpnajdZvocWora9BdPXEcA4Z2ghEYo7SHlnQVUueZmZ3mRKhNiuOM9tTy3ea4NtLvppyZ1rbmbbGWLShwembtEyVtUcNpLjugdka8b4
[x86_64] MI2a: maybe install (a providing target): libgnutls30 3.8.9-alt1:sisyphus+375558.200.1.1@1740142583
[x86_64] MI2a: target SELECTED: libgnutls30 3.8.9-alt1:sisyphus+375558.200.1.1@1740142583
[x86_64] MI2a: requesting to install libgnutls30 (unspec'd ver; inspect with Debug::pkgMark-shallow)
[x86_64] MI2a: marked for install (shallow): libgnutls30
[x86_64] MI2a: satisfying Depends: libhogweed.so.6()(64bit) >= set:mfnnj2ZgBdeg17M87tPneezLu1hRaAv7Mvee2P332bHTaZjeCozdeChKl8zpQyflmS6Vy6tRmgHXyW1dkybK4gSLUc4ZqST6Otwai2tAwz0231mJ0KXX1SRmE5Wv1xA3elkz1fS4ARIDtHglVAVYGsrdTpOlAk7oFZ51ji2BIsI0W6X7ePZg
[x86_64] MI2a: maybe install (a providing target): libhogweed6 3.10.1-alt1:sisyphus+372008.100.1.1@1738078259
[x86_64] MI2a: target SELECTED: libhogweed6 3.10.1-alt1:sisyphus+372008.100.1.1@1738078259
[x86_64] MI2a: requesting to install libhogweed6 (unspec'd ver; inspect with Debug::pkgMark-shallow)
[x86_64] MI2a: marked for install (shallow): libhogweed6
[x86_64] MI2a: satisfying Depends: libnettle8 = 3.10.1-alt1:sisyphus+372008.100.1.1
[x86_64] MI2a: maybe install (a direct target): libnettle8 3.10.1-alt1:sisyphus+372008.100.1.1@1738078259
[x86_64] MI2a: target SELECTED: libnettle8 3.10.1-alt1:sisyphus+372008.100.1.1@1738078259
[x86_64] MI2a: requesting to install libnettle8 (unspec'd ver; inspect with Debug::pkgMark-shallow)
[x86_64] MI2a: marked for install (shallow): libnettle8
[x86_64] MI2a: satisfying Depends: libidn2.so.0()(64bit) >= set:ifaFMURofX11
[x86_64] MI2a: maybe install (a providing target): libidn2 2.3.7-alt1:sisyphus+339505.100.1.2@1706718968
[x86_64] MI2a: target SELECTED: libidn2 2.3.7-alt1:sisyphus+339505.100.1.2@1706718968
[x86_64] MI2a: requesting to install libidn2 (unspec'd ver; inspect with Debug::pkgMark-shallow)
[x86_64] MI2a: marked for install (shallow): libidn2
[x86_64] MI2a: satisfying Depends: libgsasl.so.18()(64bit) >= set:jfNMMjxjlLiKUyEAZvcPMCX3
[x86_64] MI2a: maybe install (a providing target): libgsasl18 2.2.1-alt2:sisyphus+359713.200.2.1@1728905430
[x86_64] MI2a: target SELECTED: libgsasl18 2.2.1-alt2:sisyphus+359713.200.2.1@1728905430
[x86_64] MI2a: requesting to install libgsasl18 (unspec'd ver; inspect with Debug::pkgMark-shallow)
[x86_64] MI2a: marked for install (shallow): libgsasl18
[x86_64] MI2a: satisfying Depends: libgssapi_krb5.so.2()(64bit) >= set:lgUI5pnpbNsJUr9F0ECN6LIbSVz7j3UNHAXVG0YYmbjijMyN
[x86_64] MI2a: maybe install (a providing target): libkrb5 1.21.3-alt2:sisyphus+351857.100.1.1@1719735141
[x86_64] MI2a: target SELECTED: libkrb5 1.21.3-alt2:sisyphus+351857.100.1.1@1719735141
[x86_64] MI2a: requesting to install libkrb5 (unspec'd ver; inspect with Debug::pkgMark-shallow)
[x86_64] MI2a: marked for install (shallow): libkrb5
[x86_64] MI2a: satisfying Depends: libcom_err.so.2()(64bit) >= set:ifPl8xIvqFmQe8JQo3
[x86_64] MI2a: maybe install (a providing target): libcom_err 1.47.1.0.10.ad56-alt2:sisyphus+363497.200.3.1@1732729908
[x86_64] MI2a: target SELECTED: libcom_err 1.47.1.0.10.ad56-alt2:sisyphus+363497.200.3.1@1732729908
[x86_64] MI2a: requesting to install libcom_err (unspec'd ver; inspect with Debug::pkgMark-shallow)
[x86_64] MI2a: marked for install (shallow): libcom_err
[x86_64] MI2a: satisfying Depends: libkeyutils.so.1()(64bit) >= set:jfWn12U6KThBXgruPLZ68yYZt2
[x86_64] MI2a: maybe install (a providing target): libkeyutils 1.6.3-alt1:sisyphus+346336.200.2.2@1716472658
[x86_64] MI2a: target SELECTED: libkeyutils 1.6.3-alt1:sisyphus+346336.200.2.2@1716472658
[x86_64] MI2a: requesting to install libkeyutils (unspec'd ver; inspect with Debug::pkgMark-shallow)
[x86_64] MI2a: marked for install (shallow): libkeyutils
[x86_64] MI2a: satisfying Depends: liblmdb.so.0()(64bit) >= set:kfalKd4xYAkaAG2MqeH0wB2F4kTaBEo1iv0KFpxVmqzFIV6HJ0
[x86_64] MI2a: maybe install (a providing target): liblmdb 0.9.33-alt1:sisyphus+360625.100.1.1@1729819640
[x86_64] MI2a: target SELECTED: liblmdb 0.9.33-alt1:sisyphus+360625.100.1.1@1729819640
[x86_64] MI2a: requesting to install liblmdb (unspec'd ver; inspect with Debug::pkgMark-shallow)
[x86_64] MI2a: marked for install (shallow): liblmdb
[x86_64] MI2a: satisfying Depends: libssl.so.3()(64bit) >= set:niiRRjOfYK5wgPZ2bvml1CcuMKm8fC0YcLKKRbpcI0BcryMK5hoYIwxo3
[x86_64] MI2a: maybe install (a providing target): libssl3 3.3.3-alt1:sisyphus+374381.40.2.1@1739299401
[x86_64] MI2a: target SELECTED: libssl3 3.3.3-alt1:sisyphus+374381.40.2.1@1739299401
[x86_64] MI2a: requesting to install libssl3 (unspec'd ver; inspect with Debug::pkgMark-shallow)
[x86_64] MI2a: marked for install (shallow): libssl3
[x86_64] MI2a: satisfying Depends: libverto.so.1()(64bit) >= set:jfI5MRvI6tmNn0zwQdb68Gk0
[x86_64] MI2a: maybe install (a providing target): libverto 0.3.2-alt1_1:sisyphus+321176.2200.10.2@1684803947
[x86_64] MI2a: target SELECTED: libverto 0.3.2-alt1_1:sisyphus+321176.2200.10.2@1684803947
[x86_64] MI2a: requesting to install libverto (unspec'd ver; inspect with Debug::pkgMark-shallow)
[x86_64] MI2a: marked for install (shallow): libverto
[x86_64] MI2a: satisfying Depends: libidn.so.12()(64bit) >= set:kiBXars6
[x86_64] MI2a: maybe install (a providing target): libidn 1.37-alt2:sisyphus+300849.100.1.1@1653769687
[x86_64] MI2a: target SELECTED: libidn 1.37-alt2:sisyphus+300849.100.1.1@1653769687
[x86_64] MI2a: requesting to install libidn (unspec'd ver; inspect with Debug::pkgMark-shallow)
[x86_64] MI2a: marked for install (shallow): libidn
[x86_64] MI2a: satisfying Depends: libntlm.so.0()(64bit) >= set:hfknJM1
[x86_64] MI2a: maybe install (a providing target): libntlm 1.5-alt1:sisyphus+278100.3300.1.1@1626058899
[x86_64] MI2a: target SELECTED: libntlm 1.5-alt1:sisyphus+278100.3300.1.1@1626058899
[x86_64] MI2a: requesting to install libntlm (unspec'd ver; inspect with Debug::pkgMark-shallow)
[x86_64] MI2a: marked for install (shallow): libntlm
[x86_64] MI2a: satisfying Depends: liblber.so.2()(64bit) >= set:liRJP9c9FzZ8q5FR
[x86_64] MI2a: maybe install (a providing target): libldap2 2.6.9-alt2:sisyphus+367501.300.4.1@1735841751
[x86_64] MI2a: target SELECTED: libldap2 2.6.9-alt2:sisyphus+367501.300.4.1@1735841751
[x86_64] MI2a: requesting to install libldap2 (unspec'd ver; inspect with Debug::pkgMark-shallow)
[x86_64] MI2a: marked for install (shallow): libldap2
[x86_64] MI2a: satisfying Depends: libsasl2.so.3()(64bit) >= set:lhKAh7QjCM36Vnr6MdFxFf8LIcZsS1kl0wH7Iyp
[x86_64] MI2a: maybe install (a providing target): libsasl2-3 2.1.28-alt2.1:sisyphus+367419.100.1.1@1735482560
[x86_64] MI2a: target SELECTED: libsasl2-3 2.1.28-alt2.1:sisyphus+367419.100.1.1@1735482560
[x86_64] MI2a: requesting to install libsasl2-3 (unspec'd ver; inspect with Debug::pkgMark-shallow)
[x86_64] MI2a: marked for install (shallow): libsasl2-3
[x86_64] MI2a: satisfying Depends: openldap-common = 2.6.9-alt2:sisyphus+367501.300.4.1
[x86_64] MI2a: maybe install (a direct target): openldap-common 2.6.9-alt2:sisyphus+367501.300.4.1@1735841751
[x86_64] MI2a: target SELECTED: openldap-common 2.6.9-alt2:sisyphus+367501.300.4.1@1735841751
[x86_64] MI2a: requesting to install openldap-common (unspec'd ver; inspect with Debug::pkgMark-shallow)
[x86_64] MI2a: marked for install (shallow): openldap-common
[x86_64] MI2a: satisfying Depends: libnghttp2.so.14()(64bit) >= set:lfKRgJ8UKsv8mdZbLF8UZpCjqzxjS4uXpINNNC9lNPxPEJZqw9IfpEB51C0QFeHEVpGv95xGtf4CksgxNiZbJO6CvE4RCQxaKbdf6IG29SZkOus
[x86_64] MI2a: maybe install (a providing target): libnghttp2 1.65.0-alt1:sisyphus+377060.100.1.1@1741259309
[x86_64] MI2a: target SELECTED: libnghttp2 1.65.0-alt1:sisyphus+377060.100.1.1@1741259309
[x86_64] MI2a: requesting to install libnghttp2 (unspec'd ver; inspect with Debug::pkgMark-shallow)
[x86_64] MI2a: marked for install (shallow): libnghttp2
[x86_64] MI2a: satisfying Depends: libnghttp3.so.9()(64bit) >= set:kfOHsymuRovZfZIawj4STEmrF1Xh8iHADhCWQYMeA3u6CuDIW7ipo3
[x86_64] MI2a: maybe install (a providing target): libnghttp3.9 1.8.0-alt1:sisyphus+375942.100.1.1@1740420759
[x86_64] MI2a: target SELECTED: libnghttp3.9 1.8.0-alt1:sisyphus+375942.100.1.1@1740420759
[x86_64] MI2a: requesting to install libnghttp3.9 (unspec'd ver; inspect with Debug::pkgMark-shallow)
[x86_64] MI2a: marked for install (shallow): libnghttp3.9
[x86_64] MI2a: satisfying Depends: libngtcp2.so.16()(64bit) >= set:keggzSiMInQoBwKw3hOFjw6C4r5lyewzRrbvfiZqFvO6xZ2fVcSxD0qyPdhyUVRzsodbhSgNzKYVngELjUy4
[x86_64] MI2a: maybe install (a providing target): libngtcp2.16 1.11.0-alt2:sisyphus+376238.100.1.1@1740635087
[x86_64] MI2a: target SELECTED: libngtcp2.16 1.11.0-alt2:sisyphus+376238.100.1.1@1740635087
[x86_64] MI2a: requesting to install libngtcp2.16 (unspec'd ver; inspect with Debug::pkgMark-shallow)
[x86_64] MI2a: marked for install (shallow): libngtcp2.16
[x86_64] MI2a: satisfying Depends: libngtcp2_crypto_gnutls8 = 1.11.0-alt2:sisyphus+376238.100.1.1
[x86_64] MI2a: maybe install (a direct target): libngtcp2_crypto_gnutls8 1.11.0-alt2:sisyphus+376238.100.1.1@1740635087
[x86_64] MI2a: target SELECTED: libngtcp2_crypto_gnutls8 1.11.0-alt2:sisyphus+376238.100.1.1@1740635087
[x86_64] MI2a: requesting to install libngtcp2_crypto_gnutls8 (unspec'd ver; inspect with Debug::pkgMark-shallow)
[x86_64] MI2a: marked for install (shallow): libngtcp2_crypto_gnutls8
[x86_64] MI2a: satisfying Depends: libpsl.so.5()(64bit) >= set:ifo8sG4NYozTZj0
[x86_64] MI2a: maybe install (a providing target): libpsl 0.21.5-alt1:sisyphus+338474.100.1.1@1705684769
[x86_64] MI2a: target SELECTED: libpsl 0.21.5-alt1:sisyphus+338474.100.1.1@1705684769
[x86_64] MI2a: requesting to install libpsl (unspec'd ver; inspect with Debug::pkgMark-shallow)
[x86_64] MI2a: marked for install (shallow): libpsl
[x86_64] MI2a: satisfying Depends: publicsuffix-list-dafsa (NULL)
[x86_64] MI2a: maybe install (a direct target): publicsuffix-list-dafsa 20250131-alt1:sisyphus+373297.100.1.1@1738767834
[x86_64] MI2a: target SELECTED: publicsuffix-list-dafsa 20250131-alt1:sisyphus+373297.100.1.1@1738767834
[x86_64] MI2a: requesting to install publicsuffix-list-dafsa (unspec'd ver; inspect with Debug::pkgMark-shallow)
[x86_64] MI2a: marked for install (shallow): publicsuffix-list-dafsa
[x86_64] MI2a: satisfying Depends: libssh2.so.1()(64bit) >= set:lfFi2ZJdCZnNQqC7FxZHyYYVCMxI4j1759y3AVs98cSjdm6BZrMSTPA4BKYeWR49vSI0JGO8E3yldZ5j77X8z3joPyGVoiqovNAwPc5RvPDTKNRR6pS6H80qi1nxAdsxOdZERlIwndLqIyuVb
[x86_64] MI2a: maybe install (a providing target): libssh2 1.11.0-alt2:sisyphus+339356.100.1.1@1706593137
[x86_64] MI2a: target SELECTED: libssh2 1.11.0-alt2:sisyphus+339356.100.1.1@1706593137
[x86_64] MI2a: requesting to install libssh2 (unspec'd ver; inspect with Debug::pkgMark-shallow)
[x86_64] MI2a: marked for install (shallow): libssh2
[x86_64] MI2a: satisfying Depends: libexpat.so.1()(64bit) >= set:kgE3cnblKboj81fLUjE91hdZC3R0
[x86_64] MI2a: maybe install (a providing target): libexpat 2.7.0-alt1:sisyphus+379221.100.1.1@1742909191
[x86_64] MI2a: target SELECTED: libexpat 2.7.0-alt1:sisyphus+379221.100.1.1@1742909191
[x86_64] MI2a: requesting to install libexpat (unspec'd ver; inspect with Debug::pkgMark-shallow)
[x86_64] MI2a: marked for install (shallow): libexpat
[x86_64] MI2a: satisfying Depends: libjsoncpp.so.24()(64bit) >= set:mfWdNr9hSTEj33pgekkWiZ5gxiSrhe4i6fCrcyUrA0F5fpZ04ebvZEaLNDQoZ1XGHPAxHVDJ5aZ8J4EOS5Ph9IjMNpQdqYunbBZ41SG8ORLJvBHW7puYYi760ZFTIxHsoUGjwulnr1aj60ioshZ86OzriUK928mFrs77eRe9dru2y166FawAr1edD77euJ7rtNk5haAjh7jgSNVf
[x86_64] MI2a: maybe install (a providing target): libjsoncpp24 1.9.4-alt2:sisyphus+346331.200.2.1@1716448551
[x86_64] MI2a: target SELECTED: libjsoncpp24 1.9.4-alt2:sisyphus+346331.200.2.1@1716448551
[x86_64] MI2a: requesting to install libjsoncpp24 (unspec'd ver; inspect with Debug::pkgMark-shallow)
[x86_64] MI2a: marked for install (shallow): libjsoncpp24
[x86_64] MI2a: satisfying Depends: librhash.so.0()(64bit) >= set:ifDyZ6eqLIBMAAMoeF3
[x86_64] MI2a: maybe install (a providing target): librhash 1.3.5-alt3:sisyphus+286141.40.2.1@1632982456
[x86_64] MI2a: target SELECTED: librhash 1.3.5-alt3:sisyphus+286141.40.2.1@1632982456
[x86_64] MI2a: requesting to install librhash (unspec'd ver; inspect with Debug::pkgMark-shallow)
[x86_64] MI2a: marked for install (shallow): librhash
[x86_64] MI2a: satisfying Depends: libuv.so.1()(64bit) >= set:mhRqUeic58tAOj8qzoZvhgcZFirSpyDd3iNFI57V8pPeIZrSvAPv9Z9Udh8e5kJuikPvq0
[x86_64] MI2a: maybe install (a providing target): libuv 1.50.0-alt1:sisyphus+377760.100.1.1@1741795923
[x86_64] MI2a: target SELECTED: libuv 1.50.0-alt1:sisyphus+377760.100.1.1@1741795923
[x86_64] MI2a: requesting to install libuv (unspec'd ver; inspect with Debug::pkgMark-shallow)
[x86_64] MI2a: marked for install (shallow): libuv
[x86_64] MI2a: satisfying Depends: cmake-modules = 3.31.6-alt1:sisyphus+377691.100.1.1
[x86_64] MI2a: maybe install (a direct target): cmake-modules 3.31.6-alt1:sisyphus+377691.100.1.1@1741730513
[x86_64] MI2a: target SELECTED: cmake-modules 3.31.6-alt1:sisyphus+377691.100.1.1@1741730513
[x86_64] MI2a: requesting to install cmake-modules (unspec'd ver; inspect with Debug::pkgMark-shallow)
[x86_64] MI2a: marked for install (shallow): cmake-modules
[x86_64] MI2a: marked for install (shallow): boost-devel-headers
[x86_64] MI2a: satisfying Depends: boost-devel = 1:1.86.0-alt2:sisyphus+375553.1040.4.1
[x86_64] MI2a: maybe install (a direct target): boost-devel 1:1.86.0-alt2:sisyphus+375553.1040.4.1@1740170417
[x86_64] MI2a: target SELECTED: boost-devel 1:1.86.0-alt2:sisyphus+375553.1040.4.1@1740170417
[x86_64] MI2a: requesting to install boost-devel (unspec'd ver; inspect with Debug::pkgMark-shallow)
[x86_64] MI2a: marked for install (shallow): boost-devel
[x86_64] MI2a: satisfying Depends: libquadmath-devel (NULL)
[x86_64] MI2a: maybe install (a direct target): libquadmath-devel 14-alt1:sisyphus+360995.300.1.1@1730139222
[x86_64] MI2a: target SELECTED: libquadmath-devel 14-alt1:sisyphus+360995.300.1.1@1730139222
[x86_64] MI2a: requesting to install libquadmath-devel (unspec'd ver; inspect with Debug::pkgMark-shallow)
[x86_64] MI2a: marked for install (shallow): libquadmath-devel
[x86_64] MI2a: satisfying Depends: libquadmath14-devel (NULL)
[x86_64] MI2a: maybe install (a direct target): libquadmath14-devel 14.2.1-alt1:sisyphus+360995.100.1.1@1730131018
[x86_64] MI2a: target SELECTED: libquadmath14-devel 14.2.1-alt1:sisyphus+360995.100.1.1@1730131018
[x86_64] MI2a: requesting to install libquadmath14-devel (unspec'd ver; inspect with Debug::pkgMark-shallow)
[x86_64] MI2a: marked for install (shallow): libquadmath14-devel
[x86_64] MI2a: satisfying Depends: libquadmath0 = 14.2.1-alt1:sisyphus+360995.100.1.1
[x86_64] MI2a: maybe install (a direct target): libquadmath0 14.2.1-alt1:sisyphus+360995.100.1.1@1730131018
[x86_64] MI2a: target SELECTED: libquadmath0 14.2.1-alt1:sisyphus+360995.100.1.1@1730131018
[x86_64] MI2a: requesting to install libquadmath0 (unspec'd ver; inspect with Debug::pkgMark-shallow)
[x86_64] MI2a: marked for install (shallow): libquadmath0
[x86_64] MI2a: satisfying Depends: libboost_atomic1.86.0 = 1:1.86.0-alt2:sisyphus+375553.1040.4.1
[x86_64] MI2a: maybe install (a direct target): libboost_atomic1.86.0 1:1.86.0-alt2:sisyphus+375553.1040.4.1@1740170417
[x86_64] MI2a: target SELECTED: libboost_atomic1.86.0 1:1.86.0-alt2:sisyphus+375553.1040.4.1@1740170417
[x86_64] MI2a: requesting to install libboost_atomic1.86.0 (unspec'd ver; inspect with Debug::pkgMark-shallow)
[x86_64] MI2a: marked for install (shallow): libboost_atomic1.86.0
[x86_64] MI2a: satisfying Depends: libboost_system1.86.0 = 1:1.86.0-alt2:sisyphus+375553.1040.4.1
[x86_64] MI2a: maybe install (a direct target): libboost_system1.86.0 1:1.86.0-alt2:sisyphus+375553.1040.4.1@1740170417
[x86_64] MI2a: target SELECTED: libboost_system1.86.0 1:1.86.0-alt2:sisyphus+375553.1040.4.1@1740170417
[x86_64] MI2a: requesting to install libboost_system1.86.0 (unspec'd ver; inspect with Debug::pkgMark-shallow)
[x86_64] MI2a: marked for install (shallow): libboost_system1.86.0
[x86_64] MI2a: satisfying Depends: libboost_charconv1.86.0 = 1:1.86.0-alt2:sisyphus+375553.1040.4.1
[x86_64] MI2a: maybe install (a direct target): libboost_charconv1.86.0 1:1.86.0-alt2:sisyphus+375553.1040.4.1@1740170417
[x86_64] MI2a: target SELECTED: libboost_charconv1.86.0 1:1.86.0-alt2:sisyphus+375553.1040.4.1@1740170417
[x86_64] MI2a: requesting to install libboost_charconv1.86.0 (unspec'd ver; inspect with Debug::pkgMark-shallow)
[x86_64] MI2a: marked for install (shallow): libboost_charconv1.86.0
[x86_64] MI2a: satisfying Depends: libboost_container1.86.0 = 1:1.86.0-alt2:sisyphus+375553.1040.4.1
[x86_64] MI2a: maybe install (a direct target): libboost_container1.86.0 1:1.86.0-alt2:sisyphus+375553.1040.4.1@1740170417
[x86_64] MI2a: target SELECTED: libboost_container1.86.0 1:1.86.0-alt2:sisyphus+375553.1040.4.1@1740170417
[x86_64] MI2a: requesting to install libboost_container1.86.0 (unspec'd ver; inspect with Debug::pkgMark-shallow)
[x86_64] MI2a: marked for install (shallow): libboost_container1.86.0
[x86_64] MI2a: satisfying Depends: libboost_contract1.86.0 = 1:1.86.0-alt2:sisyphus+375553.1040.4.1
[x86_64] MI2a: maybe install (a direct target): libboost_contract1.86.0 1:1.86.0-alt2:sisyphus+375553.1040.4.1@1740170417
[x86_64] MI2a: target SELECTED: libboost_contract1.86.0 1:1.86.0-alt2:sisyphus+375553.1040.4.1@1740170417
[x86_64] MI2a: requesting to install libboost_contract1.86.0 (unspec'd ver; inspect with Debug::pkgMark-shallow)
[x86_64] MI2a: marked for install (shallow): libboost_contract1.86.0
[x86_64] MI2a: satisfying Depends: libboost_date_time1.86.0 = 1:1.86.0-alt2:sisyphus+375553.1040.4.1
[x86_64] MI2a: maybe install (a direct target): libboost_date_time1.86.0 1:1.86.0-alt2:sisyphus+375553.1040.4.1@1740170417
[x86_64] MI2a: target SELECTED: libboost_date_time1.86.0 1:1.86.0-alt2:sisyphus+375553.1040.4.1@1740170417
[x86_64] MI2a: requesting to install libboost_date_time1.86.0 (unspec'd ver; inspect with Debug::pkgMark-shallow)
[x86_64] MI2a: marked for install (shallow): libboost_date_time1.86.0
[x86_64] MI2a: satisfying Depends: libboost_graph1.86.0 = 1:1.86.0-alt2:sisyphus+375553.1040.4.1
[x86_64] MI2a: maybe install (a direct target): libboost_graph1.86.0 1:1.86.0-alt2:sisyphus+375553.1040.4.1@1740170417
[x86_64] MI2a: target SELECTED: libboost_graph1.86.0 1:1.86.0-alt2:sisyphus+375553.1040.4.1@1740170417
[x86_64] MI2a: requesting to install libboost_graph1.86.0 (unspec'd ver; inspect with Debug::pkgMark-shallow)
[x86_64] MI2a: marked for install (shallow): libboost_graph1.86.0
[x86_64] MI2a: satisfying Depends: libboost_regex1.86.0 = 1:1.86.0-alt2:sisyphus+375553.1040.4.1
[x86_64] MI2a: maybe install (a direct target): libboost_regex1.86.0 1:1.86.0-alt2:sisyphus+375553.1040.4.1@1740170417
[x86_64] MI2a: target SELECTED: libboost_regex1.86.0 1:1.86.0-alt2:sisyphus+375553.1040.4.1@1740170417
[x86_64] MI2a: requesting to install libboost_regex1.86.0 (unspec'd ver; inspect with Debug::pkgMark-shallow)
[x86_64] MI2a: marked for install (shallow): libboost_regex1.86.0
[x86_64] MI2a: satisfying Depends: libboost_json1.86.0 = 1:1.86.0-alt2:sisyphus+375553.1040.4.1
[x86_64] MI2a: maybe install (a direct target): libboost_json1.86.0 1:1.86.0-alt2:sisyphus+375553.1040.4.1@1740170417
[x86_64] MI2a: target SELECTED: libboost_json1.86.0 1:1.86.0-alt2:sisyphus+375553.1040.4.1@1740170417
[x86_64] MI2a: requesting to install libboost_json1.86.0 (unspec'd ver; inspect with Debug::pkgMark-shallow)
[x86_64] MI2a: marked for install (shallow): libboost_json1.86.0
[x86_64] MI2a: satisfying Depends: libboost_iostreams1.86.0 = 1:1.86.0-alt2:sisyphus+375553.1040.4.1
[x86_64] MI2a: maybe install (a direct target): libboost_iostreams1.86.0 1:1.86.0-alt2:sisyphus+375553.1040.4.1@1740170417
[x86_64] MI2a: target SELECTED: libboost_iostreams1.86.0 1:1.86.0-alt2:sisyphus+375553.1040.4.1@1740170417
[x86_64] MI2a: requesting to install libboost_iostreams1.86.0 (unspec'd ver; inspect with Debug::pkgMark-shallow)
[x86_64] MI2a: marked for install (shallow): libboost_iostreams1.86.0
[x86_64] MI2a: satisfying Depends: libboost_process1.86.0 = 1:1.86.0-alt2:sisyphus+375553.1040.4.1
[x86_64] MI2a: maybe install (a direct target): libboost_process1.86.0 1:1.86.0-alt2:sisyphus+375553.1040.4.1@1740170417
[x86_64] MI2a: target SELECTED: libboost_process1.86.0 1:1.86.0-alt2:sisyphus+375553.1040.4.1@1740170417
[x86_64] MI2a: requesting to install libboost_process1.86.0 (unspec'd ver; inspect with Debug::pkgMark-shallow)
[x86_64] MI2a: marked for install (shallow): libboost_process1.86.0
[x86_64] MI2a: satisfying Depends: libboost_filesystem1.86.0 = 1:1.86.0-alt2:sisyphus+375553.1040.4.1
[x86_64] MI2a: maybe install (a direct target): libboost_filesystem1.86.0 1:1.86.0-alt2:sisyphus+375553.1040.4.1@1740170417
[x86_64] MI2a: target SELECTED: libboost_filesystem1.86.0 1:1.86.0-alt2:sisyphus+375553.1040.4.1@1740170417
[x86_64] MI2a: requesting to install libboost_filesystem1.86.0 (unspec'd ver; inspect with Debug::pkgMark-shallow)
[x86_64] MI2a: marked for install (shallow): libboost_filesystem1.86.0
[x86_64] MI2a: satisfying Depends: libboost_random1.86.0 = 1:1.86.0-alt2:sisyphus+375553.1040.4.1
[x86_64] MI2a: maybe install (a direct target): libboost_random1.86.0 1:1.86.0-alt2:sisyphus+375553.1040.4.1@1740170417
[x86_64] MI2a: target SELECTED: libboost_random1.86.0 1:1.86.0-alt2:sisyphus+375553.1040.4.1@1740170417
[x86_64] MI2a: requesting to install libboost_random1.86.0 (unspec'd ver; inspect with Debug::pkgMark-shallow)
[x86_64] MI2a: marked for install (shallow): libboost_random1.86.0
[x86_64] MI2a: satisfying Depends: libboost_serialization1.86.0 = 1:1.86.0-alt2:sisyphus+375553.1040.4.1
[x86_64] MI2a: maybe install (a direct target): libboost_serialization1.86.0 1:1.86.0-alt2:sisyphus+375553.1040.4.1@1740170417
[x86_64] MI2a: target SELECTED: libboost_serialization1.86.0 1:1.86.0-alt2:sisyphus+375553.1040.4.1@1740170417
[x86_64] MI2a: requesting to install libboost_serialization1.86.0 (unspec'd ver; inspect with Debug::pkgMark-shallow)
[x86_64] MI2a: marked for install (shallow): libboost_serialization1.86.0
[x86_64] MI2a: satisfying Depends: libboost_test1.86.0 = 1:1.86.0-alt2:sisyphus+375553.1040.4.1
[x86_64] MI2a: maybe install (a direct target): libboost_test1.86.0 1:1.86.0-alt2:sisyphus+375553.1040.4.1@1740170417
[x86_64] MI2a: target SELECTED: libboost_test1.86.0 1:1.86.0-alt2:sisyphus+375553.1040.4.1@1740170417
[x86_64] MI2a: requesting to install libboost_test1.86.0 (unspec'd ver; inspect with Debug::pkgMark-shallow)
[x86_64] MI2a: marked for install (shallow): libboost_test1.86.0
[x86_64] MI2a: satisfying Depends: libboost_timer1.86.0 = 1:1.86.0-alt2:sisyphus+375553.1040.4.1
[x86_64] MI2a: maybe install (a direct target): libboost_timer1.86.0 1:1.86.0-alt2:sisyphus+375553.1040.4.1@1740170417
[x86_64] MI2a: target SELECTED: libboost_timer1.86.0 1:1.86.0-alt2:sisyphus+375553.1040.4.1@1740170417
[x86_64] MI2a: requesting to install libboost_timer1.86.0 (unspec'd ver; inspect with Debug::pkgMark-shallow)
[x86_64] MI2a: marked for install (shallow): libboost_timer1.86.0
[x86_64] MI2a: satisfying Depends: libboost_chrono1.86.0 = 1:1.86.0-alt2:sisyphus+375553.1040.4.1
[x86_64] MI2a: maybe install (a direct target): libboost_chrono1.86.0 1:1.86.0-alt2:sisyphus+375553.1040.4.1@1740170417
[x86_64] MI2a: target SELECTED: libboost_chrono1.86.0 1:1.86.0-alt2:sisyphus+375553.1040.4.1@1740170417
[x86_64] MI2a: requesting to install libboost_chrono1.86.0 (unspec'd ver; inspect with Debug::pkgMark-shallow)
[x86_64] MI2a: marked for install (shallow): libboost_chrono1.86.0
[x86_64] MI2a: satisfying Depends: libboost_url1.86.0 = 1:1.86.0-alt2:sisyphus+375553.1040.4.1
[x86_64] MI2a: maybe install (a direct target): libboost_url1.86.0 1:1.86.0-alt2:sisyphus+375553.1040.4.1@1740170417
[x86_64] MI2a: target SELECTED: libboost_url1.86.0 1:1.86.0-alt2:sisyphus+375553.1040.4.1@1740170417
[x86_64] MI2a: requesting to install libboost_url1.86.0 (unspec'd ver; inspect with Debug::pkgMark-shallow)
[x86_64] MI2a: marked for install (shallow): libboost_url1.86.0
[x86_64] MI2a: satisfying Depends: libboost_nowide1.86.0 = 1:1.86.0-alt2:sisyphus+375553.1040.4.1
[x86_64] MI2a: maybe install (a direct target): libboost_nowide1.86.0 1:1.86.0-alt2:sisyphus+375553.1040.4.1@1740170417
[x86_64] MI2a: target SELECTED: libboost_nowide1.86.0 1:1.86.0-alt2:sisyphus+375553.1040.4.1@1740170417
[x86_64] MI2a: requesting to install libboost_nowide1.86.0 (unspec'd ver; inspect with Debug::pkgMark-shallow)
[x86_64] MI2a: marked for install (shallow): libboost_nowide1.86.0
[x86_64] MI2a: satisfying Depends: libboost_stacktrace1.86.0 = 1:1.86.0-alt2:sisyphus+375553.1040.4.1
[x86_64] MI2a: maybe install (a direct target): libboost_stacktrace1.86.0 1:1.86.0-alt2:sisyphus+375553.1040.4.1@1740170417
[x86_64] MI2a: target SELECTED: libboost_stacktrace1.86.0 1:1.86.0-alt2:sisyphus+375553.1040.4.1@1740170417
[x86_64] MI2a: requesting to install libboost_stacktrace1.86.0 (unspec'd ver; inspect with Debug::pkgMark-shallow)
[x86_64] MI2a: marked for install (shallow): libboost_stacktrace1.86.0
[x86_64] MI2a: satisfying Depends: libboost_fiber1.86.0 = 1:1.86.0-alt2:sisyphus+375553.1040.4.1
[x86_64] MI2a: maybe install (a direct target): libboost_fiber1.86.0 1:1.86.0-alt2:sisyphus+375553.1040.4.1@1740170417
[x86_64] MI2a: target SELECTED: libboost_fiber1.86.0 1:1.86.0-alt2:sisyphus+375553.1040.4.1@1740170417
[x86_64] MI2a: requesting to install libboost_fiber1.86.0 (unspec'd ver; inspect with Debug::pkgMark-shallow)
[x86_64] MI2a: marked for install (shallow): libboost_fiber1.86.0
[x86_64] MI2a: satisfying Depends: libboost_context1.86.0 = 1:1.86.0-alt2:sisyphus+375553.1040.4.1
[x86_64] MI2a: maybe install (a direct target): libboost_context1.86.0 1:1.86.0-alt2:sisyphus+375553.1040.4.1@1740170417
[x86_64] MI2a: target SELECTED: libboost_context1.86.0 1:1.86.0-alt2:sisyphus+375553.1040.4.1@1740170417
[x86_64] MI2a: requesting to install libboost_context1.86.0 (unspec'd ver; inspect with Debug::pkgMark-shallow)
[x86_64] MI2a: marked for install (shallow): libboost_context1.86.0
[x86_64] MI2a: satisfying Depends: libboost_type_erasure1.86.0 = 1:1.86.0-alt2:sisyphus+375553.1040.4.1
[x86_64] MI2a: maybe install (a direct target): libboost_type_erasure1.86.0 1:1.86.0-alt2:sisyphus+375553.1040.4.1@1740170417
[x86_64] MI2a: target SELECTED: libboost_type_erasure1.86.0 1:1.86.0-alt2:sisyphus+375553.1040.4.1@1740170417
[x86_64] MI2a: requesting to install libboost_type_erasure1.86.0 (unspec'd ver; inspect with Debug::pkgMark-shallow)
[x86_64] MI2a: marked for install (shallow): libboost_type_erasure1.86.0
[x86_64] MI2a: satisfying Depends: libboost_thread1.86.0 = 1:1.86.0-alt2:sisyphus+375553.1040.4.1
[x86_64] MI2a: maybe install (a direct target): libboost_thread1.86.0 1:1.86.0-alt2:sisyphus+375553.1040.4.1@1740170417
[x86_64] MI2a: target SELECTED: libboost_thread1.86.0 1:1.86.0-alt2:sisyphus+375553.1040.4.1@1740170417
[x86_64] MI2a: requesting to install libboost_thread1.86.0 (unspec'd ver; inspect with Debug::pkgMark-shallow)
[x86_64] MI2a: marked for install (shallow): libboost_thread1.86.0
[x86_64] Package libsdbus-cpp2-devel has no available version, but exists in the database.
[x86_64] This typically means that the package was mentioned in a dependency and
[x86_64] never uploaded, has been obsoleted or is not available with the contents
[x86_64] of sources.list
[x86_64] However the following packages replace it:
[x86_64] libsdbus-cpp-devel
[x86_64] E: Package libsdbus-cpp2-devel has no installation candidate
[x86_64] hsh-install: Failed to calculate package file list.
[x86_64] hsh-install: Failed to generate package file list.
2025-Mar-26 13:01:47 :: [x86_64] alterator-usbmount.git 0.1.3-alt1: remote: cannot build src.rpm
2025-Mar-26 13:01:47 :: [x86_64] #100 alterator-usbmount.git 0.1.3-alt1: build FAILED
[aarch64] warning: Macro %gpl2plus not found
[aarch64] warning: Macro %cmake not found
[aarch64] warning: Macro %cmake_build not found
[aarch64] warning: Macro %cmake_install not found
[aarch64] Reading Package Lists...
[aarch64] Building Dependency Tree...
[aarch64] MI2a: marked for install (shallow): gcc-c++
[aarch64] MI2a: satisfying Depends: gcc14-c++ (NULL)
[aarch64] MI2a: maybe install (a direct target): gcc14-c++ 14.2.1-alt1:sisyphus+360995.100.1.1@1730138260
[aarch64] MI2a: target SELECTED: gcc14-c++ 14.2.1-alt1:sisyphus+360995.100.1.1@1730138260
[aarch64] MI2a: requesting to install gcc14-c++ (unspec'd ver; inspect with Debug::pkgMark-shallow)
[aarch64] MI2a: marked for install (shallow): gcc14-c++
[aarch64] MI2a: satisfying Depends: libstdc++14-devel = 14.2.1-alt1:sisyphus+360995.100.1.1
[aarch64] MI2a: maybe install (a direct target): libstdc++14-devel 14.2.1-alt1:sisyphus+360995.100.1.1@1730138260
[aarch64] MI2a: target SELECTED: libstdc++14-devel 14.2.1-alt1:sisyphus+360995.100.1.1@1730138260
[aarch64] MI2a: requesting to install libstdc++14-devel (unspec'd ver; inspect with Debug::pkgMark-shallow)
[aarch64] MI2a: marked for install (shallow): libstdc++14-devel
[aarch64] MI2a: satisfying PreDepends: gcc-c++-common >= 1.4.7
[aarch64] MI2a: maybe install (a direct target): gcc-c++-common 1.4.28-alt1:sisyphus+348678.100.1.1@1716396142
[aarch64] MI2a: target SELECTED: gcc-c++-common 1.4.28-alt1:sisyphus+348678.100.1.1@1716396142
[aarch64] MI2a: requesting to install gcc-c++-common (unspec'd ver; inspect with Debug::pkgMark-shallow)
[aarch64] MI2a: marked for install (shallow): gcc-c++-common
[aarch64] MI2a: marked for install (shallow): cmake
[aarch64] MI2a: satisfying Depends: rpm-macros-cmake (NULL)
[aarch64] MI2a: maybe install (a direct target): rpm-macros-cmake 3.29.1-alt1:sisyphus+344518.300.3.1@1712379787
[aarch64] MI2a: target SELECTED: rpm-macros-cmake 3.29.1-alt1:sisyphus+344518.300.3.1@1712379787
[aarch64] MI2a: requesting to install rpm-macros-cmake (unspec'd ver; inspect with Debug::pkgMark-shallow)
[aarch64] MI2a: marked for install (shallow): rpm-macros-cmake
[aarch64] MI2a: satisfying Depends: libarchive.so.13()(64bit) >= set:mfws0SCfLRvPUKXi0gkbE0yqsuzVMI88jwJ7kSDXXM11MUSPfvqwmDm2xDogNmeEkAorJTlC2B1ZatQqH4cJ32OndcAjazDxDaNvG6mMdDQthrMI5Ie5skSvbnLedY5O95MlUcFQ1thxqvQWyDvIECoveyzf0x7I3xw6vu1
[aarch64] MI2a: maybe install (a providing target): libarchive13 3.7.5-alt2:sisyphus+358189.100.1.1@1727162825
[aarch64] MI2a: target SELECTED: libarchive13 3.7.5-alt2:sisyphus+358189.100.1.1@1727162825
[aarch64] MI2a: requesting to install libarchive13 (unspec'd ver; inspect with Debug::pkgMark-shallow)
[aarch64] MI2a: marked for install (shallow): libarchive13
[aarch64] MI2a: satisfying Depends: libcrypto.so.3()(64bit) >= set:ql3PXSClcBY9FOuxT2MmWBTjuZAnRZBckPsGEaWp9qs3syAhoLygApfuKoEShvbjoafnDOFhzK75IPaZxvmCZilEjkjo
[aarch64] MI2a: maybe install (a providing target): libcrypto3 3.3.3-alt1:sisyphus+374381.40.2.1@1739300002
[aarch64] MI2a: target SELECTED: libcrypto3 3.3.3-alt1:sisyphus+374381.40.2.1@1739300002
[aarch64] MI2a: requesting to install libcrypto3 (unspec'd ver; inspect with Debug::pkgMark-shallow)
[aarch64] MI2a: marked for install (shallow): libcrypto3
[aarch64] MI2a: satisfying Depends: openssl-config >= 3.2.0-alt1
[aarch64] MI2a: maybe install (a direct target): openssl-config 3.2.0-alt1:sisyphus+366659.140.4.1@1736956949
[aarch64] MI2a: target SELECTED: openssl-config 3.2.0-alt1:sisyphus+366659.140.4.1@1736956949
[aarch64] MI2a: requesting to install openssl-config (unspec'd ver; inspect with Debug::pkgMark-shallow)
[aarch64] MI2a: marked for install (shallow): openssl-config
[aarch64] MI2a: satisfying Depends: ca-certificates (NULL)
[aarch64] MI2a: maybe install (a direct target): ca-certificates 2025.02.10-alt1:sisyphus+374228.100.4.1@1739265441
[aarch64] MI2a: target SELECTED: ca-certificates 2025.02.10-alt1:sisyphus+374228.100.4.1@1739265441
[aarch64] MI2a: requesting to install ca-certificates (unspec'd ver; inspect with Debug::pkgMark-shallow)
[aarch64] MI2a: marked for install (shallow): ca-certificates
[aarch64] MI2a: satisfying Depends: ca-trust (NULL)
[aarch64] MI2a: maybe install (a direct target): ca-trust 0.2.0-alt1:sisyphus+344843.100.1.1@1712743326
[aarch64] MI2a: target SELECTED: ca-trust 0.2.0-alt1:sisyphus+344843.100.1.1@1712743326
[aarch64] MI2a: requesting to install ca-trust (unspec'd ver; inspect with Debug::pkgMark-shallow)
[aarch64] MI2a: marked for install (shallow): ca-trust
[aarch64] MI2a: satisfying Depends: p11-kit-trust (NULL)
[aarch64] MI2a: maybe install (a direct target): p11-kit-trust 1:0.25.5-alt1:sisyphus+352553.100.1.1@1720622713
[aarch64] MI2a: target SELECTED: p11-kit-trust 1:0.25.5-alt1:sisyphus+352553.100.1.1@1720622713
[aarch64] MI2a: requesting to install p11-kit-trust (unspec'd ver; inspect with Debug::pkgMark-shallow)
[aarch64] MI2a: marked for install (shallow): p11-kit-trust
[aarch64] MI2a: satisfying Depends: /etc/alternatives/packages.d (NULL)
[aarch64] MI2a: maybe install (a providing target): alternatives 0.5.3-alt1:sisyphus+371878.100.1.1@1737988822
[aarch64] MI2a: target SELECTED: alternatives 0.5.3-alt1:sisyphus+371878.100.1.1@1737988822
[aarch64] MI2a: requesting to install alternatives (unspec'd ver; inspect with Debug::pkgMark-shallow)
[aarch64] MI2a: marked for install (shallow): alternatives
[aarch64] MI2a: satisfying Depends: rpm-macros-alternatives = 0.5.3-alt1:sisyphus+371878.100.1.1
[aarch64] MI2a: maybe install (a direct target): rpm-macros-alternatives 0.5.3-alt1:sisyphus+371878.100.1.1@1737988822
[aarch64] MI2a: target SELECTED: rpm-macros-alternatives 0.5.3-alt1:sisyphus+371878.100.1.1@1737988822
[aarch64] MI2a: requesting to install rpm-macros-alternatives (unspec'd ver; inspect with Debug::pkgMark-shallow)
[aarch64] MI2a: marked for install (shallow): rpm-macros-alternatives
[aarch64] MI2a: satisfying Depends: libtasn1.so.6()(64bit) >= set:jfRaXblmF8mf5SLNNXDA2CDacDxCZqQOspDh1
[aarch64] MI2a: maybe install (a providing target): libtasn1 4.20.0-alt2:sisyphus+375829.100.1.1@1740299365
[aarch64] MI2a: target SELECTED: libtasn1 4.20.0-alt2:sisyphus+375829.100.1.1@1740299365
[aarch64] MI2a: requesting to install libtasn1 (unspec'd ver; inspect with Debug::pkgMark-shallow)
[aarch64] MI2a: marked for install (shallow): libtasn1
[aarch64] MI2a: satisfying Depends: libp11-kit = 1:0.25.5-alt1:sisyphus+352553.100.1.1
[aarch64] MI2a: maybe install (a direct target): libp11-kit 1:0.25.5-alt1:sisyphus+352553.100.1.1@1720622713
[aarch64] MI2a: target SELECTED: libp11-kit 1:0.25.5-alt1:sisyphus+352553.100.1.1@1720622713
[aarch64] MI2a: requesting to install libp11-kit (unspec'd ver; inspect with Debug::pkgMark-shallow)
[aarch64] MI2a: marked for install (shallow): libp11-kit
[aarch64] MI2a: satisfying Depends: libcurl.so.4()(64bit) >= set:kgZtdjewuBSOM3YXjuKGePG56ZAe
[aarch64] MI2a: maybe install (a providing target): libcurl 8.12.1-alt1:sisyphus+374517.100.1.1@1739435822
[aarch64] MI2a: target SELECTED: libcurl 8.12.1-alt1:sisyphus+374517.100.1.1@1739435822
[aarch64] MI2a: requesting to install libcurl (unspec'd ver; inspect with Debug::pkgMark-shallow)
[aarch64] MI2a: marked for install (shallow): libcurl
[aarch64] MI2a: satisfying Depends: libbrotlidec.so.1()(64bit) >= set:heroOawuYbTK8
[aarch64] MI2a: maybe install (a providing target): libbrotlidec 1.1.0-alt1:sisyphus+328501.100.1.1@1693598439
[aarch64] MI2a: target SELECTED: libbrotlidec 1.1.0-alt1:sisyphus+328501.100.1.1@1693598439
[aarch64] MI2a: requesting to install libbrotlidec (unspec'd ver; inspect with Debug::pkgMark-shallow)
[aarch64] MI2a: marked for install (shallow): libbrotlidec
[aarch64] MI2a: satisfying Depends: libbrotlicommon = 1.1.0-alt1:sisyphus+328501.100.1.1
[aarch64] MI2a: maybe install (a direct target): libbrotlicommon 1.1.0-alt1:sisyphus+328501.100.1.1@1693598439
[aarch64] MI2a: target SELECTED: libbrotlicommon 1.1.0-alt1:sisyphus+328501.100.1.1@1693598439
[aarch64] MI2a: requesting to install libbrotlicommon (unspec'd ver; inspect with Debug::pkgMark-shallow)
[aarch64] MI2a: marked for install (shallow): libbrotlicommon
[aarch64] MI2a: satisfying Depends: libgnutls.so.30()(64bit) >= set:ohWzKsl3gEhunQQpmsYd9i7QCtiGyfZ1Iaw1tOFZbdeEKESximCRPnIehs3AEMQXZ0e8KN9yV59f8Zeu5QHTtKkulI9mjuLg9NIizyZhpZCsx8sGEZDBhhgZvpnajdZvocWora9BdPXEcA4Z2ghEYo7SHlnQVUueZmZ3mRKhNiuOM9tTy3ea4NtLvppyZ1rbmbbGWLShwembtEyVtUcNpLjugdka8b4
[aarch64] MI2a: maybe install (a providing target): libgnutls30 3.8.9-alt1:sisyphus+375558.200.1.1@1740145691
[aarch64] MI2a: target SELECTED: libgnutls30 3.8.9-alt1:sisyphus+375558.200.1.1@1740145691
[aarch64] MI2a: requesting to install libgnutls30 (unspec'd ver; inspect with Debug::pkgMark-shallow)
[aarch64] MI2a: marked for install (shallow): libgnutls30
[aarch64] MI2a: satisfying Depends: libhogweed.so.6()(64bit) >= set:mfnnj2ZgBdeg17M87tPneezLu1hRaAv7Mvee2P332bHTaZjeCozdeChKl8zpQyflmS6Vy6tRmgHXyW1dkybK4gSLUc4ZqST6Otwai2tAwz0231mJ0KXX1SRmE5Wv1xA3elkz1fS4ARIDtHglVAVYGsrdTpOlAk7oFZ51ji2BIsI0W6X7ePZg
[aarch64] MI2a: maybe install (a providing target): libhogweed6 3.10.1-alt1:sisyphus+372008.100.1.1@1738078288
[aarch64] MI2a: target SELECTED: libhogweed6 3.10.1-alt1:sisyphus+372008.100.1.1@1738078288
[aarch64] MI2a: requesting to install libhogweed6 (unspec'd ver; inspect with Debug::pkgMark-shallow)
[aarch64] MI2a: marked for install (shallow): libhogweed6
[aarch64] MI2a: satisfying Depends: libnettle8 = 3.10.1-alt1:sisyphus+372008.100.1.1
[aarch64] MI2a: maybe install (a direct target): libnettle8 3.10.1-alt1:sisyphus+372008.100.1.1@1738078288
[aarch64] MI2a: target SELECTED: libnettle8 3.10.1-alt1:sisyphus+372008.100.1.1@1738078288
[aarch64] MI2a: requesting to install libnettle8 (unspec'd ver; inspect with Debug::pkgMark-shallow)
[aarch64] MI2a: marked for install (shallow): libnettle8
[aarch64] MI2a: satisfying Depends: libidn2.so.0()(64bit) >= set:ifaFMURofX11
[aarch64] MI2a: maybe install (a providing target): libidn2 2.3.7-alt1:sisyphus+339505.100.1.2@1706719034
[aarch64] MI2a: target SELECTED: libidn2 2.3.7-alt1:sisyphus+339505.100.1.2@1706719034
[aarch64] MI2a: requesting to install libidn2 (unspec'd ver; inspect with Debug::pkgMark-shallow)
[aarch64] MI2a: marked for install (shallow): libidn2
[aarch64] MI2a: satisfying Depends: libgsasl.so.18()(64bit) >= set:jfNMMjxjlLiKUyEAZvcPMCX3
[aarch64] MI2a: maybe install (a providing target): libgsasl18 2.2.1-alt2:sisyphus+359713.200.2.1@1728905495
[aarch64] MI2a: target SELECTED: libgsasl18 2.2.1-alt2:sisyphus+359713.200.2.1@1728905495
[aarch64] MI2a: requesting to install libgsasl18 (unspec'd ver; inspect with Debug::pkgMark-shallow)
[aarch64] MI2a: marked for install (shallow): libgsasl18
[aarch64] MI2a: satisfying Depends: libgssapi_krb5.so.2()(64bit) >= set:lgUI5pnpbNsJUr9F0ECN6LIbSVz7j3UNHAXVG0YYmbjijMyN
[aarch64] MI2a: maybe install (a providing target): libkrb5 1.21.3-alt2:sisyphus+351857.100.1.1@1719735346
[aarch64] MI2a: target SELECTED: libkrb5 1.21.3-alt2:sisyphus+351857.100.1.1@1719735346
[aarch64] MI2a: requesting to install libkrb5 (unspec'd ver; inspect with Debug::pkgMark-shallow)
[aarch64] MI2a: marked for install (shallow): libkrb5
[aarch64] MI2a: satisfying Depends: libcom_err.so.2()(64bit) >= set:ifPl8xIvqFmQe8JQo3
[aarch64] MI2a: maybe install (a providing target): libcom_err 1.47.1.0.10.ad56-alt2:sisyphus+363497.200.3.1@1732729972
[aarch64] MI2a: target SELECTED: libcom_err 1.47.1.0.10.ad56-alt2:sisyphus+363497.200.3.1@1732729972
[aarch64] MI2a: requesting to install libcom_err (unspec'd ver; inspect with Debug::pkgMark-shallow)
[aarch64] MI2a: marked for install (shallow): libcom_err
[aarch64] MI2a: satisfying Depends: libkeyutils.so.1()(64bit) >= set:jfWn12U6KThBXgruPLZ68yYZt2
[aarch64] MI2a: maybe install (a providing target): libkeyutils 1.6.3-alt1:sisyphus+346336.200.2.2@1716472668
[aarch64] MI2a: target SELECTED: libkeyutils 1.6.3-alt1:sisyphus+346336.200.2.2@1716472668
[aarch64] MI2a: requesting to install libkeyutils (unspec'd ver; inspect with Debug::pkgMark-shallow)
[aarch64] MI2a: marked for install (shallow): libkeyutils
[aarch64] MI2a: satisfying Depends: liblmdb.so.0()(64bit) >= set:kfalKd4xYAkaAG2MqeH0wB2F4kTaBEo1iv0KFpxVmqzFIV6HJ0
[aarch64] MI2a: maybe install (a providing target): liblmdb 0.9.33-alt1:sisyphus+360625.100.1.1@1729819647
[aarch64] MI2a: target SELECTED: liblmdb 0.9.33-alt1:sisyphus+360625.100.1.1@1729819647
[aarch64] MI2a: requesting to install liblmdb (unspec'd ver; inspect with Debug::pkgMark-shallow)
[aarch64] MI2a: marked for install (shallow): liblmdb
[aarch64] MI2a: satisfying Depends: libssl.so.3()(64bit) >= set:niiRRjOfYK5wgPZ2bvml1CcuMKm8fC0YcLKKRbpcI0BcryMK5hoYIwxo3
[aarch64] MI2a: maybe install (a providing target): libssl3 3.3.3-alt1:sisyphus+374381.40.2.1@1739300002
[aarch64] MI2a: target SELECTED: libssl3 3.3.3-alt1:sisyphus+374381.40.2.1@1739300002
[aarch64] MI2a: requesting to install libssl3 (unspec'd ver; inspect with Debug::pkgMark-shallow)
[aarch64] MI2a: marked for install (shallow): libssl3
[aarch64] MI2a: satisfying Depends: libverto.so.1()(64bit) >= set:jfI5MRvI6tmNn0zwQdb68Gk0
[aarch64] MI2a: maybe install (a providing target): libverto 0.3.2-alt1_1:sisyphus+321176.2200.10.2@1684805800
[aarch64] MI2a: target SELECTED: libverto 0.3.2-alt1_1:sisyphus+321176.2200.10.2@1684805800
[aarch64] MI2a: requesting to install libverto (unspec'd ver; inspect with Debug::pkgMark-shallow)
[aarch64] MI2a: marked for install (shallow): libverto
[aarch64] MI2a: satisfying Depends: libidn.so.12()(64bit) >= set:kiBXars6
[aarch64] MI2a: maybe install (a providing target): libidn 1.37-alt2:sisyphus+300849.100.1.1@1653769726
[aarch64] MI2a: target SELECTED: libidn 1.37-alt2:sisyphus+300849.100.1.1@1653769726
[aarch64] MI2a: requesting to install libidn (unspec'd ver; inspect with Debug::pkgMark-shallow)
[aarch64] MI2a: marked for install (shallow): libidn
[aarch64] MI2a: satisfying Depends: libntlm.so.0()(64bit) >= set:hfknJM1
[aarch64] MI2a: maybe install (a providing target): libntlm 1.5-alt1:sisyphus+278100.3300.1.1@1626059959
[aarch64] MI2a: target SELECTED: libntlm 1.5-alt1:sisyphus+278100.3300.1.1@1626059959
[aarch64] MI2a: requesting to install libntlm (unspec'd ver; inspect with Debug::pkgMark-shallow)
[aarch64] MI2a: marked for install (shallow): libntlm
[aarch64] MI2a: satisfying Depends: liblber.so.2()(64bit) >= set:liRJP9c9FzZ8q5FR
[aarch64] MI2a: maybe install (a providing target): libldap2 2.6.9-alt2:sisyphus+367501.300.4.1@1735841964
[aarch64] MI2a: target SELECTED: libldap2 2.6.9-alt2:sisyphus+367501.300.4.1@1735841964
[aarch64] MI2a: requesting to install libldap2 (unspec'd ver; inspect with Debug::pkgMark-shallow)
[aarch64] MI2a: marked for install (shallow): libldap2
[aarch64] MI2a: satisfying Depends: libsasl2.so.3()(64bit) >= set:lhKAh7QjCM36Vnr6MdFxFf8LIcZsS1kl0wH7Iyp
[aarch64] MI2a: maybe install (a providing target): libsasl2-3 2.1.28-alt2.1:sisyphus+367419.100.1.1@1735482603
[aarch64] MI2a: target SELECTED: libsasl2-3 2.1.28-alt2.1:sisyphus+367419.100.1.1@1735482603
[aarch64] MI2a: requesting to install libsasl2-3 (unspec'd ver; inspect with Debug::pkgMark-shallow)
[aarch64] MI2a: marked for install (shallow): libsasl2-3
[aarch64] MI2a: satisfying Depends: openldap-common = 2.6.9-alt2:sisyphus+367501.300.4.1
[aarch64] MI2a: maybe install (a direct target): openldap-common 2.6.9-alt2:sisyphus+367501.300.4.1@1735841751
[aarch64] MI2a: target SELECTED: openldap-common 2.6.9-alt2:sisyphus+367501.300.4.1@1735841751
[aarch64] MI2a: requesting to install openldap-common (unspec'd ver; inspect with Debug::pkgMark-shallow)
[aarch64] MI2a: marked for install (shallow): openldap-common
[aarch64] MI2a: satisfying Depends: libnghttp2.so.14()(64bit) >= set:lfKRgJ8UKsv8mdZbLF8UZpCjqzxjS4uXpINNNC9lNPxPEJZqw9IfpEB51C0QFeHEVpGv95xGtf4CksgxNiZbJO6CvE4RCQxaKbdf6IG29SZkOus
[aarch64] MI2a: maybe install (a providing target): libnghttp2 1.65.0-alt1:sisyphus+377060.100.1.1@1741259371
[aarch64] MI2a: target SELECTED: libnghttp2 1.65.0-alt1:sisyphus+377060.100.1.1@1741259371
[aarch64] MI2a: requesting to install libnghttp2 (unspec'd ver; inspect with Debug::pkgMark-shallow)
[aarch64] MI2a: marked for install (shallow): libnghttp2
[aarch64] MI2a: satisfying Depends: libnghttp3.so.9()(64bit) >= set:kfOHsymuRovZfZIawj4STEmrF1Xh8iHADhCWQYMeA3u6CuDIW7ipo3
[aarch64] MI2a: maybe install (a providing target): libnghttp3.9 1.8.0-alt1:sisyphus+375942.100.1.1@1740420799
[aarch64] MI2a: target SELECTED: libnghttp3.9 1.8.0-alt1:sisyphus+375942.100.1.1@1740420799
[aarch64] MI2a: requesting to install libnghttp3.9 (unspec'd ver; inspect with Debug::pkgMark-shallow)
[aarch64] MI2a: marked for install (shallow): libnghttp3.9
[aarch64] MI2a: satisfying Depends: libngtcp2.so.16()(64bit) >= set:keggzSiMInQoBwKw3hOFjw6C4r5lyewzRrbvfiZqFvO6xZ2fVcSxD0qyPdhyUVRzsodbhSgNzKYVngELjUy4
[aarch64] MI2a: maybe install (a providing target): libngtcp2.16 1.11.0-alt2:sisyphus+376238.100.1.1@1740635119
[aarch64] MI2a: target SELECTED: libngtcp2.16 1.11.0-alt2:sisyphus+376238.100.1.1@1740635119
[aarch64] MI2a: requesting to install libngtcp2.16 (unspec'd ver; inspect with Debug::pkgMark-shallow)
[aarch64] MI2a: marked for install (shallow): libngtcp2.16
[aarch64] MI2a: satisfying Depends: libngtcp2_crypto_gnutls8 = 1.11.0-alt2:sisyphus+376238.100.1.1
[aarch64] MI2a: maybe install (a direct target): libngtcp2_crypto_gnutls8 1.11.0-alt2:sisyphus+376238.100.1.1@1740635119
[aarch64] MI2a: target SELECTED: libngtcp2_crypto_gnutls8 1.11.0-alt2:sisyphus+376238.100.1.1@1740635119
[aarch64] MI2a: requesting to install libngtcp2_crypto_gnutls8 (unspec'd ver; inspect with Debug::pkgMark-shallow)
[aarch64] MI2a: marked for install (shallow): libngtcp2_crypto_gnutls8
[aarch64] MI2a: satisfying Depends: libpsl.so.5()(64bit) >= set:ifo8sG4NYozTZj0
[aarch64] MI2a: maybe install (a providing target): libpsl 0.21.5-alt1:sisyphus+338474.100.1.1@1705684797
[aarch64] MI2a: target SELECTED: libpsl 0.21.5-alt1:sisyphus+338474.100.1.1@1705684797
[aarch64] MI2a: requesting to install libpsl (unspec'd ver; inspect with Debug::pkgMark-shallow)
[aarch64] MI2a: marked for install (shallow): libpsl
[aarch64] MI2a: satisfying Depends: publicsuffix-list-dafsa (NULL)
[aarch64] MI2a: maybe install (a direct target): publicsuffix-list-dafsa 20250131-alt1:sisyphus+373297.100.1.1@1738767834
[aarch64] MI2a: target SELECTED: publicsuffix-list-dafsa 20250131-alt1:sisyphus+373297.100.1.1@1738767834
[aarch64] MI2a: requesting to install publicsuffix-list-dafsa (unspec'd ver; inspect with Debug::pkgMark-shallow)
[aarch64] MI2a: marked for install (shallow): publicsuffix-list-dafsa
[aarch64] MI2a: satisfying Depends: libssh2.so.1()(64bit) >= set:lfFi2ZJdCZnNQqC7FxZHyYYVCMxI4j1759y3AVs98cSjdm6BZrMSTPA4BKYeWR49vSI0JGO8E3yldZ5j77X8z3joPyGVoiqovNAwPc5RvPDTKNRR6pS6H80qi1nxAdsxOdZERlIwndLqIyuVb
[aarch64] MI2a: maybe install (a providing target): libssh2 1.11.0-alt2:sisyphus+339356.100.1.1@1706593172
[aarch64] MI2a: target SELECTED: libssh2 1.11.0-alt2:sisyphus+339356.100.1.1@1706593172
[aarch64] MI2a: requesting to install libssh2 (unspec'd ver; inspect with Debug::pkgMark-shallow)
[aarch64] MI2a: marked for install (shallow): libssh2
[aarch64] MI2a: satisfying Depends: libexpat.so.1()(64bit) >= set:kgE3cnblKboj81fLUjE91hdZC3R0
[aarch64] MI2a: maybe install (a providing target): libexpat 2.7.0-alt1:sisyphus+379221.100.1.1@1742909225
[aarch64] MI2a: target SELECTED: libexpat 2.7.0-alt1:sisyphus+379221.100.1.1@1742909225
[aarch64] MI2a: requesting to install libexpat (unspec'd ver; inspect with Debug::pkgMark-shallow)
[aarch64] MI2a: marked for install (shallow): libexpat
[aarch64] MI2a: satisfying Depends: libjsoncpp.so.24()(64bit) >= set:mfWdNr9hSTEj33pgekkWiZ5gxiSrhe4i6fCrcyUrA0F5fpZ04ebvZEaLNDQoZ1XGHPAxHVDJ5aZ8J4EOS5Ph9IjMNpQdqYunbBZ41SG8ORLJvBHW7puYYi760ZFTIxHsoUGjwulnr1aj60ioshZ86OzriUK928mFrs77eRe9dru2y166FawAr1edD77euJ7rtNk5haAjh7jgSNVf
[aarch64] MI2a: maybe install (a providing target): libjsoncpp24 1.9.4-alt2:sisyphus+346331.200.2.1@1716448565
[aarch64] MI2a: target SELECTED: libjsoncpp24 1.9.4-alt2:sisyphus+346331.200.2.1@1716448565
[aarch64] MI2a: requesting to install libjsoncpp24 (unspec'd ver; inspect with Debug::pkgMark-shallow)
[aarch64] MI2a: marked for install (shallow): libjsoncpp24
[aarch64] MI2a: satisfying Depends: librhash.so.0()(64bit) >= set:ifDyZ6eqLIBMAAMoeF3
[aarch64] MI2a: maybe install (a providing target): librhash 1.3.5-alt3:sisyphus+286141.40.2.1@1632982460
[aarch64] MI2a: target SELECTED: librhash 1.3.5-alt3:sisyphus+286141.40.2.1@1632982460
[aarch64] MI2a: requesting to install librhash (unspec'd ver; inspect with Debug::pkgMark-shallow)
[aarch64] MI2a: marked for install (shallow): librhash
[aarch64] MI2a: satisfying Depends: libuv.so.1()(64bit) >= set:mhRqUeic58tAOj8qzoZvhgcZFirSpyDd3iNFI57V8pPeIZrSvAPv9Z9Udh8e5kJuikPvq0
[aarch64] MI2a: maybe install (a providing target): libuv 1.50.0-alt1:sisyphus+377760.100.1.1@1741795938
[aarch64] MI2a: target SELECTED: libuv 1.50.0-alt1:sisyphus+377760.100.1.1@1741795938
[aarch64] MI2a: requesting to install libuv (unspec'd ver; inspect with Debug::pkgMark-shallow)
[aarch64] MI2a: marked for install (shallow): libuv
[aarch64] MI2a: satisfying Depends: cmake-modules = 3.31.6-alt1:sisyphus+377691.100.1.1
[aarch64] MI2a: maybe install (a direct target): cmake-modules 3.31.6-alt1:sisyphus+377691.100.1.1@1741730513
[aarch64] MI2a: target SELECTED: cmake-modules 3.31.6-alt1:sisyphus+377691.100.1.1@1741730513
[aarch64] MI2a: requesting to install cmake-modules (unspec'd ver; inspect with Debug::pkgMark-shallow)
[aarch64] MI2a: marked for install (shallow): cmake-modules
[aarch64] MI2a: marked for install (shallow): boost-devel-headers
[aarch64] MI2a: satisfying Depends: boost-devel = 1:1.86.0-alt2:sisyphus+375553.1040.4.1
[aarch64] MI2a: maybe install (a direct target): boost-devel 1:1.86.0-alt2:sisyphus+375553.1040.4.1@1740172932
[aarch64] MI2a: target SELECTED: boost-devel 1:1.86.0-alt2:sisyphus+375553.1040.4.1@1740172932
[aarch64] MI2a: requesting to install boost-devel (unspec'd ver; inspect with Debug::pkgMark-shallow)
[aarch64] MI2a: marked for install (shallow): boost-devel
[aarch64] MI2a: satisfying Depends: libboost_atomic1.86.0 = 1:1.86.0-alt2:sisyphus+375553.1040.4.1
[aarch64] MI2a: maybe install (a direct target): libboost_atomic1.86.0 1:1.86.0-alt2:sisyphus+375553.1040.4.1@1740172932
[aarch64] MI2a: target SELECTED: libboost_atomic1.86.0 1:1.86.0-alt2:sisyphus+375553.1040.4.1@1740172932
[aarch64] MI2a: requesting to install libboost_atomic1.86.0 (unspec'd ver; inspect with Debug::pkgMark-shallow)
[aarch64] MI2a: marked for install (shallow): libboost_atomic1.86.0
[aarch64] MI2a: satisfying Depends: libboost_system1.86.0 = 1:1.86.0-alt2:sisyphus+375553.1040.4.1
[aarch64] MI2a: maybe install (a direct target): libboost_system1.86.0 1:1.86.0-alt2:sisyphus+375553.1040.4.1@1740172932
[aarch64] MI2a: target SELECTED: libboost_system1.86.0 1:1.86.0-alt2:sisyphus+375553.1040.4.1@1740172932
[aarch64] MI2a: requesting to install libboost_system1.86.0 (unspec'd ver; inspect with Debug::pkgMark-shallow)
[aarch64] MI2a: marked for install (shallow): libboost_system1.86.0
[aarch64] MI2a: satisfying Depends: libboost_charconv1.86.0 = 1:1.86.0-alt2:sisyphus+375553.1040.4.1
[aarch64] MI2a: maybe install (a direct target): libboost_charconv1.86.0 1:1.86.0-alt2:sisyphus+375553.1040.4.1@1740172932
[aarch64] MI2a: target SELECTED: libboost_charconv1.86.0 1:1.86.0-alt2:sisyphus+375553.1040.4.1@1740172932
[aarch64] MI2a: requesting to install libboost_charconv1.86.0 (unspec'd ver; inspect with Debug::pkgMark-shallow)
[aarch64] MI2a: marked for install (shallow): libboost_charconv1.86.0
[aarch64] MI2a: satisfying Depends: libboost_container1.86.0 = 1:1.86.0-alt2:sisyphus+375553.1040.4.1
[aarch64] MI2a: maybe install (a direct target): libboost_container1.86.0 1:1.86.0-alt2:sisyphus+375553.1040.4.1@1740172932
[aarch64] MI2a: target SELECTED: libboost_container1.86.0 1:1.86.0-alt2:sisyphus+375553.1040.4.1@1740172932
[aarch64] MI2a: requesting to install libboost_container1.86.0 (unspec'd ver; inspect with Debug::pkgMark-shallow)
[aarch64] MI2a: marked for install (shallow): libboost_container1.86.0
[aarch64] MI2a: satisfying Depends: libboost_contract1.86.0 = 1:1.86.0-alt2:sisyphus+375553.1040.4.1
[aarch64] MI2a: maybe install (a direct target): libboost_contract1.86.0 1:1.86.0-alt2:sisyphus+375553.1040.4.1@1740172932
[aarch64] MI2a: target SELECTED: libboost_contract1.86.0 1:1.86.0-alt2:sisyphus+375553.1040.4.1@1740172932
[aarch64] MI2a: requesting to install libboost_contract1.86.0 (unspec'd ver; inspect with Debug::pkgMark-shallow)
[aarch64] MI2a: marked for install (shallow): libboost_contract1.86.0
[aarch64] MI2a: satisfying Depends: libboost_date_time1.86.0 = 1:1.86.0-alt2:sisyphus+375553.1040.4.1
[aarch64] MI2a: maybe install (a direct target): libboost_date_time1.86.0 1:1.86.0-alt2:sisyphus+375553.1040.4.1@1740172932
[aarch64] MI2a: target SELECTED: libboost_date_time1.86.0 1:1.86.0-alt2:sisyphus+375553.1040.4.1@1740172932
[aarch64] MI2a: requesting to install libboost_date_time1.86.0 (unspec'd ver; inspect with Debug::pkgMark-shallow)
[aarch64] MI2a: marked for install (shallow): libboost_date_time1.86.0
[aarch64] MI2a: satisfying Depends: libboost_graph1.86.0 = 1:1.86.0-alt2:sisyphus+375553.1040.4.1
[aarch64] MI2a: maybe install (a direct target): libboost_graph1.86.0 1:1.86.0-alt2:sisyphus+375553.1040.4.1@1740172932
[aarch64] MI2a: target SELECTED: libboost_graph1.86.0 1:1.86.0-alt2:sisyphus+375553.1040.4.1@1740172932
[aarch64] MI2a: requesting to install libboost_graph1.86.0 (unspec'd ver; inspect with Debug::pkgMark-shallow)
[aarch64] MI2a: marked for install (shallow): libboost_graph1.86.0
[aarch64] MI2a: satisfying Depends: libboost_regex1.86.0 = 1:1.86.0-alt2:sisyphus+375553.1040.4.1
[aarch64] MI2a: maybe install (a direct target): libboost_regex1.86.0 1:1.86.0-alt2:sisyphus+375553.1040.4.1@1740172932
[aarch64] MI2a: target SELECTED: libboost_regex1.86.0 1:1.86.0-alt2:sisyphus+375553.1040.4.1@1740172932
[aarch64] MI2a: requesting to install libboost_regex1.86.0 (unspec'd ver; inspect with Debug::pkgMark-shallow)
[aarch64] MI2a: marked for install (shallow): libboost_regex1.86.0
[aarch64] MI2a: satisfying Depends: libboost_json1.86.0 = 1:1.86.0-alt2:sisyphus+375553.1040.4.1
[aarch64] MI2a: maybe install (a direct target): libboost_json1.86.0 1:1.86.0-alt2:sisyphus+375553.1040.4.1@1740172932
[aarch64] MI2a: target SELECTED: libboost_json1.86.0 1:1.86.0-alt2:sisyphus+375553.1040.4.1@1740172932
[aarch64] MI2a: requesting to install libboost_json1.86.0 (unspec'd ver; inspect with Debug::pkgMark-shallow)
[aarch64] MI2a: marked for install (shallow): libboost_json1.86.0
[aarch64] MI2a: satisfying Depends: libboost_iostreams1.86.0 = 1:1.86.0-alt2:sisyphus+375553.1040.4.1
[aarch64] MI2a: maybe install (a direct target): libboost_iostreams1.86.0 1:1.86.0-alt2:sisyphus+375553.1040.4.1@1740172932
[aarch64] MI2a: target SELECTED: libboost_iostreams1.86.0 1:1.86.0-alt2:sisyphus+375553.1040.4.1@1740172932
[aarch64] MI2a: requesting to install libboost_iostreams1.86.0 (unspec'd ver; inspect with Debug::pkgMark-shallow)
[aarch64] MI2a: marked for install (shallow): libboost_iostreams1.86.0
[aarch64] MI2a: satisfying Depends: libboost_process1.86.0 = 1:1.86.0-alt2:sisyphus+375553.1040.4.1
[aarch64] MI2a: maybe install (a direct target): libboost_process1.86.0 1:1.86.0-alt2:sisyphus+375553.1040.4.1@1740172932
[aarch64] MI2a: target SELECTED: libboost_process1.86.0 1:1.86.0-alt2:sisyphus+375553.1040.4.1@1740172932
[aarch64] MI2a: requesting to install libboost_process1.86.0 (unspec'd ver; inspect with Debug::pkgMark-shallow)
[aarch64] MI2a: marked for install (shallow): libboost_process1.86.0
[aarch64] MI2a: satisfying Depends: libboost_filesystem1.86.0 = 1:1.86.0-alt2:sisyphus+375553.1040.4.1
[aarch64] MI2a: maybe install (a direct target): libboost_filesystem1.86.0 1:1.86.0-alt2:sisyphus+375553.1040.4.1@1740172932
[aarch64] MI2a: target SELECTED: libboost_filesystem1.86.0 1:1.86.0-alt2:sisyphus+375553.1040.4.1@1740172932
[aarch64] MI2a: requesting to install libboost_filesystem1.86.0 (unspec'd ver; inspect with Debug::pkgMark-shallow)
[aarch64] MI2a: marked for install (shallow): libboost_filesystem1.86.0
[aarch64] MI2a: satisfying Depends: libboost_random1.86.0 = 1:1.86.0-alt2:sisyphus+375553.1040.4.1
[aarch64] MI2a: maybe install (a direct target): libboost_random1.86.0 1:1.86.0-alt2:sisyphus+375553.1040.4.1@1740172932
[aarch64] MI2a: target SELECTED: libboost_random1.86.0 1:1.86.0-alt2:sisyphus+375553.1040.4.1@1740172932
[aarch64] MI2a: requesting to install libboost_random1.86.0 (unspec'd ver; inspect with Debug::pkgMark-shallow)
[aarch64] MI2a: marked for install (shallow): libboost_random1.86.0
[aarch64] MI2a: satisfying Depends: libboost_serialization1.86.0 = 1:1.86.0-alt2:sisyphus+375553.1040.4.1
[aarch64] MI2a: maybe install (a direct target): libboost_serialization1.86.0 1:1.86.0-alt2:sisyphus+375553.1040.4.1@1740172932
[aarch64] MI2a: target SELECTED: libboost_serialization1.86.0 1:1.86.0-alt2:sisyphus+375553.1040.4.1@1740172932
[aarch64] MI2a: requesting to install libboost_serialization1.86.0 (unspec'd ver; inspect with Debug::pkgMark-shallow)
[aarch64] MI2a: marked for install (shallow): libboost_serialization1.86.0
[aarch64] MI2a: satisfying Depends: libboost_test1.86.0 = 1:1.86.0-alt2:sisyphus+375553.1040.4.1
[aarch64] MI2a: maybe install (a direct target): libboost_test1.86.0 1:1.86.0-alt2:sisyphus+375553.1040.4.1@1740172932
[aarch64] MI2a: target SELECTED: libboost_test1.86.0 1:1.86.0-alt2:sisyphus+375553.1040.4.1@1740172932
[aarch64] MI2a: requesting to install libboost_test1.86.0 (unspec'd ver; inspect with Debug::pkgMark-shallow)
[aarch64] MI2a: marked for install (shallow): libboost_test1.86.0
[aarch64] MI2a: satisfying Depends: libboost_timer1.86.0 = 1:1.86.0-alt2:sisyphus+375553.1040.4.1
[aarch64] MI2a: maybe install (a direct target): libboost_timer1.86.0 1:1.86.0-alt2:sisyphus+375553.1040.4.1@1740172932
[aarch64] MI2a: target SELECTED: libboost_timer1.86.0 1:1.86.0-alt2:sisyphus+375553.1040.4.1@1740172932
[aarch64] MI2a: requesting to install libboost_timer1.86.0 (unspec'd ver; inspect with Debug::pkgMark-shallow)
[aarch64] MI2a: marked for install (shallow): libboost_timer1.86.0
[aarch64] MI2a: satisfying Depends: libboost_chrono1.86.0 = 1:1.86.0-alt2:sisyphus+375553.1040.4.1
[aarch64] MI2a: maybe install (a direct target): libboost_chrono1.86.0 1:1.86.0-alt2:sisyphus+375553.1040.4.1@1740172932
[aarch64] MI2a: target SELECTED: libboost_chrono1.86.0 1:1.86.0-alt2:sisyphus+375553.1040.4.1@1740172932
[aarch64] MI2a: requesting to install libboost_chrono1.86.0 (unspec'd ver; inspect with Debug::pkgMark-shallow)
[aarch64] MI2a: marked for install (shallow): libboost_chrono1.86.0
[aarch64] MI2a: satisfying Depends: libboost_url1.86.0 = 1:1.86.0-alt2:sisyphus+375553.1040.4.1
[aarch64] MI2a: maybe install (a direct target): libboost_url1.86.0 1:1.86.0-alt2:sisyphus+375553.1040.4.1@1740172932
[aarch64] MI2a: target SELECTED: libboost_url1.86.0 1:1.86.0-alt2:sisyphus+375553.1040.4.1@1740172932
[aarch64] MI2a: requesting to install libboost_url1.86.0 (unspec'd ver; inspect with Debug::pkgMark-shallow)
[aarch64] MI2a: marked for install (shallow): libboost_url1.86.0
[aarch64] MI2a: satisfying Depends: libboost_nowide1.86.0 = 1:1.86.0-alt2:sisyphus+375553.1040.4.1
[aarch64] MI2a: maybe install (a direct target): libboost_nowide1.86.0 1:1.86.0-alt2:sisyphus+375553.1040.4.1@1740172932
[aarch64] MI2a: target SELECTED: libboost_nowide1.86.0 1:1.86.0-alt2:sisyphus+375553.1040.4.1@1740172932
[aarch64] MI2a: requesting to install libboost_nowide1.86.0 (unspec'd ver; inspect with Debug::pkgMark-shallow)
[aarch64] MI2a: marked for install (shallow): libboost_nowide1.86.0
[aarch64] MI2a: satisfying Depends: libboost_stacktrace1.86.0 = 1:1.86.0-alt2:sisyphus+375553.1040.4.1
[aarch64] MI2a: maybe install (a direct target): libboost_stacktrace1.86.0 1:1.86.0-alt2:sisyphus+375553.1040.4.1@1740172932
[aarch64] MI2a: target SELECTED: libboost_stacktrace1.86.0 1:1.86.0-alt2:sisyphus+375553.1040.4.1@1740172932
[aarch64] MI2a: requesting to install libboost_stacktrace1.86.0 (unspec'd ver; inspect with Debug::pkgMark-shallow)
[aarch64] MI2a: marked for install (shallow): libboost_stacktrace1.86.0
[aarch64] MI2a: satisfying Depends: libboost_fiber1.86.0 = 1:1.86.0-alt2:sisyphus+375553.1040.4.1
[aarch64] MI2a: maybe install (a direct target): libboost_fiber1.86.0 1:1.86.0-alt2:sisyphus+375553.1040.4.1@1740172932
[aarch64] MI2a: target SELECTED: libboost_fiber1.86.0 1:1.86.0-alt2:sisyphus+375553.1040.4.1@1740172932
[aarch64] MI2a: requesting to install libboost_fiber1.86.0 (unspec'd ver; inspect with Debug::pkgMark-shallow)
[aarch64] MI2a: marked for install (shallow): libboost_fiber1.86.0
[aarch64] MI2a: satisfying Depends: libboost_context1.86.0 = 1:1.86.0-alt2:sisyphus+375553.1040.4.1
[aarch64] MI2a: maybe install (a direct target): libboost_context1.86.0 1:1.86.0-alt2:sisyphus+375553.1040.4.1@1740172932
[aarch64] MI2a: target SELECTED: libboost_context1.86.0 1:1.86.0-alt2:sisyphus+375553.1040.4.1@1740172932
[aarch64] MI2a: requesting to install libboost_context1.86.0 (unspec'd ver; inspect with Debug::pkgMark-shallow)
[aarch64] MI2a: marked for install (shallow): libboost_context1.86.0
[aarch64] MI2a: satisfying Depends: libboost_type_erasure1.86.0 = 1:1.86.0-alt2:sisyphus+375553.1040.4.1
[aarch64] MI2a: maybe install (a direct target): libboost_type_erasure1.86.0 1:1.86.0-alt2:sisyphus+375553.1040.4.1@1740172932
[aarch64] MI2a: target SELECTED: libboost_type_erasure1.86.0 1:1.86.0-alt2:sisyphus+375553.1040.4.1@1740172932
[aarch64] MI2a: requesting to install libboost_type_erasure1.86.0 (unspec'd ver; inspect with Debug::pkgMark-shallow)
[aarch64] MI2a: marked for install (shallow): libboost_type_erasure1.86.0
[aarch64] MI2a: satisfying Depends: libboost_thread1.86.0 = 1:1.86.0-alt2:sisyphus+375553.1040.4.1
[aarch64] MI2a: maybe install (a direct target): libboost_thread1.86.0 1:1.86.0-alt2:sisyphus+375553.1040.4.1@1740172932
[aarch64] MI2a: target SELECTED: libboost_thread1.86.0 1:1.86.0-alt2:sisyphus+375553.1040.4.1@1740172932
[aarch64] MI2a: requesting to install libboost_thread1.86.0 (unspec'd ver; inspect with Debug::pkgMark-shallow)
[aarch64] MI2a: marked for install (shallow): libboost_thread1.86.0
[aarch64] Package libsdbus-cpp2-devel has no available version, but exists in the database.
[aarch64] This typically means that the package was mentioned in a dependency and
[aarch64] never uploaded, has been obsoleted or is not available with the contents
[aarch64] of sources.list
[aarch64] However the following packages replace it:
[aarch64] libsdbus-cpp-devel
[aarch64] E: Package libsdbus-cpp2-devel has no installation candidate
[aarch64] hsh-install: Failed to calculate package file list.
[aarch64] hsh-install: Failed to generate package file list.
2025-Mar-26 13:01:54 :: [aarch64] alterator-usbmount.git 0.1.3-alt1: remote: cannot build src.rpm
2025-Mar-26 13:01:54 :: [aarch64] #100 alterator-usbmount.git 0.1.3-alt1: build FAILED
2025-Mar-26 13:01:46 :: [i586] build FAILED
2025-Mar-26 13:01:47 :: [x86_64] build FAILED
2025-Mar-26 13:01:54 :: [aarch64] build FAILED
2025-Mar-26 13:01:54 :: task #379319 for sisyphus FAILED
^ permalink raw reply [flat|nested] 4+ messages in thread
* [#379319] TESTED (try 2) alterator-usbmount.git=0.1.3-alt1
2025-03-26 13:01 [#379319] [test-only] FAILED alterator-usbmount.git=0.1.3-alt1 Girar awaiter (proskur)
@ 2025-03-26 13:19 ` Girar awaiter (proskur)
2025-03-26 13:28 ` [#379319] EPERM (try 3) alterator-usbmount.git=0.1.3-alt1 Girar awaiter (proskur)
2025-03-26 14:26 ` [#379319] DONE (try 4) alterator-usbmount.git=0.1.3-alt1 Girar pender (proskur)
2 siblings, 0 replies; 4+ messages in thread
From: Girar awaiter (proskur) @ 2025-03-26 13:19 UTC (permalink / raw)
To: Oleg Proskurin; +Cc: sisyphus-incominger, girar-builder-sisyphus
https://git.altlinux.org/tasks/379319/logs/events.2.1.log
https://packages.altlinux.org/tasks/379319
subtask name aarch64 i586 x86_64
#200 alterator-usbmount 1:13 49 48
2025-Mar-26 13:13:18 :: test-only task #379319 for sisyphus resumed by proskur:
#100 removed
#200 build 0.1.3-alt1 from /people/proskur/packages/alterator-usbmount.git fetched at 2025-Mar-26 13:13:07
2025-Mar-26 13:13:19 :: [aarch64] #200 alterator-usbmount.git 0.1.3-alt1: build start
2025-Mar-26 13:13:19 :: [i586] #200 alterator-usbmount.git 0.1.3-alt1: build start
2025-Mar-26 13:13:19 :: [x86_64] #200 alterator-usbmount.git 0.1.3-alt1: build start
2025-Mar-26 13:14:07 :: [x86_64] #200 alterator-usbmount.git 0.1.3-alt1: build OK
2025-Mar-26 13:14:08 :: [i586] #200 alterator-usbmount.git 0.1.3-alt1: build OK
2025-Mar-26 13:14:32 :: [aarch64] #200 alterator-usbmount.git 0.1.3-alt1: build OK
2025-Mar-26 13:14:47 :: #200: alterator-usbmount.git 0.1.3-alt1: build check OK
2025-Mar-26 13:14:48 :: build check OK
2025-Mar-26 13:14:52 :: noarch check OK
2025-Mar-26 13:14:54 :: plan: src +1 -1 =20038, aarch64 +4 -4 =34768, i586 +4 -4 =33636, x86_64 +4 -4 =35573
#200 alterator-usbmount 0.1.2-alt1 -> 0.1.3-alt1
Wed Mar 26 2025 Oleg Proskurin <proskur@altlinux> 0.1.3-alt1
- Port to sdbus-c++ 2.1.0-alt1 aka libsdbus-cpp2
2025-Mar-26 13:15:47 :: patched apt indices
2025-Mar-26 13:15:58 :: created next repo
2025-Mar-26 13:16:10 :: duplicate provides check OK
2025-Mar-26 13:16:57 :: dependencies check OK
2025-Mar-26 13:17:33 :: [x86_64 i586 aarch64] ELF symbols check OK
i586: alterator-usbmount=0.1.3-alt1 post-install unowned files:
/usr/share/alterator/design/scripts
/usr/share/alterator/design/styles
/usr/share/alterator/ui/usbmount
2025-Mar-26 13:17:49 :: [i586] #200 alterator-usbmount: install check OK
x86_64: alterator-usbmount=0.1.3-alt1 post-install unowned files:
/usr/share/alterator/design/scripts
/usr/share/alterator/design/styles
/usr/share/alterator/ui/usbmount
2025-Mar-26 13:17:49 :: [x86_64] #200 alterator-usbmount: install check OK
2025-Mar-26 13:17:56 :: [i586] #200 alterator-usbmount-daemon: install check OK
2025-Mar-26 13:17:57 :: [x86_64] #200 alterator-usbmount-daemon: install check OK
aarch64: alterator-usbmount=0.1.3-alt1 post-install unowned files:
/usr/share/alterator/design/scripts
/usr/share/alterator/design/styles
/usr/share/alterator/ui/usbmount
2025-Mar-26 13:17:59 :: [aarch64] #200 alterator-usbmount: install check OK
2025-Mar-26 13:18:05 :: [i586] #200 alterator-usbmount-daemon-debuginfo: install check OK
2025-Mar-26 13:18:06 :: [x86_64] #200 alterator-usbmount-daemon-debuginfo: install check OK
2025-Mar-26 13:18:11 :: [aarch64] #200 alterator-usbmount-daemon: install check OK
2025-Mar-26 13:18:16 :: [i586] #200 alterator-usbmount-debuginfo: install check OK
2025-Mar-26 13:18:17 :: [x86_64] #200 alterator-usbmount-debuginfo: install check OK
2025-Mar-26 13:18:26 :: [aarch64] #200 alterator-usbmount-daemon-debuginfo: install check OK
2025-Mar-26 13:18:43 :: [aarch64] #200 alterator-usbmount-debuginfo: install check OK
2025-Mar-26 13:19:04 :: [x86_64-i586] generated apt indices
2025-Mar-26 13:19:04 :: [x86_64-i586] created next repo
2025-Mar-26 13:19:18 :: [x86_64-i586] dependencies check OK
2025-Mar-26 13:19:18 :: gears inheritance check OK
2025-Mar-26 13:19:19 :: srpm inheritance check OK
girar-check-perms: access to alterator-usbmount DENIED for proskur: does not belong to maintainers list yet
check-subtask-perms: #200: alterator-usbmount: Operation not permitted
2025-Mar-26 13:19:19 :: acl check IGNORED
2025-Mar-26 13:19:35 :: created contents_index files
2025-Mar-26 13:19:44 :: created hash files: aarch64 i586 src x86_64
2025-Mar-26 13:19:47 :: task #379319 for sisyphus TESTED
^ permalink raw reply [flat|nested] 4+ messages in thread
* [#379319] EPERM (try 3) alterator-usbmount.git=0.1.3-alt1
2025-03-26 13:01 [#379319] [test-only] FAILED alterator-usbmount.git=0.1.3-alt1 Girar awaiter (proskur)
2025-03-26 13:19 ` [#379319] TESTED (try 2) alterator-usbmount.git=0.1.3-alt1 Girar awaiter (proskur)
@ 2025-03-26 13:28 ` Girar awaiter (proskur)
2025-03-26 14:26 ` [#379319] DONE (try 4) alterator-usbmount.git=0.1.3-alt1 Girar pender (proskur)
2 siblings, 0 replies; 4+ messages in thread
From: Girar awaiter (proskur) @ 2025-03-26 13:28 UTC (permalink / raw)
To: Oleg Proskurin; +Cc: sisyphus-incominger, girar-builder-sisyphus
https://git.altlinux.org/tasks/379319/logs/events.3.1.log
https://packages.altlinux.org/tasks/379319
2025-Mar-26 13:23:13 :: task #379319 for sisyphus resumed by proskur:
2025-Mar-26 13:23:13 :: message: new_version
#100 removed
#200 build 0.1.3-alt1 from /people/proskur/packages/alterator-usbmount.git fetched at 2025-Mar-26 13:13:07
2025-Mar-26 13:23:15 :: [i586] #200 alterator-usbmount.git 0.1.3-alt1: build start
2025-Mar-26 13:23:15 :: [x86_64] #200 alterator-usbmount.git 0.1.3-alt1: build start
2025-Mar-26 13:23:15 :: [aarch64] #200 alterator-usbmount.git 0.1.3-alt1: build start
2025-Mar-26 13:23:25 :: [i586] #200 alterator-usbmount.git 0.1.3-alt1: build OK (cached)
2025-Mar-26 13:23:26 :: [x86_64] #200 alterator-usbmount.git 0.1.3-alt1: build OK (cached)
2025-Mar-26 13:23:41 :: [aarch64] #200 alterator-usbmount.git 0.1.3-alt1: build OK (cached)
2025-Mar-26 13:23:56 :: #200: alterator-usbmount.git 0.1.3-alt1: build check OK
2025-Mar-26 13:23:57 :: build check OK
2025-Mar-26 13:24:02 :: noarch check OK
2025-Mar-26 13:24:03 :: plan: src +1 -1 =20038, aarch64 +4 -4 =34768, i586 +4 -4 =33636, x86_64 +4 -4 =35573
#200 alterator-usbmount 0.1.2-alt1 -> 0.1.3-alt1
Wed Mar 26 2025 Oleg Proskurin <proskur@altlinux> 0.1.3-alt1
- Port to sdbus-c++ 2.1.0-alt1 aka libsdbus-cpp2
2025-Mar-26 13:24:52 :: patched apt indices
2025-Mar-26 13:25:04 :: created next repo
2025-Mar-26 13:25:17 :: duplicate provides check OK
2025-Mar-26 13:26:01 :: dependencies check OK
2025-Mar-26 13:26:01 :: [i586] no need to repeat ELF symbols check
2025-Mar-26 13:26:40 :: [x86_64 i586 aarch64] ELF symbols check OK
i586: alterator-usbmount=0.1.3-alt1 post-install unowned files:
/usr/share/alterator/design/scripts
/usr/share/alterator/design/styles
/usr/share/alterator/ui/usbmount
2025-Mar-26 13:26:51 :: [i586] #200 alterator-usbmount: install check OK (cached)
x86_64: alterator-usbmount=0.1.3-alt1 post-install unowned files:
/usr/share/alterator/design/scripts
/usr/share/alterator/design/styles
/usr/share/alterator/ui/usbmount
2025-Mar-26 13:26:52 :: [x86_64] #200 alterator-usbmount: install check OK (cached)
2025-Mar-26 13:26:55 :: [i586] #200 alterator-usbmount-daemon: install check OK (cached)
2025-Mar-26 13:26:56 :: [x86_64] #200 alterator-usbmount-daemon: install check OK (cached)
2025-Mar-26 13:26:59 :: [i586] #200 alterator-usbmount-daemon-debuginfo: install check OK (cached)
2025-Mar-26 13:27:01 :: [x86_64] #200 alterator-usbmount-daemon-debuginfo: install check OK (cached)
2025-Mar-26 13:27:04 :: [i586] #200 alterator-usbmount-debuginfo: install check OK (cached)
2025-Mar-26 13:27:05 :: [x86_64] #200 alterator-usbmount-debuginfo: install check OK (cached)
aarch64: alterator-usbmount=0.1.3-alt1 post-install unowned files:
/usr/share/alterator/design/scripts
/usr/share/alterator/design/styles
/usr/share/alterator/ui/usbmount
2025-Mar-26 13:27:08 :: [aarch64] #200 alterator-usbmount: install check OK (cached)
2025-Mar-26 13:27:19 :: [aarch64] #200 alterator-usbmount-daemon: install check OK (cached)
2025-Mar-26 13:27:28 :: [aarch64] #200 alterator-usbmount-daemon-debuginfo: install check OK (cached)
2025-Mar-26 13:27:36 :: [aarch64] #200 alterator-usbmount-debuginfo: install check OK (cached)
2025-Mar-26 13:27:55 :: [x86_64-i586] generated apt indices
2025-Mar-26 13:27:55 :: [x86_64-i586] created next repo
2025-Mar-26 13:28:07 :: [x86_64-i586] dependencies check OK
2025-Mar-26 13:28:08 :: gears inheritance check OK
2025-Mar-26 13:28:08 :: srpm inheritance check OK
girar-check-perms: access to alterator-usbmount DENIED for proskur: does not belong to maintainers list yet
check-subtask-perms: #200: alterator-usbmount: Operation not permitted
2025-Mar-26 13:28:09 :: acl check FAILED
2025-Mar-26 13:28:23 :: created contents_index files
2025-Mar-26 13:28:32 :: created hash files: aarch64 i586 src x86_64
2025-Mar-26 13:28:35 :: task #379319 for sisyphus EPERM
^ permalink raw reply [flat|nested] 4+ messages in thread
* [#379319] DONE (try 4) alterator-usbmount.git=0.1.3-alt1
2025-03-26 13:01 [#379319] [test-only] FAILED alterator-usbmount.git=0.1.3-alt1 Girar awaiter (proskur)
2025-03-26 13:19 ` [#379319] TESTED (try 2) alterator-usbmount.git=0.1.3-alt1 Girar awaiter (proskur)
2025-03-26 13:28 ` [#379319] EPERM (try 3) alterator-usbmount.git=0.1.3-alt1 Girar awaiter (proskur)
@ 2025-03-26 14:26 ` Girar pender (proskur)
2 siblings, 0 replies; 4+ messages in thread
From: Girar pender (proskur) @ 2025-03-26 14:26 UTC (permalink / raw)
To: Oleg Proskurin; +Cc: sisyphus-incominger, girar-builder-sisyphus
https://git.altlinux.org/tasks/archive/done/_370/379319/logs/events.4.2.log
https://packages.altlinux.org/tasks/379319
2025-Mar-26 14:21:37 :: task #379319 for sisyphus resumed by proskur:
2025-Mar-26 14:21:37 :: message: new_version
#100 removed
#200 build 0.1.3-alt1 from /people/proskur/packages/alterator-usbmount.git fetched at 2025-Mar-26 13:13:07
2025-Mar-26 14:21:39 :: [aarch64] #200 alterator-usbmount.git 0.1.3-alt1: build start
2025-Mar-26 14:21:39 :: [i586] #200 alterator-usbmount.git 0.1.3-alt1: build start
2025-Mar-26 14:21:39 :: [x86_64] #200 alterator-usbmount.git 0.1.3-alt1: build start
2025-Mar-26 14:21:49 :: [i586] #200 alterator-usbmount.git 0.1.3-alt1: build OK (cached)
2025-Mar-26 14:21:50 :: [x86_64] #200 alterator-usbmount.git 0.1.3-alt1: build OK (cached)
2025-Mar-26 14:21:57 :: [aarch64] #200 alterator-usbmount.git 0.1.3-alt1: build OK (cached)
2025-Mar-26 14:22:12 :: #200: alterator-usbmount.git 0.1.3-alt1: build check OK
2025-Mar-26 14:22:13 :: build check OK
2025-Mar-26 14:22:17 :: noarch check OK
2025-Mar-26 14:22:19 :: plan: src +1 -1 =20039, aarch64 +4 -4 =34814, i586 +4 -4 =33683, x86_64 +4 -4 =35620
#200 alterator-usbmount 0.1.2-alt1 -> 0.1.3-alt1
Wed Mar 26 2025 Oleg Proskurin <proskur@altlinux> 0.1.3-alt1
- Port to sdbus-c++ 2.1.0-alt1 aka libsdbus-cpp2
2025-Mar-26 14:23:01 :: patched apt indices
2025-Mar-26 14:23:10 :: created next repo
2025-Mar-26 14:23:20 :: duplicate provides check OK
2025-Mar-26 14:23:59 :: dependencies check OK
2025-Mar-26 14:24:31 :: [x86_64 i586 aarch64] ELF symbols check OK
i586: alterator-usbmount=0.1.3-alt1 post-install unowned files:
/usr/share/alterator/design/scripts
/usr/share/alterator/design/styles
/usr/share/alterator/ui/usbmount
2025-Mar-26 14:24:42 :: [i586] #200 alterator-usbmount: install check OK (cached)
x86_64: alterator-usbmount=0.1.3-alt1 post-install unowned files:
/usr/share/alterator/design/scripts
/usr/share/alterator/design/styles
/usr/share/alterator/ui/usbmount
2025-Mar-26 14:24:43 :: [x86_64] #200 alterator-usbmount: install check OK (cached)
2025-Mar-26 14:24:46 :: [i586] #200 alterator-usbmount-daemon: install check OK (cached)
2025-Mar-26 14:24:47 :: [x86_64] #200 alterator-usbmount-daemon: install check OK (cached)
aarch64: alterator-usbmount=0.1.3-alt1 post-install unowned files:
/usr/share/alterator/design/scripts
/usr/share/alterator/design/styles
/usr/share/alterator/ui/usbmount
2025-Mar-26 14:24:50 :: [aarch64] #200 alterator-usbmount: install check OK (cached)
2025-Mar-26 14:24:51 :: [i586] #200 alterator-usbmount-daemon-debuginfo: install check OK (cached)
2025-Mar-26 14:24:52 :: [x86_64] #200 alterator-usbmount-daemon-debuginfo: install check OK (cached)
2025-Mar-26 14:24:55 :: [i586] #200 alterator-usbmount-debuginfo: install check OK (cached)
2025-Mar-26 14:24:56 :: [x86_64] #200 alterator-usbmount-debuginfo: install check OK (cached)
2025-Mar-26 14:24:58 :: [aarch64] #200 alterator-usbmount-daemon: install check OK (cached)
2025-Mar-26 14:25:06 :: [aarch64] #200 alterator-usbmount-daemon-debuginfo: install check OK (cached)
2025-Mar-26 14:25:14 :: [aarch64] #200 alterator-usbmount-debuginfo: install check OK (cached)
2025-Mar-26 14:25:31 :: [x86_64-i586] generated apt indices
2025-Mar-26 14:25:31 :: [x86_64-i586] created next repo
2025-Mar-26 14:25:43 :: [x86_64-i586] dependencies check OK
2025-Mar-26 14:25:44 :: gears inheritance check OK
2025-Mar-26 14:25:44 :: srpm inheritance check OK
girar-check-perms: access to alterator-usbmount ALLOWED for zerg: project leader welcomes random builders
check-subtask-perms: #200: alterator-usbmount: approved by zerg
2025-Mar-26 14:25:45 :: acl check OK
2025-Mar-26 14:25:57 :: created contents_index files
2025-Mar-26 14:26:07 :: created hash files: aarch64 i586 src x86_64
2025-Mar-26 14:26:10 :: task #379319 for sisyphus TESTED
2025-Mar-26 14:26:11 :: task is ready for commit
2025-Mar-26 14:26:16 :: repo clone OK
2025-Mar-26 14:26:17 :: packages update OK
2025-Mar-26 14:26:25 :: [x86_64 i586 aarch64] update OK
2025-Mar-26 14:26:25 :: repo update OK
2025-Mar-26 14:26:37 :: repo save OK
2025-Mar-26 14:26:37 :: src index update OK
2025-Mar-26 14:26:37 :: updated /gears/a/alterator-usbmount.git branch `sisyphus'
2025-Mar-26 14:26:43 :: gears update OK
2025-Mar-26 14:26:43 :: task #379319 for sisyphus DONE
^ permalink raw reply [flat|nested] 4+ messages in thread
end of thread, other threads:[~2025-03-26 14:26 UTC | newest]
Thread overview: 4+ messages (download: mbox.gz / follow: Atom feed)
-- links below jump to the message on this page --
2025-03-26 13:01 [#379319] [test-only] FAILED alterator-usbmount.git=0.1.3-alt1 Girar awaiter (proskur)
2025-03-26 13:19 ` [#379319] TESTED (try 2) alterator-usbmount.git=0.1.3-alt1 Girar awaiter (proskur)
2025-03-26 13:28 ` [#379319] EPERM (try 3) alterator-usbmount.git=0.1.3-alt1 Girar awaiter (proskur)
2025-03-26 14:26 ` [#379319] DONE (try 4) alterator-usbmount.git=0.1.3-alt1 Girar pender (proskur)
ALT Linux Girar Builder robot reports
This inbox may be cloned and mirrored by anyone:
git clone --mirror http://lore.altlinux.org/sisyphus-incominger/0 sisyphus-incominger/git/0.git
# If you have public-inbox 1.1+ installed, you may
# initialize and index your mirror using the following commands:
public-inbox-init -V2 sisyphus-incominger sisyphus-incominger/ http://lore.altlinux.org/sisyphus-incominger \
sisyphus-incominger@lists.altlinux.org sisyphus-incominger@lists.altlinux.ru sisyphus-incominger@lists.altlinux.com
public-inbox-index sisyphus-incominger
Example config snippet for mirrors.
Newsgroup available over NNTP:
nntp://lore.altlinux.org/org.altlinux.lists.sisyphus-incominger
AGPL code for this site: git clone https://public-inbox.org/public-inbox.git