* [#379273] [test-only] FAILED fwupd.git=2.0.7-alt1
@ 2025-03-26 6:32 Girar awaiter (egori)
2025-03-26 7:39 ` [#379273] [test-only] FAILED (try 2) fwupd.git=2.0.7-alt1 Girar awaiter (egori)
` (3 more replies)
0 siblings, 4 replies; 5+ messages in thread
From: Girar awaiter (egori) @ 2025-03-26 6:32 UTC (permalink / raw)
To: Egor Ignatov; +Cc: sisyphus-incominger, girar-builder-sisyphus
[-- Warning: decoded text below may be mangled, UTF-8 assumed --]
[-- Attachment #1: Type: text/plain; charset=unknown-8bit, Size: 1371 bytes --]
https://git.altlinux.org/tasks/379273/logs/events.1.1.log
https://packages.altlinux.org/tasks/379273
subtask name aarch64 i586 x86_64
#100 fwupd 3:58 failed 2:34
2025-Mar-26 06:28:56 :: test-only task #379273 for sisyphus started by egori:
#100 build 2.0.7-alt1 from /people/egori/packages/fwupd.git fetched at 2025-Mar-26 06:28:55
2025-Mar-26 06:28:57 :: [x86_64] #100 fwupd.git 2.0.7-alt1: build start
2025-Mar-26 06:28:57 :: [i586] #100 fwupd.git 2.0.7-alt1: build start
2025-Mar-26 06:28:57 :: [aarch64] #100 fwupd.git 2.0.7-alt1: build start
[i586] [1314/1377] Generating plugins/uefi-capsule/ux-capsule-tar with a custom command
[i586] FAILED: plugins/uefi-capsule/uefi-capsule-ux.tar.xz
[i586] /usr/bin/python3 ../plugins/uefi-capsule/make-images.py --podir /usr/src/RPM/BUILD/fwupd-2.0.7/po --label 'Installing firmware update…' --out plugins/uefi-capsule/uefi-capsule-ux.tar.xz
2025-Mar-26 06:30:23 :: [i586] fwupd.git 2.0.7-alt1: remote: build failed
2025-Mar-26 06:30:23 :: [i586] #100 fwupd.git 2.0.7-alt1: build FAILED
2025-Mar-26 06:30:23 :: [i586] requesting cancellation of task processing
2025-Mar-26 06:31:31 :: [x86_64] #100 fwupd.git 2.0.7-alt1: build OK
2025-Mar-26 06:32:55 :: [aarch64] #100 fwupd.git 2.0.7-alt1: build OK
2025-Mar-26 06:30:23 :: [i586] build FAILED
2025-Mar-26 06:32:55 :: task #379273 for sisyphus FAILED
^ permalink raw reply [flat|nested] 5+ messages in thread
* [#379273] [test-only] FAILED (try 2) fwupd.git=2.0.7-alt1
2025-03-26 6:32 [#379273] [test-only] FAILED fwupd.git=2.0.7-alt1 Girar awaiter (egori)
@ 2025-03-26 7:39 ` Girar awaiter (egori)
2025-03-26 12:04 ` [#379273] [test-only] FAILED (try 3) fwupd-efi.git=1.7-alt2 fwupd.git=2.0.7-alt1 Girar awaiter (egori)
` (2 subsequent siblings)
3 siblings, 0 replies; 5+ messages in thread
From: Girar awaiter (egori) @ 2025-03-26 7:39 UTC (permalink / raw)
To: Egor Ignatov; +Cc: sisyphus-incominger, girar-builder-sisyphus
https://git.altlinux.org/tasks/379273/logs/events.2.1.log
https://packages.altlinux.org/tasks/379273
subtask name aarch64 i586 x86_64
#200 fwupd 3:58 failed 2:33
2025-Mar-26 07:35:08 :: test-only task #379273 for sisyphus resumed by egori:
#100 removed
#200 build 2.0.7-alt1 from /people/egori/packages/fwupd.git fetched at 2025-Mar-26 07:35:03
2025-Mar-26 07:35:10 :: [x86_64] #200 fwupd.git 2.0.7-alt1: build start
2025-Mar-26 07:35:10 :: [aarch64] #200 fwupd.git 2.0.7-alt1: build start
2025-Mar-26 07:35:10 :: [i586] #200 fwupd.git 2.0.7-alt1: build start
[i586] /usr/share/fwupd/uefi-capsule-ux.tar.xz
[i586] error: File list check failed, terminating build
[i586] RPM build errors:
[i586] Installed (but unpackaged) file(s) found:
[i586] File list check failed, terminating build
2025-Mar-26 07:37:37 :: [i586] fwupd.git 2.0.7-alt1: remote: build failed
2025-Mar-26 07:37:37 :: [i586] #200 fwupd.git 2.0.7-alt1: build FAILED
2025-Mar-26 07:37:37 :: [i586] requesting cancellation of task processing
2025-Mar-26 07:37:43 :: [x86_64] #200 fwupd.git 2.0.7-alt1: build OK
2025-Mar-26 07:39:08 :: [aarch64] #200 fwupd.git 2.0.7-alt1: build OK
2025-Mar-26 07:37:37 :: [i586] build FAILED
2025-Mar-26 07:39:09 :: task #379273 for sisyphus FAILED
^ permalink raw reply [flat|nested] 5+ messages in thread
* [#379273] [test-only] FAILED (try 3) fwupd-efi.git=1.7-alt2 fwupd.git=2.0.7-alt1
2025-03-26 6:32 [#379273] [test-only] FAILED fwupd.git=2.0.7-alt1 Girar awaiter (egori)
2025-03-26 7:39 ` [#379273] [test-only] FAILED (try 2) fwupd.git=2.0.7-alt1 Girar awaiter (egori)
@ 2025-03-26 12:04 ` Girar awaiter (egori)
2025-03-27 8:23 ` [#379273] TESTED (try 4) fwupd.git=2.0.7-alt1 Girar awaiter (egori)
2025-03-27 15:14 ` [#379273] DONE (try 5) fwupd.git=2.0.7-alt1 Girar pender (egori)
3 siblings, 0 replies; 5+ messages in thread
From: Girar awaiter (egori) @ 2025-03-26 12:04 UTC (permalink / raw)
To: Egor Ignatov; +Cc: sisyphus-incominger, girar-builder-sisyphus
https://git.altlinux.org/tasks/379273/logs/events.3.1.log
https://packages.altlinux.org/tasks/379273
subtask name aarch64 i586 x86_64
#300 fwupd-efi 49 28 29
#400 fwupd 4:41 3:22 3:03
2025-Mar-26 11:53:59 :: test-only task #379273 for sisyphus resumed by egori:
#100 removed
#200 removed
#300 build 1.7-alt2 from /people/egori/packages/fwupd-efi.git fetched at 2025-Mar-26 11:53:04
#400 build 2.0.7-alt1 from /people/egori/packages/fwupd.git fetched at 2025-Mar-26 11:53:14
2025-Mar-26 11:54:00 :: created build repo
2025-Mar-26 11:54:01 :: [i586] #300 fwupd-efi.git 1.7-alt2: build start
2025-Mar-26 11:54:01 :: [x86_64] #300 fwupd-efi.git 1.7-alt2: build start
2025-Mar-26 11:54:01 :: [aarch64] #300 fwupd-efi.git 1.7-alt2: build start
2025-Mar-26 11:54:29 :: [i586] #300 fwupd-efi.git 1.7-alt2: build OK
2025-Mar-26 11:54:29 :: [i586] #400 fwupd.git 2.0.7-alt1: build start
2025-Mar-26 11:54:29 :: [x86_64] #300: pesigning not attempted
2025-Mar-26 11:54:30 :: [x86_64] #300 fwupd-efi.git 1.7-alt2: build OK
2025-Mar-26 11:54:30 :: [x86_64] #400 fwupd.git 2.0.7-alt1: build start
2025-Mar-26 11:54:50 :: [aarch64] #300 fwupd-efi.git 1.7-alt2: build OK
2025-Mar-26 11:54:51 :: [aarch64] #400 fwupd.git 2.0.7-alt1: build start
2025-Mar-26 11:57:33 :: [x86_64] #400 fwupd.git 2.0.7-alt1: build OK
2025-Mar-26 11:57:51 :: [i586] #400 fwupd.git 2.0.7-alt1: build OK
2025-Mar-26 11:59:32 :: [aarch64] #400 fwupd.git 2.0.7-alt1: build OK
2025-Mar-26 11:59:43 :: #300: fwupd-efi.git 1.7-alt2: build check OK
2025-Mar-26 12:00:18 :: #400: fwupd.git 2.0.7-alt1: build check OK
2025-Mar-26 12:00:19 :: build check OK
warning (#300): fwupd-efi-checkinstall-1.7-alt2.x86_64.rpm should be .noarch.rpm
--- fwupd-tests-2.0.7-alt1.x86_64.rpm.share 2025-03-26 12:00:30.502710854 +0000
+++ fwupd-tests-2.0.7-alt1.aarch64.rpm.share 2025-03-26 12:00:30.650712334 +0000
@@ -14,3 +14,2 @@
/usr/share/installed-tests/fwupd/device-tests/amd-dgpu.json 100644 ASCII text
-/usr/share/installed-tests/fwupd/device-tests/amd-pmc.json 100644 ASCII text
/usr/share/installed-tests/fwupd/device-tests/analogix-anx7518.json 100644 ASCII text
@@ -22,3 +21,2 @@
/usr/share/installed-tests/fwupd/device-tests/caldigit-element.json 100644 ASCII text
-/usr/share/installed-tests/fwupd/device-tests/caldigit-ts4-tbt.json 100644 ASCII text
/usr/share/installed-tests/fwupd/device-tests/caldigit-ts4.json 100644 ASCII text
@@ -105,3 +103,2 @@
/usr/share/installed-tests/fwupd/device-tests/uefi-dbx.json 100644 ASCII text
-/usr/share/installed-tests/fwupd/device-tests/uefi-pk.json 100644 ASCII text
/usr/share/installed-tests/fwupd/device-tests/ugreen-cm260.json 100644 ASCII text
@@ -126,3 +123,2 @@
/usr/share/installed-tests/fwupd/enumeration-data/amd-dgpu-setup.json 100644 ASCII text
-/usr/share/installed-tests/fwupd/enumeration-data/amd-pmc-setup.json 100644 ASCII text
/usr/share/installed-tests/fwupd/enumeration-data/asus-hid-setup.json 100644 ASCII text
@@ -152,3 +148,2 @@
/usr/share/installed-tests/fwupd/enumeration-data/synaptics-panamera-setup.json 100644 ASCII text
-/usr/share/installed-tests/fwupd/enumeration-data/uefi-pk-setup.json 100644 ASCII text, with very long lines
/usr/share/installed-tests/fwupd/enumeration-data/wacom-movink-13-setup.json 100644 ASCII text, with very long lines
@@ -262,9 +257,2 @@
/usr/share/installed-tests/fwupd/tests/elf.builder.xml 100644 ASCII text
-/usr/share/installed-tests/fwupd/tests/empty_pcr 40755 directory
-/usr/share/installed-tests/fwupd/tests/empty_pcr/tpm0 40755 directory
-/usr/share/installed-tests/fwupd/tests/empty_pcr/tpm0/active 100644 ASCII text
-/usr/share/installed-tests/fwupd/tests/empty_pcr/tpm0/caps 100644 ASCII text
-/usr/share/installed-tests/fwupd/tests/empty_pcr/tpm0/enabled 100644 ASCII text
-/usr/share/installed-tests/fwupd/tests/empty_pcr/tpm0/owned 100644 ASCII text
-/usr/share/installed-tests/fwupd/tests/empty_pcr/tpm0/pcrs 100644 ASCII text
/usr/share/installed-tests/fwupd/tests/fdt.builder.xml 100644 ASCII text
@@ -311,8 +299,2 @@
/usr/share/installed-tests/fwupd/tests/sys_vendor 100644 ASCII text
-/usr/share/installed-tests/fwupd/tests/tpm0 40755 directory
-/usr/share/installed-tests/fwupd/tests/tpm0/active 100644 ASCII text
-/usr/share/installed-tests/fwupd/tests/tpm0/caps 100644 ASCII text
-/usr/share/installed-tests/fwupd/tests/tpm0/enabled 100644 ASCII text
-/usr/share/installed-tests/fwupd/tests/tpm0/owned 100644 ASCII text
-/usr/share/installed-tests/fwupd/tests/tpm0/pcrs 100644 ASCII text
/usr/share/installed-tests/fwupd/tests/uf2.builder.xml 100644 ASCII HTML document text
warning (#400): non-identical /usr/share part
--- fwupd-tests-2.0.7-alt1.i586.rpm.share 2025-03-26 12:00:31.071716546 +0000
+++ fwupd-tests-2.0.7-alt1.aarch64.rpm.share 2025-03-26 12:00:31.073716566 +0000
@@ -14,3 +14,2 @@
/usr/share/installed-tests/fwupd/device-tests/amd-dgpu.json 100644 ASCII text
-/usr/share/installed-tests/fwupd/device-tests/amd-pmc.json 100644 ASCII text
/usr/share/installed-tests/fwupd/device-tests/analogix-anx7518.json 100644 ASCII text
@@ -22,3 +21,2 @@
/usr/share/installed-tests/fwupd/device-tests/caldigit-element.json 100644 ASCII text
-/usr/share/installed-tests/fwupd/device-tests/caldigit-ts4-tbt.json 100644 ASCII text
/usr/share/installed-tests/fwupd/device-tests/caldigit-ts4.json 100644 ASCII text
@@ -105,3 +103,2 @@
/usr/share/installed-tests/fwupd/device-tests/uefi-dbx.json 100644 ASCII text
-/usr/share/installed-tests/fwupd/device-tests/uefi-pk.json 100644 ASCII text
/usr/share/installed-tests/fwupd/device-tests/ugreen-cm260.json 100644 ASCII text
@@ -126,3 +123,2 @@
/usr/share/installed-tests/fwupd/enumeration-data/amd-dgpu-setup.json 100644 ASCII text
-/usr/share/installed-tests/fwupd/enumeration-data/amd-pmc-setup.json 100644 ASCII text
/usr/share/installed-tests/fwupd/enumeration-data/asus-hid-setup.json 100644 ASCII text
@@ -152,3 +148,2 @@
/usr/share/installed-tests/fwupd/enumeration-data/synaptics-panamera-setup.json 100644 ASCII text
-/usr/share/installed-tests/fwupd/enumeration-data/uefi-pk-setup.json 100644 ASCII text, with very long lines
/usr/share/installed-tests/fwupd/enumeration-data/wacom-movink-13-setup.json 100644 ASCII text, with very long lines
@@ -262,9 +257,2 @@
/usr/share/installed-tests/fwupd/tests/elf.builder.xml 100644 ASCII text
-/usr/share/installed-tests/fwupd/tests/empty_pcr 40755 directory
-/usr/share/installed-tests/fwupd/tests/empty_pcr/tpm0 40755 directory
-/usr/share/installed-tests/fwupd/tests/empty_pcr/tpm0/active 100644 ASCII text
-/usr/share/installed-tests/fwupd/tests/empty_pcr/tpm0/caps 100644 ASCII text
-/usr/share/installed-tests/fwupd/tests/empty_pcr/tpm0/enabled 100644 ASCII text
-/usr/share/installed-tests/fwupd/tests/empty_pcr/tpm0/owned 100644 ASCII text
-/usr/share/installed-tests/fwupd/tests/empty_pcr/tpm0/pcrs 100644 ASCII text
/usr/share/installed-tests/fwupd/tests/fdt.builder.xml 100644 ASCII text
@@ -311,8 +299,2 @@
/usr/share/installed-tests/fwupd/tests/sys_vendor 100644 ASCII text
-/usr/share/installed-tests/fwupd/tests/tpm0 40755 directory
-/usr/share/installed-tests/fwupd/tests/tpm0/active 100644 ASCII text
-/usr/share/installed-tests/fwupd/tests/tpm0/caps 100644 ASCII text
-/usr/share/installed-tests/fwupd/tests/tpm0/enabled 100644 ASCII text
-/usr/share/installed-tests/fwupd/tests/tpm0/owned 100644 ASCII text
-/usr/share/installed-tests/fwupd/tests/tpm0/pcrs 100644 ASCII text
/usr/share/installed-tests/fwupd/tests/uf2.builder.xml 100644 ASCII HTML document text
warning (#400): non-identical /usr/share part
2025-Mar-26 12:00:34 :: noarch check OK
2025-Mar-26 12:00:36 :: plan: src +2 -2 =20036, aarch64 +11 -11 =34765, i586 +11 -9 =33635, noarch +1 -1 =21218, x86_64 +11 -11 =35570
#400 fwupd 2.0.6-alt1 -> 2.0.7-alt1
Wed Mar 26 2025 Egor Ignatov <egori@altlinux> 2.0.7-alt1
- 2.0.7
#300 fwupd-efi 1.7-alt1 -> 1.7-alt2
Wed Mar 26 2025 Egor Ignatov <egori@altlinux> 1.7-alt2
- enable build on i586
2025-Mar-26 12:01:38 :: patched apt indices
2025-Mar-26 12:01:50 :: created next repo
2025-Mar-26 12:02:04 :: duplicate provides check OK
2025-Mar-26 12:02:52 :: dependencies check OK
2025-Mar-26 12:03:30 :: [x86_64 i586 aarch64] ELF symbols check OK
i586: fwupd=2.0.7-alt1 post-install unowned files:
/etc/grub.d
/usr/lib/systemd/system-shutdown
/usr/share/dbus-1
/usr/share/dbus-1/interfaces
/usr/share/dbus-1/system-services
/usr/share/dbus-1/system.d
/usr/share/fish
/usr/share/fish/vendor_completions.d
/usr/share/icons/hicolor/128x128
/usr/share/icons/hicolor/128x128/apps
/usr/share/icons/hicolor/64x64
/usr/share/icons/hicolor/64x64/apps
/usr/share/icons/hicolor/scalable
/usr/share/icons/hicolor/scalable/apps
/usr/share/metainfo
/usr/share/polkit-1
/usr/share/polkit-1/actions
/usr/share/polkit-1/rules.d
2025-Mar-26 12:03:49 :: [i586] #400 fwupd: install check OK
x86_64: fwupd=2.0.7-alt1 post-install unowned files:
/etc/grub.d
/usr/lib/systemd/system-shutdown
/usr/share/dbus-1
/usr/share/dbus-1/interfaces
/usr/share/dbus-1/system-services
/usr/share/dbus-1/system.d
/usr/share/fish
/usr/share/fish/vendor_completions.d
/usr/share/icons/hicolor/128x128
/usr/share/icons/hicolor/128x128/apps
/usr/share/icons/hicolor/64x64
/usr/share/icons/hicolor/64x64/apps
/usr/share/icons/hicolor/scalable
/usr/share/icons/hicolor/scalable/apps
/usr/share/metainfo
/usr/share/polkit-1
/usr/share/polkit-1/actions
/usr/share/polkit-1/rules.d
2025-Mar-26 12:03:50 :: [x86_64] #400 fwupd: install check OK
aarch64: fwupd=2.0.7-alt1 post-install unowned files:
/etc/grub.d
/usr/lib/systemd/system-shutdown
/usr/lib/sysusers.d
/usr/share/dbus-1
/usr/share/dbus-1/interfaces
/usr/share/dbus-1/system-services
/usr/share/dbus-1/system.d
/usr/share/fish
/usr/share/fish/vendor_completions.d
/usr/share/icons/hicolor/128x128
/usr/share/icons/hicolor/128x128/apps
/usr/share/icons/hicolor/64x64
/usr/share/icons/hicolor/64x64/apps
/usr/share/icons/hicolor/scalable
/usr/share/icons/hicolor/scalable/apps
/usr/share/metainfo
/usr/share/polkit-1
/usr/share/polkit-1/actions
/usr/share/polkit-1/rules.d
2025-Mar-26 12:03:59 :: [aarch64] #400 fwupd: install check OK
2025-Mar-26 12:04:07 :: [x86_64] #400 fwupd-debuginfo: install check OK
2025-Mar-26 12:04:07 :: [i586] #400 fwupd-debuginfo: install check OK
x86_64: fwupd-efi=1.7-alt2 post-install unowned files:
/usr/lib64/efi
i586: fwupd-efi=1.7-alt2 post-install unowned files:
/usr/lib/efi
2025-Mar-26 12:04:14 :: [x86_64] #300 fwupd-efi: install check OK
2025-Mar-26 12:04:14 :: [i586] #300 fwupd-efi: install check OK
x86_64: fwupd-efi-checkinstall=1.7-alt2 preinstall failed:
<13>Mar 26 12:04:18 rpmi: libffi8-1:3.4.7-alt1 sisyphus+375890.100.1.1 1740391809 installed
<13>Mar 26 12:04:18 rpmi: libp11-kit-1:0.25.5-alt1 sisyphus+352553.100.1.1 1720622573 installed
<13>Mar 26 12:04:18 rpmi: openssl-config-3.2.0-alt1 sisyphus+366659.140.4.1 1736956949 installed
<13>Mar 26 12:04:18 rpmi: glib2-locales-2.84.0-alt1 sisyphus+378180.100.1.1 1742049815 installed
<13>Mar 26 12:04:18 rpmi: glib2-2.84.0-alt1 sisyphus+378180.100.1.1 1742049815 installed
<13>Mar 26 12:04:18 rpmi: pkg-config-0.29.2-alt3 sisyphus+278099.3600.1.1 1626030471 installed
<13>Mar 26 12:04:18 rpmi: libtasn1-4.20.0-alt2 sisyphus+375829.100.1.1 1740299335 installed
<13>Mar 26 12:04:18 rpmi: libsframe1-1:2.43-alt1 sisyphus+360995.500.2.1 1730228602 installed
<13>Mar 26 12:04:18 rpmi: libctf-nobfd0-1:2.43-alt1 sisyphus+360995.500.2.1 1730228602 installed
<13>Mar 26 12:04:18 rpmi: libstdc++6-14.2.1-alt1 sisyphus+360995.100.1.1 1730131018 installed
<13>Mar 26 12:04:19 rpmi: binutils-1:2.43-alt1 sisyphus+360995.500.2.1 1730228602 installed
<13>Mar 26 12:04:19 rpmi: rpm-macros-alternatives-0.5.3-alt1 sisyphus+371878.100.1.1 1737988822 installed
<13>Mar 26 12:04:19 rpmi: libshell-0.4.13-alt1 sisyphus+340108.100.1.1 1707399175 installed
<13>Mar 26 12:04:19 rpmi: alternatives-0.5.3-alt1 sisyphus+371878.100.1.1 1737988822 installed
<13>Mar 26 12:04:19 rpmi: ca-certificates-2025.02.10-alt1 sisyphus+374228.100.4.1 1739265441 installed
<13>Mar 26 12:04:19 rpmi: ca-trust-0.2.0-alt1 sisyphus+344843.100.1.1 1712743326 installed
<13>Mar 26 12:04:19 rpmi: p11-kit-trust-1:0.25.5-alt1 sisyphus+352553.100.1.1 1720622573 installed
<13>Mar 26 12:04:19 rpmi: libcrypto3-3.3.3-alt1 sisyphus+374381.40.2.1 1739299401 installed
<13>Mar 26 12:04:19 rpmi: libssl3-3.3.3-alt1 sisyphus+374381.40.2.1 1739299401 installed
<13>Mar 26 12:04:19 rpmi: openssl-3.3.3-alt1 sisyphus+374381.40.2.1 1739299401 installed
<13>Mar 26 12:04:19 rpmi: sbsigntools-0.9.5-alt3 sisyphus+347640.100.1.1 1715083694 installed
<13>Mar 26 12:04:19 rpmi: alt-uefi-certs-3.0-alt1 sisyphus+347717.300.2.1 1715773699 installed
<13>Mar 26 12:04:19 rpmi: rpm-pesign-checkinstall-3-alt1 sisyphus+282479.100.1.1 1628716586 installed
<13>Mar 26 12:04:19 rpmi: fwupd-efi-1.7-alt2 sisyphus+379273.300.3.1 1742990068 installed
egrep: warning: egrep is obsolescent; using grep -E
- Verifying /usr/lib64/efi/fwupdx64.efi
Signature verification failed
= PESIGN verification failures 1, successes 0.
/usr/lib/rpm/check-pesign.filetrigger failed
error: posttrans filetriggers scriptlet failed, exit status 1
hsh-install: Packages installation failed.
2025-Mar-26 12:04:19 :: [x86_64] #300 fwupd-efi-checkinstall: install check FAILED
2025-Mar-26 12:04:19 :: [x86_64] requesting cancellation of task processing
2025-Mar-26 12:04:19 :: [x86_64] #400 fwupd-plugin-modem-manager: install check CANCELLED
2025-Mar-26 12:04:21 :: [i586] #300 fwupd-efi-checkinstall: install check OK
2025-Mar-26 12:04:21 :: [i586] #400 fwupd-plugin-modem-manager: install check CANCELLED
2025-Mar-26 12:04:23 :: [aarch64] #400 fwupd-debuginfo: install check OK
2025-Mar-26 12:04:23 :: [aarch64] #300 fwupd-efi: install check CANCELLED
2025-Mar-26 12:04:20 :: [x86_64] install check FAILED
2025-Mar-26 12:04:22 :: [i586] install check FAILED
2025-Mar-26 12:04:24 :: [aarch64] install check FAILED
2025-Mar-26 12:04:24 :: task #379273 for sisyphus FAILED
^ permalink raw reply [flat|nested] 5+ messages in thread
* [#379273] TESTED (try 4) fwupd.git=2.0.7-alt1
2025-03-26 6:32 [#379273] [test-only] FAILED fwupd.git=2.0.7-alt1 Girar awaiter (egori)
2025-03-26 7:39 ` [#379273] [test-only] FAILED (try 2) fwupd.git=2.0.7-alt1 Girar awaiter (egori)
2025-03-26 12:04 ` [#379273] [test-only] FAILED (try 3) fwupd-efi.git=1.7-alt2 fwupd.git=2.0.7-alt1 Girar awaiter (egori)
@ 2025-03-27 8:23 ` Girar awaiter (egori)
2025-03-27 15:14 ` [#379273] DONE (try 5) fwupd.git=2.0.7-alt1 Girar pender (egori)
3 siblings, 0 replies; 5+ messages in thread
From: Girar awaiter (egori) @ 2025-03-27 8:23 UTC (permalink / raw)
To: Egor Ignatov
Cc: Nikolai Kostrigin, sisyphus-incominger, Anton Farygin,
girar-builder-sisyphus
https://git.altlinux.org/tasks/379273/logs/events.4.1.log
https://packages.altlinux.org/tasks/379273
subtask name aarch64 i586 x86_64
#500 fwupd 4:29 3:09 3:01
2025-Mar-27 08:10:57 :: test-only task #379273 for sisyphus resumed by egori:
#100 removed
#200 removed
#300 removed
#400 removed
#500 build 2.0.7-alt1 from /people/egori/packages/fwupd.git fetched at 2025-Mar-27 08:10:52
2025-Mar-27 08:10:58 :: [x86_64] #500 fwupd.git 2.0.7-alt1: build start
2025-Mar-27 08:10:58 :: [i586] #500 fwupd.git 2.0.7-alt1: build start
2025-Mar-27 08:10:58 :: [aarch64] #500 fwupd.git 2.0.7-alt1: build start
2025-Mar-27 08:13:59 :: [x86_64] #500 fwupd.git 2.0.7-alt1: build OK
2025-Mar-27 08:14:07 :: [i586] #500 fwupd.git 2.0.7-alt1: build OK
2025-Mar-27 08:15:27 :: [aarch64] #500 fwupd.git 2.0.7-alt1: build OK
2025-Mar-27 08:16:03 :: #500: fwupd.git 2.0.7-alt1: build check OK
2025-Mar-27 08:16:04 :: build check OK
--- fwupd-2.0.7-alt1.x86_64.rpm.share 2025-03-27 08:16:08.689673021 +0000
+++ fwupd-2.0.7-alt1.i586.rpm.share 2025-03-27 08:16:08.940675299 +0000
@@ -23,3 +23,2 @@
/usr/share/fwupd/simple_client.py 100755 python3 script text executable
-/usr/share/fwupd/uefi-capsule-ux.tar.xz 100644 xz compressed data
/usr/share/icons/hicolor/128x128/apps/org.freedesktop.fwupd.png 100644 PNG image, non-interlaced
warning (#500): non-identical /usr/share part
--- fwupd-tests-2.0.7-alt1.x86_64.rpm.share 2025-03-27 08:16:11.704700380 +0000
+++ fwupd-tests-2.0.7-alt1.i586.rpm.share 2025-03-27 08:16:11.853701732 +0000
@@ -112,13 +112,2 @@
/usr/share/installed-tests/fwupd/device-tests/wistron-dock-40b7.json 100644 ASCII text
-/usr/share/installed-tests/fwupd/efi 40755 directory
-/usr/share/installed-tests/fwupd/efi/esrt 40755 directory
-/usr/share/installed-tests/fwupd/efi/esrt/entries 40755 directory
-/usr/share/installed-tests/fwupd/efi/esrt/entries/entry0 40755 directory
-/usr/share/installed-tests/fwupd/efi/esrt/entries/entry0/capsule_flags 100644 ASCII text
-/usr/share/installed-tests/fwupd/efi/esrt/entries/entry0/fw_class 100644 ASCII text
-/usr/share/installed-tests/fwupd/efi/esrt/entries/entry0/fw_type 100644 ASCII text
-/usr/share/installed-tests/fwupd/efi/esrt/entries/entry0/fw_version 100644 ASCII text
-/usr/share/installed-tests/fwupd/efi/esrt/entries/entry0/last_attempt_status 100644 ASCII text
-/usr/share/installed-tests/fwupd/efi/esrt/entries/entry0/last_attempt_version 100644 ASCII text
-/usr/share/installed-tests/fwupd/efi/esrt/entries/entry0/lowest_supported_fw_version 100644 ASCII text
/usr/share/installed-tests/fwupd/enumeration-data 40755 directory
warning (#500): non-identical /usr/share part
--- fwupd-tests-2.0.7-alt1.x86_64.rpm.share 2025-03-27 08:16:14.332724227 +0000
+++ fwupd-tests-2.0.7-alt1.aarch64.rpm.share 2025-03-27 08:16:14.478725552 +0000
@@ -14,3 +14,2 @@
/usr/share/installed-tests/fwupd/device-tests/amd-dgpu.json 100644 ASCII text
-/usr/share/installed-tests/fwupd/device-tests/amd-pmc.json 100644 ASCII text
/usr/share/installed-tests/fwupd/device-tests/analogix-anx7518.json 100644 ASCII text
@@ -22,3 +21,2 @@
/usr/share/installed-tests/fwupd/device-tests/caldigit-element.json 100644 ASCII text
-/usr/share/installed-tests/fwupd/device-tests/caldigit-ts4-tbt.json 100644 ASCII text
/usr/share/installed-tests/fwupd/device-tests/caldigit-ts4.json 100644 ASCII text
@@ -105,3 +103,2 @@
/usr/share/installed-tests/fwupd/device-tests/uefi-dbx.json 100644 ASCII text
-/usr/share/installed-tests/fwupd/device-tests/uefi-pk.json 100644 ASCII text
/usr/share/installed-tests/fwupd/device-tests/ugreen-cm260.json 100644 ASCII text
@@ -126,3 +123,2 @@
/usr/share/installed-tests/fwupd/enumeration-data/amd-dgpu-setup.json 100644 ASCII text
-/usr/share/installed-tests/fwupd/enumeration-data/amd-pmc-setup.json 100644 ASCII text
/usr/share/installed-tests/fwupd/enumeration-data/asus-hid-setup.json 100644 ASCII text
@@ -152,3 +148,2 @@
/usr/share/installed-tests/fwupd/enumeration-data/synaptics-panamera-setup.json 100644 ASCII text
-/usr/share/installed-tests/fwupd/enumeration-data/uefi-pk-setup.json 100644 ASCII text, with very long lines
/usr/share/installed-tests/fwupd/enumeration-data/wacom-movink-13-setup.json 100644 ASCII text, with very long lines
@@ -262,9 +257,2 @@
/usr/share/installed-tests/fwupd/tests/elf.builder.xml 100644 ASCII text
-/usr/share/installed-tests/fwupd/tests/empty_pcr 40755 directory
-/usr/share/installed-tests/fwupd/tests/empty_pcr/tpm0 40755 directory
-/usr/share/installed-tests/fwupd/tests/empty_pcr/tpm0/active 100644 ASCII text
-/usr/share/installed-tests/fwupd/tests/empty_pcr/tpm0/caps 100644 ASCII text
-/usr/share/installed-tests/fwupd/tests/empty_pcr/tpm0/enabled 100644 ASCII text
-/usr/share/installed-tests/fwupd/tests/empty_pcr/tpm0/owned 100644 ASCII text
-/usr/share/installed-tests/fwupd/tests/empty_pcr/tpm0/pcrs 100644 ASCII text
/usr/share/installed-tests/fwupd/tests/fdt.builder.xml 100644 ASCII text
@@ -311,8 +299,2 @@
/usr/share/installed-tests/fwupd/tests/sys_vendor 100644 ASCII text
-/usr/share/installed-tests/fwupd/tests/tpm0 40755 directory
-/usr/share/installed-tests/fwupd/tests/tpm0/active 100644 ASCII text
-/usr/share/installed-tests/fwupd/tests/tpm0/caps 100644 ASCII text
-/usr/share/installed-tests/fwupd/tests/tpm0/enabled 100644 ASCII text
-/usr/share/installed-tests/fwupd/tests/tpm0/owned 100644 ASCII text
-/usr/share/installed-tests/fwupd/tests/tpm0/pcrs 100644 ASCII text
/usr/share/installed-tests/fwupd/tests/uf2.builder.xml 100644 ASCII HTML document text
warning (#500): non-identical /usr/share part
--- fwupd-2.0.7-alt1.i586.rpm.share 2025-03-27 08:16:14.882729218 +0000
+++ fwupd-2.0.7-alt1.aarch64.rpm.share 2025-03-27 08:16:14.884729236 +0000
@@ -23,2 +23,3 @@
/usr/share/fwupd/simple_client.py 100755 python3 script text executable
+/usr/share/fwupd/uefi-capsule-ux.tar.xz 100644 xz compressed data
/usr/share/icons/hicolor/128x128/apps/org.freedesktop.fwupd.png 100644 PNG image, non-interlaced
warning (#500): non-identical /usr/share part
--- fwupd-tests-2.0.7-alt1.i586.rpm.share 2025-03-27 08:16:14.913729499 +0000
+++ fwupd-tests-2.0.7-alt1.aarch64.rpm.share 2025-03-27 08:16:14.915729517 +0000
@@ -14,3 +14,2 @@
/usr/share/installed-tests/fwupd/device-tests/amd-dgpu.json 100644 ASCII text
-/usr/share/installed-tests/fwupd/device-tests/amd-pmc.json 100644 ASCII text
/usr/share/installed-tests/fwupd/device-tests/analogix-anx7518.json 100644 ASCII text
@@ -22,3 +21,2 @@
/usr/share/installed-tests/fwupd/device-tests/caldigit-element.json 100644 ASCII text
-/usr/share/installed-tests/fwupd/device-tests/caldigit-ts4-tbt.json 100644 ASCII text
/usr/share/installed-tests/fwupd/device-tests/caldigit-ts4.json 100644 ASCII text
@@ -105,3 +103,2 @@
/usr/share/installed-tests/fwupd/device-tests/uefi-dbx.json 100644 ASCII text
-/usr/share/installed-tests/fwupd/device-tests/uefi-pk.json 100644 ASCII text
/usr/share/installed-tests/fwupd/device-tests/ugreen-cm260.json 100644 ASCII text
@@ -112,2 +109,13 @@
/usr/share/installed-tests/fwupd/device-tests/wistron-dock-40b7.json 100644 ASCII text
+/usr/share/installed-tests/fwupd/efi 40755 directory
+/usr/share/installed-tests/fwupd/efi/esrt 40755 directory
+/usr/share/installed-tests/fwupd/efi/esrt/entries 40755 directory
+/usr/share/installed-tests/fwupd/efi/esrt/entries/entry0 40755 directory
+/usr/share/installed-tests/fwupd/efi/esrt/entries/entry0/capsule_flags 100644 ASCII text
+/usr/share/installed-tests/fwupd/efi/esrt/entries/entry0/fw_class 100644 ASCII text
+/usr/share/installed-tests/fwupd/efi/esrt/entries/entry0/fw_type 100644 ASCII text
+/usr/share/installed-tests/fwupd/efi/esrt/entries/entry0/fw_version 100644 ASCII text
+/usr/share/installed-tests/fwupd/efi/esrt/entries/entry0/last_attempt_status 100644 ASCII text
+/usr/share/installed-tests/fwupd/efi/esrt/entries/entry0/last_attempt_version 100644 ASCII text
+/usr/share/installed-tests/fwupd/efi/esrt/entries/entry0/lowest_supported_fw_version 100644 ASCII text
/usr/share/installed-tests/fwupd/enumeration-data 40755 directory
@@ -115,3 +123,2 @@
/usr/share/installed-tests/fwupd/enumeration-data/amd-dgpu-setup.json 100644 ASCII text
-/usr/share/installed-tests/fwupd/enumeration-data/amd-pmc-setup.json 100644 ASCII text
/usr/share/installed-tests/fwupd/enumeration-data/asus-hid-setup.json 100644 ASCII text
@@ -141,3 +148,2 @@
/usr/share/installed-tests/fwupd/enumeration-data/synaptics-panamera-setup.json 100644 ASCII text
-/usr/share/installed-tests/fwupd/enumeration-data/uefi-pk-setup.json 100644 ASCII text, with very long lines
/usr/share/installed-tests/fwupd/enumeration-data/wacom-movink-13-setup.json 100644 ASCII text, with very long lines
@@ -251,9 +257,2 @@
/usr/share/installed-tests/fwupd/tests/elf.builder.xml 100644 ASCII text
-/usr/share/installed-tests/fwupd/tests/empty_pcr 40755 directory
-/usr/share/installed-tests/fwupd/tests/empty_pcr/tpm0 40755 directory
-/usr/share/installed-tests/fwupd/tests/empty_pcr/tpm0/active 100644 ASCII text
-/usr/share/installed-tests/fwupd/tests/empty_pcr/tpm0/caps 100644 ASCII text
-/usr/share/installed-tests/fwupd/tests/empty_pcr/tpm0/enabled 100644 ASCII text
-/usr/share/installed-tests/fwupd/tests/empty_pcr/tpm0/owned 100644 ASCII text
-/usr/share/installed-tests/fwupd/tests/empty_pcr/tpm0/pcrs 100644 ASCII text
/usr/share/installed-tests/fwupd/tests/fdt.builder.xml 100644 ASCII text
@@ -300,8 +299,2 @@
/usr/share/installed-tests/fwupd/tests/sys_vendor 100644 ASCII text
-/usr/share/installed-tests/fwupd/tests/tpm0 40755 directory
-/usr/share/installed-tests/fwupd/tests/tpm0/active 100644 ASCII text
-/usr/share/installed-tests/fwupd/tests/tpm0/caps 100644 ASCII text
-/usr/share/installed-tests/fwupd/tests/tpm0/enabled 100644 ASCII text
-/usr/share/installed-tests/fwupd/tests/tpm0/owned 100644 ASCII text
-/usr/share/installed-tests/fwupd/tests/tpm0/pcrs 100644 ASCII text
/usr/share/installed-tests/fwupd/tests/uf2.builder.xml 100644 ASCII HTML document text
warning (#500): non-identical /usr/share part
2025-Mar-27 08:16:18 :: noarch check OK
2025-Mar-27 08:16:20 :: plan: src +1 -1 =20040, aarch64 +9 -9 =34818, i586 +9 -9 =33687, noarch +1 -1 =21220, x86_64 +9 -9 =35624
#500 fwupd 2.0.6-alt1 -> 2.0.7-alt1
Wed Mar 26 2025 Egor Ignatov <egori@altlinux> 2.0.7-alt1
- 2.0.7
2025-Mar-27 08:17:16 :: patched apt indices
2025-Mar-27 08:17:27 :: created next repo
2025-Mar-27 08:17:37 :: duplicate provides check OK
2025-Mar-27 08:18:20 :: dependencies check OK
2025-Mar-27 08:18:55 :: [x86_64 i586 aarch64] ELF symbols check OK
i586: fwupd=2.0.7-alt1 post-install unowned files:
/usr/lib/systemd/system-shutdown
/usr/share/dbus-1
/usr/share/dbus-1/interfaces
/usr/share/dbus-1/system-services
/usr/share/dbus-1/system.d
/usr/share/fish
/usr/share/fish/vendor_completions.d
/usr/share/icons/hicolor/128x128
/usr/share/icons/hicolor/128x128/apps
/usr/share/icons/hicolor/64x64
/usr/share/icons/hicolor/64x64/apps
/usr/share/icons/hicolor/scalable
/usr/share/icons/hicolor/scalable/apps
/usr/share/metainfo
/usr/share/polkit-1
/usr/share/polkit-1/actions
/usr/share/polkit-1/rules.d
2025-Mar-27 08:19:14 :: [i586] #500 fwupd: install check OK
x86_64: fwupd=2.0.7-alt1 post-install unowned files:
/etc/grub.d
/usr/lib/systemd/system-shutdown
/usr/share/dbus-1
/usr/share/dbus-1/interfaces
/usr/share/dbus-1/system-services
/usr/share/dbus-1/system.d
/usr/share/fish
/usr/share/fish/vendor_completions.d
/usr/share/icons/hicolor/128x128
/usr/share/icons/hicolor/128x128/apps
/usr/share/icons/hicolor/64x64
/usr/share/icons/hicolor/64x64/apps
/usr/share/icons/hicolor/scalable
/usr/share/icons/hicolor/scalable/apps
/usr/share/metainfo
/usr/share/polkit-1
/usr/share/polkit-1/actions
/usr/share/polkit-1/rules.d
2025-Mar-27 08:19:15 :: [x86_64] #500 fwupd: install check OK
aarch64: fwupd=2.0.7-alt1 post-install unowned files:
/etc/grub.d
/usr/lib/systemd/system-shutdown
/usr/lib/sysusers.d
/usr/share/dbus-1
/usr/share/dbus-1/interfaces
/usr/share/dbus-1/system-services
/usr/share/dbus-1/system.d
/usr/share/fish
/usr/share/fish/vendor_completions.d
/usr/share/icons/hicolor/128x128
/usr/share/icons/hicolor/128x128/apps
/usr/share/icons/hicolor/64x64
/usr/share/icons/hicolor/64x64/apps
/usr/share/icons/hicolor/scalable
/usr/share/icons/hicolor/scalable/apps
/usr/share/metainfo
/usr/share/polkit-1
/usr/share/polkit-1/actions
/usr/share/polkit-1/rules.d
2025-Mar-27 08:19:24 :: [aarch64] #500 fwupd: install check OK
2025-Mar-27 08:19:31 :: [x86_64] #500 fwupd-debuginfo: install check OK
2025-Mar-27 08:19:31 :: [i586] #500 fwupd-debuginfo: install check OK
2025-Mar-27 08:19:42 :: [x86_64] #500 fwupd-plugin-modem-manager: install check OK
2025-Mar-27 08:19:43 :: [i586] #500 fwupd-plugin-modem-manager: install check OK
2025-Mar-27 08:19:48 :: [aarch64] #500 fwupd-debuginfo: install check OK
2025-Mar-27 08:19:59 :: [x86_64] #500 fwupd-plugin-modem-manager-debuginfo: install check OK
2025-Mar-27 08:20:00 :: [i586] #500 fwupd-plugin-modem-manager-debuginfo: install check OK
2025-Mar-27 08:20:04 :: [aarch64] #500 fwupd-plugin-modem-manager: install check OK
x86_64: fwupd-tests=2.0.7-alt1 post-install unowned files:
/usr/libexec/installed-tests
/usr/share/installed-tests
2025-Mar-27 08:20:11 :: [x86_64] #500 fwupd-tests: install check OK
i586: fwupd-tests=2.0.7-alt1 post-install unowned files:
/usr/libexec/installed-tests
/usr/share/installed-tests
2025-Mar-27 08:20:13 :: [i586] #500 fwupd-tests: install check OK
2025-Mar-27 08:20:28 :: [aarch64] #500 fwupd-plugin-modem-manager-debuginfo: install check OK
2025-Mar-27 08:20:29 :: [x86_64] #500 fwupd-tests-debuginfo: install check OK
2025-Mar-27 08:20:32 :: [i586] #500 fwupd-tests-debuginfo: install check OK
2025-Mar-27 08:20:39 :: [x86_64] #500 libfwupd-devel: install check OK
2025-Mar-27 08:20:42 :: [i586] #500 libfwupd-devel: install check OK
2025-Mar-27 08:20:46 :: [x86_64] #500 libfwupd-devel-docs: install check OK
aarch64: fwupd-tests=2.0.7-alt1 post-install unowned files:
/usr/libexec/installed-tests
/usr/share/installed-tests
2025-Mar-27 08:20:48 :: [aarch64] #500 fwupd-tests: install check OK
2025-Mar-27 08:20:48 :: [i586] #500 libfwupd-devel-docs: install check OK
2025-Mar-27 08:20:54 :: [x86_64] #500 libfwupd3: install check OK
2025-Mar-27 08:20:57 :: [i586] #500 libfwupd3: install check OK
2025-Mar-27 08:21:06 :: [x86_64] #500 libfwupd3-debuginfo: install check OK
2025-Mar-27 08:21:09 :: [i586] #500 libfwupd3-debuginfo: install check OK
2025-Mar-27 08:21:15 :: [aarch64] #500 fwupd-tests-debuginfo: install check OK
2025-Mar-27 08:21:31 :: [aarch64] #500 libfwupd-devel: install check OK
2025-Mar-27 08:21:42 :: [aarch64] #500 libfwupd-devel-docs: install check OK
2025-Mar-27 08:21:55 :: [aarch64] #500 libfwupd3: install check OK
2025-Mar-27 08:22:15 :: [aarch64] #500 libfwupd3-debuginfo: install check OK
2025-Mar-27 08:22:16 :: [x86_64-i586] plan: #4 +4 -4 =11599
2025-Mar-27 08:22:41 :: [x86_64-i586] arepo build OK
2025-Mar-27 08:22:59 :: [x86_64-i586] generated apt indices
2025-Mar-27 08:23:01 :: [x86_64-i586] created next repo
2025-Mar-27 08:23:13 :: [x86_64-i586] dependencies check OK
2025-Mar-27 08:23:14 :: gears inheritance check OK
2025-Mar-27 08:23:14 :: srpm inheritance check OK
girar-check-perms: access to fwupd ALLOWED for egori: approved builder
check-subtask-perms: #500: fwupd: allowed for egori
2025-Mar-27 08:23:15 :: acl check OK
2025-Mar-27 08:23:39 :: created contents_index files
2025-Mar-27 08:23:47 :: created hash files: aarch64 i586 noarch src x86_64-i586 x86_64
2025-Mar-27 08:23:51 :: task #379273 for sisyphus TESTED
^ permalink raw reply [flat|nested] 5+ messages in thread
* [#379273] DONE (try 5) fwupd.git=2.0.7-alt1
2025-03-26 6:32 [#379273] [test-only] FAILED fwupd.git=2.0.7-alt1 Girar awaiter (egori)
` (2 preceding siblings ...)
2025-03-27 8:23 ` [#379273] TESTED (try 4) fwupd.git=2.0.7-alt1 Girar awaiter (egori)
@ 2025-03-27 15:14 ` Girar pender (egori)
3 siblings, 0 replies; 5+ messages in thread
From: Girar pender (egori) @ 2025-03-27 15:14 UTC (permalink / raw)
To: Egor Ignatov
Cc: Nikolai Kostrigin, sisyphus-incominger, Anton Farygin,
girar-builder-sisyphus
https://git.altlinux.org/tasks/archive/done/_370/379273/logs/events.5.2.log
https://packages.altlinux.org/tasks/379273
subtask name aarch64 i586 x86_64
#500 fwupd 4:34 3:11 3:02
2025-Mar-27 15:07:36 :: task #379273 for sisyphus resumed by egori:
#100 removed
#200 removed
#300 removed
#400 removed
#500 build 2.0.7-alt1 from /people/egori/packages/fwupd.git fetched at 2025-Mar-27 08:10:52
2025-Mar-27 15:07:38 :: [x86_64] #500 fwupd.git 2.0.7-alt1: build start
2025-Mar-27 15:07:38 :: [i586] #500 fwupd.git 2.0.7-alt1: build start
2025-Mar-27 15:07:38 :: [aarch64] #500 fwupd.git 2.0.7-alt1: build start
2025-Mar-27 15:07:50 :: [i586] #500 fwupd.git 2.0.7-alt1: build OK (cached)
2025-Mar-27 15:07:51 :: [x86_64] #500 fwupd.git 2.0.7-alt1: build OK (cached)
2025-Mar-27 15:07:59 :: [aarch64] #500 fwupd.git 2.0.7-alt1: build OK (cached)
2025-Mar-27 15:08:31 :: #500: fwupd.git 2.0.7-alt1: build check OK
2025-Mar-27 15:08:32 :: build check OK
--- fwupd-2.0.7-alt1.x86_64.rpm.share 2025-03-27 15:08:36.618182653 +0000
+++ fwupd-2.0.7-alt1.i586.rpm.share 2025-03-27 15:08:36.830185039 +0000
@@ -23,3 +23,2 @@
/usr/share/fwupd/simple_client.py 100755 python3 script text executable
-/usr/share/fwupd/uefi-capsule-ux.tar.xz 100644 xz compressed data
/usr/share/icons/hicolor/128x128/apps/org.freedesktop.fwupd.png 100644 PNG image, non-interlaced
warning (#500): non-identical /usr/share part
--- fwupd-tests-2.0.7-alt1.x86_64.rpm.share 2025-03-27 15:08:39.135210979 +0000
+++ fwupd-tests-2.0.7-alt1.i586.rpm.share 2025-03-27 15:08:39.297212802 +0000
@@ -112,13 +112,2 @@
/usr/share/installed-tests/fwupd/device-tests/wistron-dock-40b7.json 100644 ASCII text
-/usr/share/installed-tests/fwupd/efi 40755 directory
-/usr/share/installed-tests/fwupd/efi/esrt 40755 directory
-/usr/share/installed-tests/fwupd/efi/esrt/entries 40755 directory
-/usr/share/installed-tests/fwupd/efi/esrt/entries/entry0 40755 directory
-/usr/share/installed-tests/fwupd/efi/esrt/entries/entry0/capsule_flags 100644 ASCII text
-/usr/share/installed-tests/fwupd/efi/esrt/entries/entry0/fw_class 100644 ASCII text
-/usr/share/installed-tests/fwupd/efi/esrt/entries/entry0/fw_type 100644 ASCII text
-/usr/share/installed-tests/fwupd/efi/esrt/entries/entry0/fw_version 100644 ASCII text
-/usr/share/installed-tests/fwupd/efi/esrt/entries/entry0/last_attempt_status 100644 ASCII text
-/usr/share/installed-tests/fwupd/efi/esrt/entries/entry0/last_attempt_version 100644 ASCII text
-/usr/share/installed-tests/fwupd/efi/esrt/entries/entry0/lowest_supported_fw_version 100644 ASCII text
/usr/share/installed-tests/fwupd/enumeration-data 40755 directory
warning (#500): non-identical /usr/share part
--- fwupd-tests-2.0.7-alt1.x86_64.rpm.share 2025-03-27 15:08:41.545238100 +0000
+++ fwupd-tests-2.0.7-alt1.aarch64.rpm.share 2025-03-27 15:08:41.690239732 +0000
@@ -14,3 +14,2 @@
/usr/share/installed-tests/fwupd/device-tests/amd-dgpu.json 100644 ASCII text
-/usr/share/installed-tests/fwupd/device-tests/amd-pmc.json 100644 ASCII text
/usr/share/installed-tests/fwupd/device-tests/analogix-anx7518.json 100644 ASCII text
@@ -22,3 +21,2 @@
/usr/share/installed-tests/fwupd/device-tests/caldigit-element.json 100644 ASCII text
-/usr/share/installed-tests/fwupd/device-tests/caldigit-ts4-tbt.json 100644 ASCII text
/usr/share/installed-tests/fwupd/device-tests/caldigit-ts4.json 100644 ASCII text
@@ -105,3 +103,2 @@
/usr/share/installed-tests/fwupd/device-tests/uefi-dbx.json 100644 ASCII text
-/usr/share/installed-tests/fwupd/device-tests/uefi-pk.json 100644 ASCII text
/usr/share/installed-tests/fwupd/device-tests/ugreen-cm260.json 100644 ASCII text
@@ -126,3 +123,2 @@
/usr/share/installed-tests/fwupd/enumeration-data/amd-dgpu-setup.json 100644 ASCII text
-/usr/share/installed-tests/fwupd/enumeration-data/amd-pmc-setup.json 100644 ASCII text
/usr/share/installed-tests/fwupd/enumeration-data/asus-hid-setup.json 100644 ASCII text
@@ -152,3 +148,2 @@
/usr/share/installed-tests/fwupd/enumeration-data/synaptics-panamera-setup.json 100644 ASCII text
-/usr/share/installed-tests/fwupd/enumeration-data/uefi-pk-setup.json 100644 ASCII text, with very long lines
/usr/share/installed-tests/fwupd/enumeration-data/wacom-movink-13-setup.json 100644 ASCII text, with very long lines
@@ -262,9 +257,2 @@
/usr/share/installed-tests/fwupd/tests/elf.builder.xml 100644 ASCII text
-/usr/share/installed-tests/fwupd/tests/empty_pcr 40755 directory
-/usr/share/installed-tests/fwupd/tests/empty_pcr/tpm0 40755 directory
-/usr/share/installed-tests/fwupd/tests/empty_pcr/tpm0/active 100644 ASCII text
-/usr/share/installed-tests/fwupd/tests/empty_pcr/tpm0/caps 100644 ASCII text
-/usr/share/installed-tests/fwupd/tests/empty_pcr/tpm0/enabled 100644 ASCII text
-/usr/share/installed-tests/fwupd/tests/empty_pcr/tpm0/owned 100644 ASCII text
-/usr/share/installed-tests/fwupd/tests/empty_pcr/tpm0/pcrs 100644 ASCII text
/usr/share/installed-tests/fwupd/tests/fdt.builder.xml 100644 ASCII text
@@ -311,8 +299,2 @@
/usr/share/installed-tests/fwupd/tests/sys_vendor 100644 ASCII text
-/usr/share/installed-tests/fwupd/tests/tpm0 40755 directory
-/usr/share/installed-tests/fwupd/tests/tpm0/active 100644 ASCII text
-/usr/share/installed-tests/fwupd/tests/tpm0/caps 100644 ASCII text
-/usr/share/installed-tests/fwupd/tests/tpm0/enabled 100644 ASCII text
-/usr/share/installed-tests/fwupd/tests/tpm0/owned 100644 ASCII text
-/usr/share/installed-tests/fwupd/tests/tpm0/pcrs 100644 ASCII text
/usr/share/installed-tests/fwupd/tests/uf2.builder.xml 100644 ASCII HTML document text
warning (#500): non-identical /usr/share part
--- fwupd-2.0.7-alt1.i586.rpm.share 2025-03-27 15:08:42.059243885 +0000
+++ fwupd-2.0.7-alt1.aarch64.rpm.share 2025-03-27 15:08:42.061243907 +0000
@@ -23,2 +23,3 @@
/usr/share/fwupd/simple_client.py 100755 python3 script text executable
+/usr/share/fwupd/uefi-capsule-ux.tar.xz 100644 xz compressed data
/usr/share/icons/hicolor/128x128/apps/org.freedesktop.fwupd.png 100644 PNG image, non-interlaced
warning (#500): non-identical /usr/share part
--- fwupd-tests-2.0.7-alt1.i586.rpm.share 2025-03-27 15:08:42.084244166 +0000
+++ fwupd-tests-2.0.7-alt1.aarch64.rpm.share 2025-03-27 15:08:42.087244200 +0000
@@ -14,3 +14,2 @@
/usr/share/installed-tests/fwupd/device-tests/amd-dgpu.json 100644 ASCII text
-/usr/share/installed-tests/fwupd/device-tests/amd-pmc.json 100644 ASCII text
/usr/share/installed-tests/fwupd/device-tests/analogix-anx7518.json 100644 ASCII text
@@ -22,3 +21,2 @@
/usr/share/installed-tests/fwupd/device-tests/caldigit-element.json 100644 ASCII text
-/usr/share/installed-tests/fwupd/device-tests/caldigit-ts4-tbt.json 100644 ASCII text
/usr/share/installed-tests/fwupd/device-tests/caldigit-ts4.json 100644 ASCII text
@@ -105,3 +103,2 @@
/usr/share/installed-tests/fwupd/device-tests/uefi-dbx.json 100644 ASCII text
-/usr/share/installed-tests/fwupd/device-tests/uefi-pk.json 100644 ASCII text
/usr/share/installed-tests/fwupd/device-tests/ugreen-cm260.json 100644 ASCII text
@@ -112,2 +109,13 @@
/usr/share/installed-tests/fwupd/device-tests/wistron-dock-40b7.json 100644 ASCII text
+/usr/share/installed-tests/fwupd/efi 40755 directory
+/usr/share/installed-tests/fwupd/efi/esrt 40755 directory
+/usr/share/installed-tests/fwupd/efi/esrt/entries 40755 directory
+/usr/share/installed-tests/fwupd/efi/esrt/entries/entry0 40755 directory
+/usr/share/installed-tests/fwupd/efi/esrt/entries/entry0/capsule_flags 100644 ASCII text
+/usr/share/installed-tests/fwupd/efi/esrt/entries/entry0/fw_class 100644 ASCII text
+/usr/share/installed-tests/fwupd/efi/esrt/entries/entry0/fw_type 100644 ASCII text
+/usr/share/installed-tests/fwupd/efi/esrt/entries/entry0/fw_version 100644 ASCII text
+/usr/share/installed-tests/fwupd/efi/esrt/entries/entry0/last_attempt_status 100644 ASCII text
+/usr/share/installed-tests/fwupd/efi/esrt/entries/entry0/last_attempt_version 100644 ASCII text
+/usr/share/installed-tests/fwupd/efi/esrt/entries/entry0/lowest_supported_fw_version 100644 ASCII text
/usr/share/installed-tests/fwupd/enumeration-data 40755 directory
@@ -115,3 +123,2 @@
/usr/share/installed-tests/fwupd/enumeration-data/amd-dgpu-setup.json 100644 ASCII text
-/usr/share/installed-tests/fwupd/enumeration-data/amd-pmc-setup.json 100644 ASCII text
/usr/share/installed-tests/fwupd/enumeration-data/asus-hid-setup.json 100644 ASCII text
@@ -141,3 +148,2 @@
/usr/share/installed-tests/fwupd/enumeration-data/synaptics-panamera-setup.json 100644 ASCII text
-/usr/share/installed-tests/fwupd/enumeration-data/uefi-pk-setup.json 100644 ASCII text, with very long lines
/usr/share/installed-tests/fwupd/enumeration-data/wacom-movink-13-setup.json 100644 ASCII text, with very long lines
@@ -251,9 +257,2 @@
/usr/share/installed-tests/fwupd/tests/elf.builder.xml 100644 ASCII text
-/usr/share/installed-tests/fwupd/tests/empty_pcr 40755 directory
-/usr/share/installed-tests/fwupd/tests/empty_pcr/tpm0 40755 directory
-/usr/share/installed-tests/fwupd/tests/empty_pcr/tpm0/active 100644 ASCII text
-/usr/share/installed-tests/fwupd/tests/empty_pcr/tpm0/caps 100644 ASCII text
-/usr/share/installed-tests/fwupd/tests/empty_pcr/tpm0/enabled 100644 ASCII text
-/usr/share/installed-tests/fwupd/tests/empty_pcr/tpm0/owned 100644 ASCII text
-/usr/share/installed-tests/fwupd/tests/empty_pcr/tpm0/pcrs 100644 ASCII text
/usr/share/installed-tests/fwupd/tests/fdt.builder.xml 100644 ASCII text
@@ -300,8 +299,2 @@
/usr/share/installed-tests/fwupd/tests/sys_vendor 100644 ASCII text
-/usr/share/installed-tests/fwupd/tests/tpm0 40755 directory
-/usr/share/installed-tests/fwupd/tests/tpm0/active 100644 ASCII text
-/usr/share/installed-tests/fwupd/tests/tpm0/caps 100644 ASCII text
-/usr/share/installed-tests/fwupd/tests/tpm0/enabled 100644 ASCII text
-/usr/share/installed-tests/fwupd/tests/tpm0/owned 100644 ASCII text
-/usr/share/installed-tests/fwupd/tests/tpm0/pcrs 100644 ASCII text
/usr/share/installed-tests/fwupd/tests/uf2.builder.xml 100644 ASCII HTML document text
warning (#500): non-identical /usr/share part
2025-Mar-27 15:08:45 :: noarch check OK
2025-Mar-27 15:08:47 :: plan: src +1 -1 =20029, aarch64 +9 -9 =34815, i586 +9 -9 =33686, noarch +1 -1 =21208, x86_64 +9 -9 =35621
#500 fwupd 2.0.6-alt1 -> 2.0.7-alt1
Wed Mar 26 2025 Egor Ignatov <egori@altlinux> 2.0.7-alt1
- 2.0.7
2025-Mar-27 15:09:28 :: patched apt indices
2025-Mar-27 15:09:36 :: created next repo
2025-Mar-27 15:09:46 :: duplicate provides check OK
2025-Mar-27 15:10:23 :: dependencies check OK
2025-Mar-27 15:10:52 :: [x86_64 i586 aarch64] ELF symbols check OK
i586: fwupd=2.0.7-alt1 post-install unowned files:
/usr/lib/systemd/system-shutdown
/usr/share/dbus-1
/usr/share/dbus-1/interfaces
/usr/share/dbus-1/system-services
/usr/share/dbus-1/system.d
/usr/share/fish
/usr/share/fish/vendor_completions.d
/usr/share/icons/hicolor/128x128
/usr/share/icons/hicolor/128x128/apps
/usr/share/icons/hicolor/64x64
/usr/share/icons/hicolor/64x64/apps
/usr/share/icons/hicolor/scalable
/usr/share/icons/hicolor/scalable/apps
/usr/share/metainfo
/usr/share/polkit-1
/usr/share/polkit-1/actions
/usr/share/polkit-1/rules.d
2025-Mar-27 15:11:04 :: [i586] #500 fwupd: install check OK (cached)
x86_64: fwupd=2.0.7-alt1 post-install unowned files:
/etc/grub.d
/usr/lib/systemd/system-shutdown
/usr/share/dbus-1
/usr/share/dbus-1/interfaces
/usr/share/dbus-1/system-services
/usr/share/dbus-1/system.d
/usr/share/fish
/usr/share/fish/vendor_completions.d
/usr/share/icons/hicolor/128x128
/usr/share/icons/hicolor/128x128/apps
/usr/share/icons/hicolor/64x64
/usr/share/icons/hicolor/64x64/apps
/usr/share/icons/hicolor/scalable
/usr/share/icons/hicolor/scalable/apps
/usr/share/metainfo
/usr/share/polkit-1
/usr/share/polkit-1/actions
/usr/share/polkit-1/rules.d
2025-Mar-27 15:11:05 :: [x86_64] #500 fwupd: install check OK (cached)
2025-Mar-27 15:11:09 :: [i586] #500 fwupd-debuginfo: install check OK (cached)
2025-Mar-27 15:11:09 :: [x86_64] #500 fwupd-debuginfo: install check OK (cached)
aarch64: fwupd=2.0.7-alt1 post-install unowned files:
/etc/grub.d
/usr/lib/systemd/system-shutdown
/usr/lib/sysusers.d
/usr/share/dbus-1
/usr/share/dbus-1/interfaces
/usr/share/dbus-1/system-services
/usr/share/dbus-1/system.d
/usr/share/fish
/usr/share/fish/vendor_completions.d
/usr/share/icons/hicolor/128x128
/usr/share/icons/hicolor/128x128/apps
/usr/share/icons/hicolor/64x64
/usr/share/icons/hicolor/64x64/apps
/usr/share/icons/hicolor/scalable
/usr/share/icons/hicolor/scalable/apps
/usr/share/metainfo
/usr/share/polkit-1
/usr/share/polkit-1/actions
/usr/share/polkit-1/rules.d
2025-Mar-27 15:11:13 :: [aarch64] #500 fwupd: install check OK (cached)
2025-Mar-27 15:11:13 :: [i586] #500 fwupd-plugin-modem-manager: install check OK (cached)
2025-Mar-27 15:11:14 :: [x86_64] #500 fwupd-plugin-modem-manager: install check OK (cached)
2025-Mar-27 15:11:18 :: [i586] #500 fwupd-plugin-modem-manager-debuginfo: install check OK (cached)
2025-Mar-27 15:11:19 :: [x86_64] #500 fwupd-plugin-modem-manager-debuginfo: install check OK (cached)
2025-Mar-27 15:11:21 :: [aarch64] #500 fwupd-debuginfo: install check OK (cached)
i586: fwupd-tests=2.0.7-alt1 post-install unowned files:
/usr/libexec/installed-tests
/usr/share/installed-tests
2025-Mar-27 15:11:22 :: [i586] #500 fwupd-tests: install check OK (cached)
x86_64: fwupd-tests=2.0.7-alt1 post-install unowned files:
/usr/libexec/installed-tests
/usr/share/installed-tests
2025-Mar-27 15:11:24 :: [x86_64] #500 fwupd-tests: install check OK (cached)
2025-Mar-27 15:11:27 :: [i586] #500 fwupd-tests-debuginfo: install check OK (cached)
2025-Mar-27 15:11:28 :: [x86_64] #500 fwupd-tests-debuginfo: install check OK (cached)
2025-Mar-27 15:11:29 :: [aarch64] #500 fwupd-plugin-modem-manager: install check OK (cached)
2025-Mar-27 15:11:31 :: [i586] #500 libfwupd-devel: install check OK (cached)
2025-Mar-27 15:11:33 :: [x86_64] #500 libfwupd-devel: install check OK (cached)
2025-Mar-27 15:11:35 :: [i586] #500 libfwupd-devel-docs: install check OK (cached)
2025-Mar-27 15:11:37 :: [aarch64] #500 fwupd-plugin-modem-manager-debuginfo: install check OK (cached)
2025-Mar-27 15:11:37 :: [x86_64] #500 libfwupd-devel-docs: install check OK (cached)
2025-Mar-27 15:11:39 :: [i586] #500 libfwupd3: install check OK (cached)
2025-Mar-27 15:11:42 :: [x86_64] #500 libfwupd3: install check OK (cached)
2025-Mar-27 15:11:44 :: [i586] #500 libfwupd3-debuginfo: install check OK (cached)
aarch64: fwupd-tests=2.0.7-alt1 post-install unowned files:
/usr/libexec/installed-tests
/usr/share/installed-tests
2025-Mar-27 15:11:45 :: [aarch64] #500 fwupd-tests: install check OK (cached)
2025-Mar-27 15:11:46 :: [x86_64] #500 libfwupd3-debuginfo: install check OK (cached)
2025-Mar-27 15:11:54 :: [aarch64] #500 fwupd-tests-debuginfo: install check OK (cached)
2025-Mar-27 15:12:01 :: [aarch64] #500 libfwupd-devel: install check OK (cached)
2025-Mar-27 15:12:09 :: [aarch64] #500 libfwupd-devel-docs: install check OK (cached)
2025-Mar-27 15:12:17 :: [aarch64] #500 libfwupd3: install check OK (cached)
2025-Mar-27 15:12:25 :: [aarch64] #500 libfwupd3-debuginfo: install check OK (cached)
2025-Mar-27 15:12:26 :: [x86_64-i586] plan: #0 +4 -4 =11597
2025-Mar-27 15:12:41 :: [x86_64-i586] generated apt indices
2025-Mar-27 15:12:43 :: [x86_64-i586] created next repo
2025-Mar-27 15:12:53 :: [x86_64-i586] dependencies check OK
2025-Mar-27 15:12:54 :: gears inheritance check OK
2025-Mar-27 15:12:54 :: srpm inheritance check OK
girar-check-perms: access to fwupd ALLOWED for egori: approved builder
check-subtask-perms: #500: fwupd: allowed for egori
2025-Mar-27 15:12:55 :: acl check OK
2025-Mar-27 15:13:17 :: created contents_index files
2025-Mar-27 15:13:24 :: created hash files: aarch64 i586 noarch src x86_64-i586 x86_64
2025-Mar-27 15:13:28 :: task #379273 for sisyphus TESTED
2025-Mar-27 15:13:28 :: task is ready for commit
2025-Mar-27 15:13:33 :: repo clone OK
2025-Mar-27 15:13:33 :: packages update OK
2025-Mar-27 15:13:44 :: [x86_64 i586 aarch64 noarch] update OK
2025-Mar-27 15:13:44 :: [x86_64-i586] update OK
2025-Mar-27 15:13:44 :: repo update OK
2025-Mar-27 15:13:57 :: repo save OK
2025-Mar-27 15:13:57 :: src index update OK
2025-Mar-27 15:13:58 :: updated /gears/f/fwupd.git branch `sisyphus'
2025-Mar-27 15:14:02 :: gears update OK
2025-Mar-27 15:14:02 :: task #379273 for sisyphus DONE
^ permalink raw reply [flat|nested] 5+ messages in thread
end of thread, other threads:[~2025-03-27 15:14 UTC | newest]
Thread overview: 5+ messages (download: mbox.gz / follow: Atom feed)
-- links below jump to the message on this page --
2025-03-26 6:32 [#379273] [test-only] FAILED fwupd.git=2.0.7-alt1 Girar awaiter (egori)
2025-03-26 7:39 ` [#379273] [test-only] FAILED (try 2) fwupd.git=2.0.7-alt1 Girar awaiter (egori)
2025-03-26 12:04 ` [#379273] [test-only] FAILED (try 3) fwupd-efi.git=1.7-alt2 fwupd.git=2.0.7-alt1 Girar awaiter (egori)
2025-03-27 8:23 ` [#379273] TESTED (try 4) fwupd.git=2.0.7-alt1 Girar awaiter (egori)
2025-03-27 15:14 ` [#379273] DONE (try 5) fwupd.git=2.0.7-alt1 Girar pender (egori)
ALT Linux Girar Builder robot reports
This inbox may be cloned and mirrored by anyone:
git clone --mirror http://lore.altlinux.org/sisyphus-incominger/0 sisyphus-incominger/git/0.git
# If you have public-inbox 1.1+ installed, you may
# initialize and index your mirror using the following commands:
public-inbox-init -V2 sisyphus-incominger sisyphus-incominger/ http://lore.altlinux.org/sisyphus-incominger \
sisyphus-incominger@lists.altlinux.org sisyphus-incominger@lists.altlinux.ru sisyphus-incominger@lists.altlinux.com
public-inbox-index sisyphus-incominger
Example config snippet for mirrors.
Newsgroup available over NNTP:
nntp://lore.altlinux.org/org.altlinux.lists.sisyphus-incominger
AGPL code for this site: git clone https://public-inbox.org/public-inbox.git