* [#379263] p11 FAILED pcs.git=0.11.6-alt2
@ 2025-03-25 21:22 Girar awaiter (sin)
2025-03-25 21:25 ` [#379263] p11 FAILED (try 2) gem-puma.git=6.6.0-alt1 pcs.git=0.11.6-alt2 Girar awaiter (sin)
` (4 more replies)
0 siblings, 5 replies; 6+ messages in thread
From: Girar awaiter (sin) @ 2025-03-25 21:22 UTC (permalink / raw)
To: Evgeny Sinelnikov
Cc: sisyphus-incominger, girar-builder-p11, girar-builder-p11
https://git.altlinux.org/tasks/379263/logs/events.1.1.log
https://packages.altlinux.org/tasks/379263
subtask name aarch64 i586 x86_64
#100 pcs 1:42 1:10 1:06
2025-Mar-25 21:18:58 :: task #379263 for p11 started by sin:
2025-Mar-25 21:18:58 :: message: fix_regression
#100 build 0.11.6-alt2 from /gears/p/pcs.git fetched at 2025-Mar-25 21:18:32 from sisyphus
2025-Mar-25 21:19:00 :: [i586] #100 pcs.git 0.11.6-alt2: build start
2025-Mar-25 21:19:00 :: [aarch64] #100 pcs.git 0.11.6-alt2: build start
2025-Mar-25 21:19:00 :: [x86_64] #100 pcs.git 0.11.6-alt2: build start
2025-Mar-25 21:20:06 :: [x86_64] #100 pcs.git 0.11.6-alt2: build OK
2025-Mar-25 21:20:10 :: [i586] #100 pcs.git 0.11.6-alt2: build OK
2025-Mar-25 21:20:42 :: [aarch64] #100 pcs.git 0.11.6-alt2: build OK
2025-Mar-25 21:20:54 :: #100: pcs.git 0.11.6-alt2: build check OK
2025-Mar-25 21:20:55 :: build check OK
2025-Mar-25 21:20:59 :: noarch check OK
2025-Mar-25 21:21:00 :: plan: src +1 -1 =19592, aarch64 +2 -2 =34018, i586 +2 -2 =33169, noarch +1 -1 =20456, x86_64 +2 -2 =34795
#100 pcs 0.11.6-alt1 -> 1:0.11.6-alt2
Tue Oct 08 2024 Pavel Skrylev <majioa@altlinux> 1:0.11.6-alt2
- ! fixed rack/handler for new rack 3.x (closes #51647)
2025-Mar-25 21:21:01 :: pcs: closes bugs: 51647
2025-Mar-25 21:21:40 :: patched apt indices
2025-Mar-25 21:21:49 :: created next repo
2025-Mar-25 21:21:59 :: duplicate provides check OK
x86_64: NEW unmet dependencies detected:
pcs#1:0.11.6-alt2:p11+379263.100.1.1@1742937602 gem(puma) >= 6.0
i586: NEW unmet dependencies detected:
pcs#1:0.11.6-alt2:p11+379263.100.1.1@1742937606 gem(puma) >= 6.0
aarch64: NEW unmet dependencies detected:
pcs#1:0.11.6-alt2:p11+379263.100.1.1@1742937635 gem(puma) >= 6.0
ACLs of affected packages (1):
pcs
2025-Mar-25 21:22:37 :: unmets: x86_64 +1 -0 =1, i586 +1 -0 =1, aarch64 +1 -0 =4
2025-Mar-25 21:22:38 :: dependencies check FAILED
2025-Mar-25 21:22:38 :: task #379263 for p11 FAILED
^ permalink raw reply [flat|nested] 6+ messages in thread
* [#379263] p11 FAILED (try 2) gem-puma.git=6.6.0-alt1 pcs.git=0.11.6-alt2
2025-03-25 21:22 [#379263] p11 FAILED pcs.git=0.11.6-alt2 Girar awaiter (sin)
@ 2025-03-25 21:25 ` Girar awaiter (sin)
2025-03-25 21:35 ` [#379263] p11 FAILED (try 3) gem-concurrent-ruby.git=1.3.5-alt1 gem-puma.git=6.6.0-alt1 Girar awaiter (sin)
` (3 subsequent siblings)
4 siblings, 0 replies; 6+ messages in thread
From: Girar awaiter (sin) @ 2025-03-25 21:25 UTC (permalink / raw)
To: Evgeny Sinelnikov
Cc: sisyphus-incominger, girar-builder-p11, girar-builder-p11
https://git.altlinux.org/tasks/379263/logs/events.2.1.log
https://packages.altlinux.org/tasks/379263
subtask name aarch64 i586 x86_64
#40 gem-puma failed failed failed
2025-Mar-25 21:25:20 :: task #379263 for p11 resumed by sin:
2025-Mar-25 21:25:20 :: message: fix_regression
#40 build 6.6.0-alt1 from /gears/g/gem-puma.git fetched at 2025-Mar-25 21:25:11 from sisyphus
#100 build 0.11.6-alt2 from /gears/p/pcs.git fetched at 2025-Mar-25 21:18:32 from sisyphus
2025-Mar-25 21:25:21 :: created build repo
2025-Mar-25 21:25:22 :: [aarch64] #40 gem-puma.git 6.6.0-alt1: build start
2025-Mar-25 21:25:22 :: [i586] #40 gem-puma.git 6.6.0-alt1: build start
2025-Mar-25 21:25:22 :: [x86_64] #40 gem-puma.git 6.6.0-alt1: build start
[i586] <13>Mar 25 21:25:35 rpmi: libruby-3.1.4-alt4.4 sisyphus+344821.44.45.2 1715887288 installed
[i586] <13>Mar 25 21:25:35 rpmi: libruby-devel-3.1.4-alt4.4 sisyphus+344821.44.45.2 1715887288 installed
[i586] <13>Mar 25 21:25:35 rpmi: rpm-macros-ruby-1:3.1.4-alt4.4 sisyphus+344821.44.45.2 1715887288 installed
[i586] <13>Mar 25 21:25:35 rpmi: libyaml2-0.2.5-alt1 sisyphus+278391.100.1.1 1626094932 installed
[i586] <13>Mar 25 21:25:35 rpmi: libncurses6-6.3.20220618-alt4 sisyphus+327286.4600.14.1 1711486782 installed
[i586] <13>Mar 25 21:25:35 rpmi: openssl-config-3.2.0-alt1 p11+370688.200.3.1 1738846989 installed
[i586] <13>Mar 25 21:25:35 rpmi: chrpath-0.16-alt1 sisyphus+346101.200.3.1 1716459476 installed
[i586] <13>Mar 25 21:25:35 rpmi: setup-rb-5.999.6-alt10 sisyphus+342746.62.8.1 1710630324 installed
[i586] <13>Mar 25 21:25:35 rpmi: gem-setup-5.999.6-alt10 sisyphus+342746.62.8.1 1710630324 installed
[i586] <13>Mar 25 21:25:35 rpmi: libp11-kit-1:0.25.5-alt1 p11+352554.100.2.1 1721826049 installed
[i586] <13>Mar 25 21:25:35 rpmi: libtasn1-4.20.0-alt1 p11+374933.100.1.1 1739641427 installed
[i586] <13>Mar 25 21:25:35 rpmi: rpm-macros-alternatives-0.5.3-alt1 p11+371884.100.2.1 1738152096 installed
[i586] <13>Mar 25 21:25:35 rpmi: alternatives-0.5.3-alt1 p11+371884.100.2.1 1738152096 installed
[i586] <13>Mar 25 21:25:35 rpmi: ca-certificates-2024.12.10-alt1 p11+371739.200.1.1 1737807628 installed
[i586] <13>Mar 25 21:25:35 rpmi: ca-trust-0.2.0-alt1 sisyphus+344843.100.1.1 1712743326 installed
[i586] <13>Mar 25 21:25:35 rpmi: p11-kit-trust-1:0.25.5-alt1 p11+352554.100.2.1 1721826049 installed
[i586] <13>Mar 25 21:25:36 rpmi: libcrypto3-3.3.3-alt1 p11+374399.100.2.1 1739522622 installed
[i586] <13>Mar 25 21:25:36 rpmi: libssl3-3.3.3-alt1 p11+374399.100.2.1 1739522622 installed
[i586] <86>Mar 25 21:25:36 groupadd[1793404]: group added to /etc/group: name=ruby, GID=999
[i586] <86>Mar 25 21:25:36 groupadd[1793404]: group added to /etc/gshadow: name=ruby
[i586] <86>Mar 25 21:25:36 groupadd[1793404]: new group: name=ruby, GID=999
[i586] <86>Mar 25 21:25:36 usermod[1793410]: add 'root' to group 'ruby'
[i586] <86>Mar 25 21:25:36 usermod[1793410]: add 'root' to shadow group 'ruby'
[i586] <13>Mar 25 21:25:36 rpmi: ruby-3.1.4-alt4.4 sisyphus+344821.44.45.2 1715887288 installed
[i586] NOTE: to make the environment variable changes come into effect, please relogin the terminal session
[i586] <13>Mar 25 21:25:36 rpmi: ruby-stdlibs-3.1.4-alt4.4 sisyphus+344821.44.45.2 1715887288 installed
[i586] <13>Mar 25 21:25:36 rpmi: gem-rake-13.1.0-alt1.1 sisyphus+343176.100.1.1 1710938591 installed
[i586] <13>Mar 25 21:25:36 rpmi: rake-13.1.0-alt1.1 sisyphus+343176.100.1.1 1710938591 installed
[i586] <13>Mar 25 21:25:36 rpmi: rpm-build-ruby-1:1.1.1-alt1 sisyphus+334339.50.37.1 1702423926 installed
[i586] Reading Package Lists...
[i586] Building Dependency Tree...
[i586] rpm-build-ruby is already the newest version.
[i586] E: Version >='1.3' for 'gem(concurrent-ruby)' was not found
[i586] hsh-install: Failed to calculate package file list.
[i586] hsh-install: Failed to generate package file list.
2025-Mar-25 21:25:37 :: [i586] gem-puma.git 6.6.0-alt1: remote: cannot build src.rpm
2025-Mar-25 21:25:37 :: [i586] #40 gem-puma.git 6.6.0-alt1: build FAILED
2025-Mar-25 21:25:37 :: [i586] requesting cancellation of task processing
[x86_64] <13>Mar 25 21:25:36 rpmi: libruby-3.1.4-alt4.4 sisyphus+344821.44.45.2 1715887248 installed
[x86_64] <13>Mar 25 21:25:36 rpmi: libruby-devel-3.1.4-alt4.4 sisyphus+344821.44.45.2 1715887248 installed
[x86_64] <13>Mar 25 21:25:36 rpmi: rpm-macros-ruby-1:3.1.4-alt4.4 sisyphus+344821.44.45.2 1715887248 installed
[x86_64] <13>Mar 25 21:25:36 rpmi: libyaml2-0.2.5-alt1 sisyphus+278391.100.1.1 1626094928 installed
[x86_64] <13>Mar 25 21:25:36 rpmi: libncurses6-6.3.20220618-alt4 sisyphus+327286.4600.14.1 1711486705 installed
[x86_64] <13>Mar 25 21:25:36 rpmi: openssl-config-3.2.0-alt1 p11+370688.200.3.1 1738846989 installed
[x86_64] <13>Mar 25 21:25:36 rpmi: chrpath-0.16-alt1 sisyphus+346101.200.3.1 1716459476 installed
[x86_64] <13>Mar 25 21:25:36 rpmi: setup-rb-5.999.6-alt10 sisyphus+342746.62.8.1 1710630324 installed
[x86_64] <13>Mar 25 21:25:36 rpmi: gem-setup-5.999.6-alt10 sisyphus+342746.62.8.1 1710630324 installed
[x86_64] <13>Mar 25 21:25:36 rpmi: libp11-kit-1:0.25.5-alt1 p11+352554.100.2.1 1721826035 installed
[x86_64] <13>Mar 25 21:25:36 rpmi: libtasn1-4.20.0-alt1 p11+374933.100.1.1 1739641422 installed
[x86_64] <13>Mar 25 21:25:36 rpmi: rpm-macros-alternatives-0.5.3-alt1 p11+371884.100.2.1 1738152096 installed
[x86_64] <13>Mar 25 21:25:36 rpmi: alternatives-0.5.3-alt1 p11+371884.100.2.1 1738152096 installed
[x86_64] <13>Mar 25 21:25:36 rpmi: ca-certificates-2024.12.10-alt1 p11+371739.200.1.1 1737807628 installed
[x86_64] <13>Mar 25 21:25:36 rpmi: ca-trust-0.2.0-alt1 sisyphus+344843.100.1.1 1712743326 installed
[x86_64] <13>Mar 25 21:25:36 rpmi: p11-kit-trust-1:0.25.5-alt1 p11+352554.100.2.1 1721826035 installed
[x86_64] <13>Mar 25 21:25:36 rpmi: libcrypto3-3.3.3-alt1 p11+374399.100.2.1 1739522329 installed
[x86_64] <13>Mar 25 21:25:36 rpmi: libssl3-3.3.3-alt1 p11+374399.100.2.1 1739522329 installed
[x86_64] <86>Mar 25 21:25:36 groupadd[2092126]: group added to /etc/group: name=ruby, GID=999
[x86_64] <86>Mar 25 21:25:36 groupadd[2092126]: group added to /etc/gshadow: name=ruby
[x86_64] <86>Mar 25 21:25:36 groupadd[2092126]: new group: name=ruby, GID=999
[x86_64] <86>Mar 25 21:25:36 usermod[2092132]: add 'root' to group 'ruby'
[x86_64] <13>Mar 25 21:25:36 rpmi: ruby-3.1.4-alt4.4 sisyphus+344821.44.45.2 1715887248 installed
[x86_64] NOTE: to make the environment variable changes come into effect, please relogin the terminal session
[x86_64] <13>Mar 25 21:25:36 rpmi: ruby-stdlibs-3.1.4-alt4.4 sisyphus+344821.44.45.2 1715887248 installed
[x86_64] <13>Mar 25 21:25:36 rpmi: gem-rake-13.1.0-alt1.1 sisyphus+343176.100.1.1 1710938591 installed
[x86_64] <13>Mar 25 21:25:36 rpmi: rake-13.1.0-alt1.1 sisyphus+343176.100.1.1 1710938591 installed
[x86_64] <13>Mar 25 21:25:36 rpmi: rpm-build-ruby-1:1.1.1-alt1 sisyphus+334339.50.37.1 1702423926 installed
[x86_64] Reading Package Lists...
[x86_64] Building Dependency Tree...
[x86_64] rpm-build-ruby is already the newest version.
[x86_64] E: Version >='1.3' for 'gem(concurrent-ruby)' was not found
[x86_64] hsh-install: Failed to calculate package file list.
[x86_64] hsh-install: Failed to generate package file list.
2025-Mar-25 21:25:37 :: [x86_64] gem-puma.git 6.6.0-alt1: remote: cannot build src.rpm
2025-Mar-25 21:25:37 :: [x86_64] #40 gem-puma.git 6.6.0-alt1: build FAILED
[aarch64] <13>Mar 25 21:25:46 rpmi: libruby-3.1.4-alt4.4 sisyphus+344821.44.45.2 1715887956 installed
[aarch64] <13>Mar 25 21:25:46 rpmi: libruby-devel-3.1.4-alt4.4 sisyphus+344821.44.45.2 1715887956 installed
[aarch64] <13>Mar 25 21:25:46 rpmi: rpm-macros-ruby-1:3.1.4-alt4.4 sisyphus+344821.44.45.2 1715887956 installed
[aarch64] <13>Mar 25 21:25:46 rpmi: libyaml2-0.2.5-alt1 sisyphus+278391.100.1.1 1626094930 installed
[aarch64] <13>Mar 25 21:25:46 rpmi: libncurses6-6.3.20220618-alt4 sisyphus+327286.4600.14.1 1711487513 installed
[aarch64] <13>Mar 25 21:25:46 rpmi: openssl-config-3.2.0-alt1 p11+370688.200.3.1 1738846989 installed
[aarch64] <13>Mar 25 21:25:46 rpmi: chrpath-0.16-alt1 sisyphus+346101.200.3.1 1716459483 installed
[aarch64] <13>Mar 25 21:25:46 rpmi: setup-rb-5.999.6-alt10 sisyphus+342746.62.8.1 1710630324 installed
[aarch64] <13>Mar 25 21:25:46 rpmi: gem-setup-5.999.6-alt10 sisyphus+342746.62.8.1 1710630324 installed
[aarch64] <13>Mar 25 21:25:46 rpmi: libp11-kit-1:0.25.5-alt1 p11+352554.100.2.1 1721826177 installed
[aarch64] <13>Mar 25 21:25:46 rpmi: libtasn1-4.20.0-alt1 p11+374933.100.1.1 1739641456 installed
[aarch64] <13>Mar 25 21:25:46 rpmi: rpm-macros-alternatives-0.5.3-alt1 p11+371884.100.2.1 1738152096 installed
[aarch64] <13>Mar 25 21:25:46 rpmi: alternatives-0.5.3-alt1 p11+371884.100.2.1 1738152096 installed
[aarch64] <13>Mar 25 21:25:46 rpmi: ca-certificates-2024.12.10-alt1 p11+371739.200.1.1 1737807628 installed
[aarch64] <13>Mar 25 21:25:46 rpmi: ca-trust-0.2.0-alt1 sisyphus+344843.100.1.1 1712743326 installed
[aarch64] <13>Mar 25 21:25:47 rpmi: p11-kit-trust-1:0.25.5-alt1 p11+352554.100.2.1 1721826177 installed
[aarch64] <13>Mar 25 21:25:47 rpmi: libcrypto3-3.3.3-alt1 p11+374399.100.2.1 1739522843 installed
[aarch64] <13>Mar 25 21:25:47 rpmi: libssl3-3.3.3-alt1 p11+374399.100.2.1 1739522843 installed
[aarch64] <86>Mar 25 21:25:47 groupadd[4092592]: group added to /etc/group: name=ruby, GID=999
[aarch64] <86>Mar 25 21:25:47 groupadd[4092592]: group added to /etc/gshadow: name=ruby
[aarch64] <86>Mar 25 21:25:47 groupadd[4092592]: new group: name=ruby, GID=999
[aarch64] <86>Mar 25 21:25:47 usermod[4092598]: add 'root' to group 'ruby'
[aarch64] <86>Mar 25 21:25:47 usermod[4092598]: add 'root' to shadow group 'ruby'
[aarch64] <13>Mar 25 21:25:47 rpmi: ruby-3.1.4-alt4.4 sisyphus+344821.44.45.2 1715887956 installed
[aarch64] NOTE: to make the environment variable changes come into effect, please relogin the terminal session
[aarch64] <13>Mar 25 21:25:47 rpmi: ruby-stdlibs-3.1.4-alt4.4 sisyphus+344821.44.45.2 1715887956 installed
[aarch64] <13>Mar 25 21:25:47 rpmi: gem-rake-13.1.0-alt1.1 sisyphus+343176.100.1.1 1710938591 installed
[aarch64] <13>Mar 25 21:25:47 rpmi: rake-13.1.0-alt1.1 sisyphus+343176.100.1.1 1710938591 installed
[aarch64] <13>Mar 25 21:25:47 rpmi: rpm-build-ruby-1:1.1.1-alt1 sisyphus+334339.50.37.1 1702423926 installed
[aarch64] Reading Package Lists...
[aarch64] Building Dependency Tree...
[aarch64] rpm-build-ruby is already the newest version.
[aarch64] E: Version >='1.3' for 'gem(concurrent-ruby)' was not found
[aarch64] hsh-install: Failed to calculate package file list.
[aarch64] hsh-install: Failed to generate package file list.
2025-Mar-25 21:25:49 :: [aarch64] gem-puma.git 6.6.0-alt1: remote: cannot build src.rpm
2025-Mar-25 21:25:49 :: [aarch64] #40 gem-puma.git 6.6.0-alt1: build FAILED
2025-Mar-25 21:25:37 :: [i586] build FAILED
2025-Mar-25 21:25:37 :: [x86_64] build FAILED
2025-Mar-25 21:25:49 :: [aarch64] build FAILED
2025-Mar-25 21:25:49 :: task #379263 for p11 FAILED
^ permalink raw reply [flat|nested] 6+ messages in thread
* [#379263] p11 FAILED (try 3) gem-concurrent-ruby.git=1.3.5-alt1 gem-puma.git=6.6.0-alt1 ...
2025-03-25 21:22 [#379263] p11 FAILED pcs.git=0.11.6-alt2 Girar awaiter (sin)
2025-03-25 21:25 ` [#379263] p11 FAILED (try 2) gem-puma.git=6.6.0-alt1 pcs.git=0.11.6-alt2 Girar awaiter (sin)
@ 2025-03-25 21:35 ` Girar awaiter (sin)
2025-03-28 21:46 ` [#379263] p11 FAILED (try 4) gem-concurrent-ruby.git=1.3.5-alt1 gem-puma-worker-killer.git=1.0.0-alt1 Girar awaiter (sin)
` (2 subsequent siblings)
4 siblings, 0 replies; 6+ messages in thread
From: Girar awaiter (sin) @ 2025-03-25 21:35 UTC (permalink / raw)
To: Evgeny Sinelnikov
Cc: sisyphus-incominger, girar-builder-p11, girar-builder-p11
https://git.altlinux.org/tasks/379263/logs/events.3.1.log
https://packages.altlinux.org/tasks/379263
subtask name aarch64 i586 x86_64
#20 gem-concurrent-ruby 1:36 1:04 1:01
#40 gem-puma ? failed failed
2025-Mar-25 21:34:15 :: task #379263 for p11 resumed by sin:
2025-Mar-25 21:34:15 :: message: fix_regression
#20 build 1.3.5-alt1 from /gears/g/gem-concurrent-ruby.git fetched at 2025-Mar-25 21:34:04 from sisyphus
#40 build 6.6.0-alt1 from /gears/g/gem-puma.git fetched at 2025-Mar-25 21:25:11 from sisyphus
#100 build 0.11.6-alt2 from /gears/p/pcs.git fetched at 2025-Mar-25 21:18:32 from sisyphus
2025-Mar-25 21:34:16 :: created build repo
2025-Mar-25 21:34:17 :: [i586] #20 gem-concurrent-ruby.git 1.3.5-alt1: build start
2025-Mar-25 21:34:17 :: [x86_64] #20 gem-concurrent-ruby.git 1.3.5-alt1: build start
2025-Mar-25 21:34:17 :: [aarch64] #20 gem-concurrent-ruby.git 1.3.5-alt1: build start
2025-Mar-25 21:35:18 :: [x86_64] #20 gem-concurrent-ruby.git 1.3.5-alt1: build OK
2025-Mar-25 21:35:19 :: [x86_64] #40 gem-puma.git 6.6.0-alt1: build start
2025-Mar-25 21:35:21 :: [i586] #20 gem-concurrent-ruby.git 1.3.5-alt1: build OK
2025-Mar-25 21:35:21 :: [i586] #40 gem-puma.git 6.6.0-alt1: build start
[x86_64] <13>Mar 25 21:35:31 rpmi: libruby-3.1.4-alt4.4 sisyphus+344821.44.45.2 1715887248 installed
[x86_64] <13>Mar 25 21:35:31 rpmi: libruby-devel-3.1.4-alt4.4 sisyphus+344821.44.45.2 1715887248 installed
[x86_64] <13>Mar 25 21:35:31 rpmi: rpm-macros-ruby-1:3.1.4-alt4.4 sisyphus+344821.44.45.2 1715887248 installed
[x86_64] <13>Mar 25 21:35:31 rpmi: libyaml2-0.2.5-alt1 sisyphus+278391.100.1.1 1626094928 installed
[x86_64] <13>Mar 25 21:35:31 rpmi: libncurses6-6.3.20220618-alt4 sisyphus+327286.4600.14.1 1711486705 installed
[x86_64] <13>Mar 25 21:35:31 rpmi: openssl-config-3.2.0-alt1 p11+370688.200.3.1 1738846989 installed
[x86_64] <13>Mar 25 21:35:31 rpmi: chrpath-0.16-alt1 sisyphus+346101.200.3.1 1716459476 installed
[x86_64] <13>Mar 25 21:35:31 rpmi: setup-rb-5.999.6-alt10 sisyphus+342746.62.8.1 1710630324 installed
[x86_64] <13>Mar 25 21:35:31 rpmi: gem-setup-5.999.6-alt10 sisyphus+342746.62.8.1 1710630324 installed
[x86_64] <13>Mar 25 21:35:31 rpmi: libp11-kit-1:0.25.5-alt1 p11+352554.100.2.1 1721826035 installed
[x86_64] <13>Mar 25 21:35:31 rpmi: libtasn1-4.20.0-alt1 p11+374933.100.1.1 1739641422 installed
[x86_64] <13>Mar 25 21:35:31 rpmi: rpm-macros-alternatives-0.5.3-alt1 p11+371884.100.2.1 1738152096 installed
[x86_64] <13>Mar 25 21:35:31 rpmi: alternatives-0.5.3-alt1 p11+371884.100.2.1 1738152096 installed
[x86_64] <13>Mar 25 21:35:31 rpmi: ca-certificates-2024.12.10-alt1 p11+371739.200.1.1 1737807628 installed
[x86_64] <13>Mar 25 21:35:31 rpmi: ca-trust-0.2.0-alt1 sisyphus+344843.100.1.1 1712743326 installed
[x86_64] <13>Mar 25 21:35:31 rpmi: p11-kit-trust-1:0.25.5-alt1 p11+352554.100.2.1 1721826035 installed
[x86_64] <13>Mar 25 21:35:31 rpmi: libcrypto3-3.3.3-alt1 p11+374399.100.2.1 1739522329 installed
[x86_64] <13>Mar 25 21:35:31 rpmi: libssl3-3.3.3-alt1 p11+374399.100.2.1 1739522329 installed
[x86_64] <86>Mar 25 21:35:31 groupadd[1805068]: group added to /etc/group: name=ruby, GID=999
[x86_64] <86>Mar 25 21:35:31 groupadd[1805068]: group added to /etc/gshadow: name=ruby
[x86_64] <86>Mar 25 21:35:31 groupadd[1805068]: new group: name=ruby, GID=999
[x86_64] <86>Mar 25 21:35:31 usermod[1805074]: add 'root' to group 'ruby'
[x86_64] <13>Mar 25 21:35:31 rpmi: ruby-3.1.4-alt4.4 sisyphus+344821.44.45.2 1715887248 installed
[x86_64] NOTE: to make the environment variable changes come into effect, please relogin the terminal session
[x86_64] <13>Mar 25 21:35:31 rpmi: ruby-stdlibs-3.1.4-alt4.4 sisyphus+344821.44.45.2 1715887248 installed
[x86_64] <13>Mar 25 21:35:31 rpmi: gem-rake-13.1.0-alt1.1 sisyphus+343176.100.1.1 1710938591 installed
[x86_64] <13>Mar 25 21:35:31 rpmi: rake-13.1.0-alt1.1 sisyphus+343176.100.1.1 1710938591 installed
[x86_64] <13>Mar 25 21:35:31 rpmi: rpm-build-ruby-1:1.1.1-alt1 sisyphus+334339.50.37.1 1702423926 installed
[x86_64] Reading Package Lists...
[x86_64] Building Dependency Tree...
[x86_64] MI2a: marked for install (shallow): gem-m
[x86_64] MI2a: satisfying Depends: gem(method_source) >= 0.6.7
[x86_64] MI2a: maybe install (a providing target): gem-method-source 1.0.0-alt1:sisyphus+277150.100.1.1@1625406396
[x86_64] MI2a: target SELECTED: gem-method-source 1.0.0-alt1:sisyphus+277150.100.1.1@1625406396
[x86_64] MI2a: requesting to install gem-method-source (unspec'd ver; inspect with Debug::pkgMark-shallow)
[x86_64] MI2a: marked for install (shallow): gem-method-source
[x86_64] rpm-build-ruby is already the newest version.
[x86_64] Selected version gem-concurrent-ruby#1.3.5-alt1:p11+379263.20.3.1@1742938513 for gem(concurrent-ruby)>=1.3
[x86_64] Selected version gem-localhost#1.1.8-alt1:sisyphus+247085.4200.5.1@1630916315 for gem(localhost)>=0
[x86_64] Selected version gem-m#1.5.1.1-alt0.1:sisyphus+246775.6600.5.1@1630651445 for gem(m)>=0
[x86_64] Selected version gem-minitest#5.18.1-alt1:sisyphus+323401.1400.2.1@1687352748 for gem(minitest)>=5.11
[x86_64] Selected version gem-minitest-proveit#1.0.0-alt1.1:sisyphus+246775.6500.5.1@1630651393 for gem(minitest-proveit)>=0
[x86_64] Selected version gem-minitest-retry#0.2.2.1-alt1:sisyphus+296741.16200.43.1@1666815180 for gem(minitest-retry)>=0
[x86_64] Selected version gem-minitest-stub-const#0.6-alt1:sisyphus+263530.25000.88.5@1629554360 for gem(minitest-stub-const)>=0
[x86_64] E: Couldn't find package gem(puma_worker_killer)>=0
[x86_64] hsh-install: Failed to calculate package file list.
[x86_64] hsh-install: Failed to generate package file list.
2025-Mar-25 21:35:33 :: [x86_64] gem-puma.git 6.6.0-alt1: remote: cannot build src.rpm
2025-Mar-25 21:35:33 :: [x86_64] #40 gem-puma.git 6.6.0-alt1: build FAILED
2025-Mar-25 21:35:33 :: [x86_64] requesting cancellation of task processing
[i586] <13>Mar 25 21:35:33 rpmi: libruby-3.1.4-alt4.4 sisyphus+344821.44.45.2 1715887288 installed
[i586] <13>Mar 25 21:35:33 rpmi: libruby-devel-3.1.4-alt4.4 sisyphus+344821.44.45.2 1715887288 installed
[i586] <13>Mar 25 21:35:33 rpmi: rpm-macros-ruby-1:3.1.4-alt4.4 sisyphus+344821.44.45.2 1715887288 installed
[i586] <13>Mar 25 21:35:33 rpmi: libyaml2-0.2.5-alt1 sisyphus+278391.100.1.1 1626094932 installed
[i586] <13>Mar 25 21:35:34 rpmi: libncurses6-6.3.20220618-alt4 sisyphus+327286.4600.14.1 1711486782 installed
[i586] <13>Mar 25 21:35:34 rpmi: openssl-config-3.2.0-alt1 p11+370688.200.3.1 1738846989 installed
[i586] <13>Mar 25 21:35:34 rpmi: chrpath-0.16-alt1 sisyphus+346101.200.3.1 1716459476 installed
[i586] <13>Mar 25 21:35:34 rpmi: setup-rb-5.999.6-alt10 sisyphus+342746.62.8.1 1710630324 installed
[i586] <13>Mar 25 21:35:34 rpmi: gem-setup-5.999.6-alt10 sisyphus+342746.62.8.1 1710630324 installed
[i586] <13>Mar 25 21:35:34 rpmi: libp11-kit-1:0.25.5-alt1 p11+352554.100.2.1 1721826049 installed
[i586] <13>Mar 25 21:35:34 rpmi: libtasn1-4.20.0-alt1 p11+374933.100.1.1 1739641427 installed
[i586] <13>Mar 25 21:35:34 rpmi: rpm-macros-alternatives-0.5.3-alt1 p11+371884.100.2.1 1738152096 installed
[i586] <13>Mar 25 21:35:34 rpmi: alternatives-0.5.3-alt1 p11+371884.100.2.1 1738152096 installed
[i586] <13>Mar 25 21:35:34 rpmi: ca-certificates-2024.12.10-alt1 p11+371739.200.1.1 1737807628 installed
[i586] <13>Mar 25 21:35:34 rpmi: ca-trust-0.2.0-alt1 sisyphus+344843.100.1.1 1712743326 installed
[i586] <13>Mar 25 21:35:34 rpmi: p11-kit-trust-1:0.25.5-alt1 p11+352554.100.2.1 1721826049 installed
[i586] <13>Mar 25 21:35:34 rpmi: libcrypto3-3.3.3-alt1 p11+374399.100.2.1 1739522622 installed
[i586] <13>Mar 25 21:35:34 rpmi: libssl3-3.3.3-alt1 p11+374399.100.2.1 1739522622 installed
[i586] <86>Mar 25 21:35:34 groupadd[2103790]: group added to /etc/group: name=ruby, GID=999
[i586] <86>Mar 25 21:35:34 groupadd[2103790]: group added to /etc/gshadow: name=ruby
[i586] <86>Mar 25 21:35:34 groupadd[2103790]: new group: name=ruby, GID=999
[i586] <86>Mar 25 21:35:34 usermod[2103796]: add 'root' to group 'ruby'
[i586] <86>Mar 25 21:35:34 usermod[2103796]: add 'root' to shadow group 'ruby'
[i586] <13>Mar 25 21:35:34 rpmi: ruby-3.1.4-alt4.4 sisyphus+344821.44.45.2 1715887288 installed
[i586] NOTE: to make the environment variable changes come into effect, please relogin the terminal session
[i586] <13>Mar 25 21:35:34 rpmi: ruby-stdlibs-3.1.4-alt4.4 sisyphus+344821.44.45.2 1715887288 installed
[i586] <13>Mar 25 21:35:34 rpmi: gem-rake-13.1.0-alt1.1 sisyphus+343176.100.1.1 1710938591 installed
[i586] <13>Mar 25 21:35:34 rpmi: rake-13.1.0-alt1.1 sisyphus+343176.100.1.1 1710938591 installed
[i586] <13>Mar 25 21:35:34 rpmi: rpm-build-ruby-1:1.1.1-alt1 sisyphus+334339.50.37.1 1702423926 installed
[i586] Reading Package Lists...
[i586] Building Dependency Tree...
[i586] MI2a: marked for install (shallow): gem-m
[i586] MI2a: satisfying Depends: gem(method_source) >= 0.6.7
[i586] MI2a: maybe install (a providing target): gem-method-source 1.0.0-alt1:sisyphus+277150.100.1.1@1625406396
[i586] MI2a: target SELECTED: gem-method-source 1.0.0-alt1:sisyphus+277150.100.1.1@1625406396
[i586] MI2a: requesting to install gem-method-source (unspec'd ver; inspect with Debug::pkgMark-shallow)
[i586] MI2a: marked for install (shallow): gem-method-source
[i586] rpm-build-ruby is already the newest version.
[i586] Selected version gem-concurrent-ruby#1.3.5-alt1:p11+379263.20.3.1@1742938516 for gem(concurrent-ruby)>=1.3
[i586] Selected version gem-localhost#1.1.8-alt1:sisyphus+247085.4200.5.1@1630916315 for gem(localhost)>=0
[i586] Selected version gem-m#1.5.1.1-alt0.1:sisyphus+246775.6600.5.1@1630651445 for gem(m)>=0
[i586] Selected version gem-minitest#5.18.1-alt1:sisyphus+323401.1400.2.1@1687352748 for gem(minitest)>=5.11
[i586] Selected version gem-minitest-proveit#1.0.0-alt1.1:sisyphus+246775.6500.5.1@1630651393 for gem(minitest-proveit)>=0
[i586] Selected version gem-minitest-retry#0.2.2.1-alt1:sisyphus+296741.16200.43.1@1666815180 for gem(minitest-retry)>=0
[i586] Selected version gem-minitest-stub-const#0.6-alt1:sisyphus+263530.25000.88.5@1629554360 for gem(minitest-stub-const)>=0
[i586] E: Couldn't find package gem(puma_worker_killer)>=0
[i586] hsh-install: Failed to calculate package file list.
[i586] hsh-install: Failed to generate package file list.
2025-Mar-25 21:35:35 :: [i586] gem-puma.git 6.6.0-alt1: remote: cannot build src.rpm
2025-Mar-25 21:35:35 :: [i586] #40 gem-puma.git 6.6.0-alt1: build FAILED
2025-Mar-25 21:35:53 :: [aarch64] #20 gem-concurrent-ruby.git 1.3.5-alt1: build OK
2025-Mar-25 21:35:53 :: [aarch64] task processing CANCELLED
2025-Mar-25 21:35:33 :: [x86_64] build FAILED
2025-Mar-25 21:35:35 :: [i586] build FAILED
2025-Mar-25 21:35:53 :: [aarch64] build FAILED
2025-Mar-25 21:35:53 :: task #379263 for p11 FAILED
^ permalink raw reply [flat|nested] 6+ messages in thread
* [#379263] p11 FAILED (try 4) gem-concurrent-ruby.git=1.3.5-alt1 gem-puma-worker-killer.git=1.0.0-alt1 ...
2025-03-25 21:22 [#379263] p11 FAILED pcs.git=0.11.6-alt2 Girar awaiter (sin)
2025-03-25 21:25 ` [#379263] p11 FAILED (try 2) gem-puma.git=6.6.0-alt1 pcs.git=0.11.6-alt2 Girar awaiter (sin)
2025-03-25 21:35 ` [#379263] p11 FAILED (try 3) gem-concurrent-ruby.git=1.3.5-alt1 gem-puma.git=6.6.0-alt1 Girar awaiter (sin)
@ 2025-03-28 21:46 ` Girar awaiter (sin)
2025-03-28 22:00 ` [#379263] p11 FAILED (try 5) gem-concurrent-ruby.git=1.3.5-alt1 gem-wait-for-it.git=0.2.1-alt1 Girar awaiter (sin)
2025-03-28 22:09 ` [#379263] p11 FAILED (try 6) " Girar awaiter (sin)
4 siblings, 0 replies; 6+ messages in thread
From: Girar awaiter (sin) @ 2025-03-28 21:46 UTC (permalink / raw)
To: Evgeny Sinelnikov
Cc: sisyphus-incominger, girar-builder-p11, girar-builder-p11
https://git.altlinux.org/tasks/379263/logs/events.4.1.log
https://packages.altlinux.org/tasks/379263
subtask name aarch64 i586 x86_64
#20 gem-concurrent-ruby 1:27 1:00 58
#30 gem-puma-worker-killer ? failed failed
2025-Mar-28 21:45:17 :: task #379263 for p11 resumed by sin:
2025-Mar-28 21:45:17 :: message: fix_regression
#20 build 1.3.5-alt1 from /gears/g/gem-concurrent-ruby.git fetched at 2025-Mar-25 21:34:04 from sisyphus
#30 build 1.0.0-alt1 from /gears/g/gem-puma-worker-killer.git fetched at 2025-Mar-28 21:44:42 from sisyphus
#40 build 6.6.0-alt1 from /gears/g/gem-puma.git fetched at 2025-Mar-25 21:25:11 from sisyphus
#100 build 0.11.6-alt2 from /gears/p/pcs.git fetched at 2025-Mar-25 21:18:32 from sisyphus
2025-Mar-28 21:45:17 :: created build repo
2025-Mar-28 21:45:18 :: [x86_64] #20 gem-concurrent-ruby.git 1.3.5-alt1: build start
2025-Mar-28 21:45:18 :: [i586] #20 gem-concurrent-ruby.git 1.3.5-alt1: build start
2025-Mar-28 21:45:18 :: [aarch64] #20 gem-concurrent-ruby.git 1.3.5-alt1: build start
2025-Mar-28 21:46:16 :: [x86_64] #20 gem-concurrent-ruby.git 1.3.5-alt1: build OK
2025-Mar-28 21:46:16 :: [x86_64] #30 gem-puma-worker-killer.git 1.0.0-alt1: build start
2025-Mar-28 21:46:18 :: [i586] #20 gem-concurrent-ruby.git 1.3.5-alt1: build OK
2025-Mar-28 21:46:19 :: [i586] #30 gem-puma-worker-killer.git 1.0.0-alt1: build start
[x86_64] <13>Mar 28 21:46:29 rpmi: libruby-3.1.4-alt4.4 sisyphus+344821.44.45.2 1715887248 installed
[x86_64] <13>Mar 28 21:46:29 rpmi: libruby-devel-3.1.4-alt4.4 sisyphus+344821.44.45.2 1715887248 installed
[x86_64] <13>Mar 28 21:46:29 rpmi: rpm-macros-ruby-1:3.1.4-alt4.4 sisyphus+344821.44.45.2 1715887248 installed
[x86_64] <13>Mar 28 21:46:29 rpmi: libyaml2-0.2.5-alt1 sisyphus+278391.100.1.1 1626094928 installed
[x86_64] <13>Mar 28 21:46:29 rpmi: libncurses6-6.3.20220618-alt4 sisyphus+327286.4600.14.1 1711486705 installed
[x86_64] <13>Mar 28 21:46:29 rpmi: openssl-config-3.2.0-alt1 p11+370688.200.3.1 1738846989 installed
[x86_64] <13>Mar 28 21:46:29 rpmi: chrpath-0.16-alt1 sisyphus+346101.200.3.1 1716459476 installed
[x86_64] <13>Mar 28 21:46:29 rpmi: setup-rb-5.999.6-alt10 sisyphus+342746.62.8.1 1710630324 installed
[x86_64] <13>Mar 28 21:46:29 rpmi: gem-setup-5.999.6-alt10 sisyphus+342746.62.8.1 1710630324 installed
[x86_64] <13>Mar 28 21:46:29 rpmi: libp11-kit-1:0.25.5-alt1 p11+352554.100.2.1 1721826035 installed
[x86_64] <13>Mar 28 21:46:29 rpmi: libtasn1-4.20.0-alt1 p11+374933.100.1.1 1739641422 installed
[x86_64] <13>Mar 28 21:46:29 rpmi: rpm-macros-alternatives-0.5.3-alt1 p11+371884.100.2.1 1738152096 installed
[x86_64] <13>Mar 28 21:46:29 rpmi: alternatives-0.5.3-alt1 p11+371884.100.2.1 1738152096 installed
[x86_64] <13>Mar 28 21:46:29 rpmi: ca-certificates-2024.12.10-alt1 p11+371739.200.1.1 1737807628 installed
[x86_64] <13>Mar 28 21:46:29 rpmi: ca-trust-0.2.0-alt1 sisyphus+344843.100.1.1 1712743326 installed
[x86_64] <13>Mar 28 21:46:29 rpmi: p11-kit-trust-1:0.25.5-alt1 p11+352554.100.2.1 1721826035 installed
[x86_64] <13>Mar 28 21:46:29 rpmi: libcrypto3-3.3.3-alt1 p11+374399.100.2.1 1739522329 installed
[x86_64] <13>Mar 28 21:46:29 rpmi: libssl3-3.3.3-alt1 p11+374399.100.2.1 1739522329 installed
[x86_64] <86>Mar 28 21:46:29 groupadd[3535197]: group added to /etc/group: name=ruby, GID=999
[x86_64] <86>Mar 28 21:46:29 groupadd[3535197]: group added to /etc/gshadow: name=ruby
[x86_64] <86>Mar 28 21:46:29 groupadd[3535197]: new group: name=ruby, GID=999
[x86_64] <86>Mar 28 21:46:29 usermod[3535203]: add 'root' to group 'ruby'
[x86_64] <13>Mar 28 21:46:29 rpmi: ruby-3.1.4-alt4.4 sisyphus+344821.44.45.2 1715887248 installed
[x86_64] NOTE: to make the environment variable changes come into effect, please relogin the terminal session
[x86_64] <13>Mar 28 21:46:29 rpmi: ruby-stdlibs-3.1.4-alt4.4 sisyphus+344821.44.45.2 1715887248 installed
[x86_64] <13>Mar 28 21:46:29 rpmi: gem-rake-13.1.0-alt1.1 sisyphus+343176.100.1.1 1710938591 installed
[x86_64] <13>Mar 28 21:46:29 rpmi: rake-13.1.0-alt1.1 sisyphus+343176.100.1.1 1710938591 installed
[x86_64] <13>Mar 28 21:46:29 rpmi: rpm-build-ruby-1:1.1.1-alt1 sisyphus+334339.50.37.1 1702423926 installed
[x86_64] Reading Package Lists...
[x86_64] Building Dependency Tree...
[x86_64] MI2a: marked for install (shallow): gem-get-process-mem
[x86_64] MI2a: satisfying Depends: gem(ffi) >= 1.0
[x86_64] MI2a: maybe install (a providing target): gem-ffi 1.17.0-alt2:p11+356670.100.3.1@1728295740
[x86_64] MI2a: target SELECTED: gem-ffi 1.17.0-alt2:p11+356670.100.3.1@1728295740
[x86_64] MI2a: requesting to install gem-ffi (unspec'd ver; inspect with Debug::pkgMark-shallow)
[x86_64] MI2a: marked for install (shallow): gem-ffi
[x86_64] MI2a: marked for install (shallow): gem-puma
[x86_64] MI2a: satisfying Depends: gem(nio4r) < 3
[x86_64] MI2a: maybe install (a providing target): gem-nio4r 2.5.8-alt1:sisyphus+296703.3120.105.2@1663320958
[x86_64] MI2a: target SELECTED: gem-nio4r 2.5.8-alt1:sisyphus+296703.3120.105.2@1663320958
[x86_64] MI2a: requesting to install gem-nio4r (unspec'd ver; inspect with Debug::pkgMark-shallow)
[x86_64] MI2a: marked for install (shallow): gem-nio4r
[x86_64] MI2a: marked for install (shallow): gem-rackup
[x86_64] MI2a: satisfying Depends: gem(webrick) >= 1.8
[x86_64] MI2a: maybe install (a providing target): gem-webrick 1.8.1-alt1:sisyphus+344821.500.45.2@1715887381
[x86_64] MI2a: target SELECTED: gem-webrick 1.8.1-alt1:sisyphus+344821.500.45.2@1715887381
[x86_64] MI2a: requesting to install gem-webrick (unspec'd ver; inspect with Debug::pkgMark-shallow)
[x86_64] MI2a: marked for install (shallow): gem-webrick
[x86_64] MI2a: marked for install (shallow): gem-standard
[x86_64] MI2a: satisfying Depends: gem(rubocop) >= 1.15.0
[x86_64] MI2a: maybe install (a providing target): gem-rubocop 1.63.1-alt1:sisyphus+344821.1700.45.2@1715887703
[x86_64] MI2a: target SELECTED: gem-rubocop 1.63.1-alt1:sisyphus+344821.1700.45.2@1715887703
[x86_64] MI2a: requesting to install gem-rubocop (unspec'd ver; inspect with Debug::pkgMark-shallow)
[x86_64] MI2a: marked for install (shallow): gem-rubocop
[x86_64] MI2a: satisfying Depends: gem(language_server-protocol) >= 3.17.0
[x86_64] MI2a: maybe install (a providing target): gem-language-server-protocol 3.17.0.3-alt1:sisyphus+344821.11100.45.2@1715889413
[x86_64] MI2a: target SELECTED: gem-language-server-protocol 3.17.0.3-alt1:sisyphus+344821.11100.45.2@1715889413
[x86_64] MI2a: requesting to install gem-language-server-protocol (unspec'd ver; inspect with Debug::pkgMark-shallow)
[x86_64] MI2a: marked for install (shallow): gem-language-server-protocol
[x86_64] MI2a: satisfying Depends: gem(parallel) >= 1.10
[x86_64] MI2a: maybe install (a providing target): gem-parallel 1.20.2-alt1:sisyphus+246775.3100.5.1@1630649785
[x86_64] MI2a: target SELECTED: gem-parallel 1.20.2-alt1:sisyphus+246775.3100.5.1@1630649785
[x86_64] MI2a: requesting to install gem-parallel (unspec'd ver; inspect with Debug::pkgMark-shallow)
[x86_64] MI2a: marked for install (shallow): gem-parallel
[x86_64] MI2a: satisfying Depends: gem(parser) >= 3.3.0.2
[x86_64] MI2a: maybe install (a providing target): gem-parser 3.3.0.5-alt1:sisyphus+343529.2100.9.8@1711478421
[x86_64] MI2a: target SELECTED: gem-parser 3.3.0.5-alt1:sisyphus+343529.2100.9.8@1711478421
[x86_64] MI2a: requesting to install gem-parser (unspec'd ver; inspect with Debug::pkgMark-shallow)
[x86_64] MI2a: marked for install (shallow): gem-parser
[x86_64] MI2a: satisfying Depends: gem(racc) >= 1.7.3
[x86_64] MI2a: maybe install (a providing target): gem-racc 1:1.7.3-alt2:sisyphus+344821.23500.45.2@1715892476
[x86_64] MI2a: target SELECTED: gem-racc 1:1.7.3-alt2:sisyphus+344821.23500.45.2@1715892476
[x86_64] MI2a: requesting to install gem-racc (unspec'd ver; inspect with Debug::pkgMark-shallow)
[x86_64] MI2a: marked for install (shallow): gem-racc
[x86_64] MI2a: satisfying Depends: racc = 1:1.7.3-alt2:sisyphus+344821.23500.45.2
[x86_64] MI2a: maybe install (a direct target): racc 1:1.7.3-alt2:sisyphus+344821.23500.45.2@1715892476
[x86_64] MI2a: target SELECTED: racc 1:1.7.3-alt2:sisyphus+344821.23500.45.2@1715892476
[x86_64] MI2a: requesting to install racc (unspec'd ver; inspect with Debug::pkgMark-shallow)
[x86_64] MI2a: marked for install (shallow): racc
[x86_64] MI2a: satisfying Depends: gem(ast) >= 2.4.1
[x86_64] MI2a: maybe install (a providing target): gem-ast 2.4.2-alt1:sisyphus+296741.20400.43.1@1666815589
[x86_64] MI2a: target SELECTED: gem-ast 2.4.2-alt1:sisyphus+296741.20400.43.1@1666815589
[x86_64] MI2a: requesting to install gem-ast (unspec'd ver; inspect with Debug::pkgMark-shallow)
[x86_64] MI2a: marked for install (shallow): gem-ast
[x86_64] MI2a: satisfying Depends: gem(rainbow) >= 2.2.2
[x86_64] MI2a: maybe install (a providing target): gem-rainbow 3.1.0-alt1:sisyphus+246775.2600.5.1@1630649650
[x86_64] MI2a: target SELECTED: gem-rainbow 3.1.0-alt1:sisyphus+246775.2600.5.1@1630649650
[x86_64] MI2a: requesting to install gem-rainbow (unspec'd ver; inspect with Debug::pkgMark-shallow)
[x86_64] MI2a: marked for install (shallow): gem-rainbow
[x86_64] MI2a: satisfying Depends: gem(regexp_parser) >= 1.8
[x86_64] MI2a: maybe install (a providing target): gem-regexp-parser 2.6.1-alt1:sisyphus+309698.4300.23.1@1671598410
[x86_64] MI2a: target SELECTED: gem-regexp-parser 2.6.1-alt1:sisyphus+309698.4300.23.1@1671598410
[x86_64] MI2a: requesting to install gem-regexp-parser (unspec'd ver; inspect with Debug::pkgMark-shallow)
[x86_64] MI2a: marked for install (shallow): gem-regexp-parser
[x86_64] MI2a: satisfying Depends: gem(rexml) >= 3.2.5
[x86_64] MI2a: maybe install (a providing target): gem-rexml 3.2.8-alt1:p11+348801.200.2.1@1719910579
[x86_64] MI2a: target SELECTED: gem-rexml 3.2.8-alt1:p11+348801.200.2.1@1719910579
[x86_64] MI2a: requesting to install gem-rexml (unspec'd ver; inspect with Debug::pkgMark-shallow)
[x86_64] MI2a: marked for install (shallow): gem-rexml
[x86_64] MI2a: satisfying Depends: gem(strscan) >= 3.0.9
[x86_64] MI2a: maybe install (a providing target): gem-strscan 3.1.1-alt0.1:p11+348801.100.2.1@1719910549
[x86_64] MI2a: target SELECTED: gem-strscan 3.1.1-alt0.1:p11+348801.100.2.1@1719910549
[x86_64] MI2a: requesting to install gem-strscan (unspec'd ver; inspect with Debug::pkgMark-shallow)
[x86_64] MI2a: marked for install (shallow): gem-strscan
[x86_64] MI2a: satisfying Depends: gem(rubocop-ast) >= 1.7.0
[x86_64] MI2a: maybe install (a providing target): gem-rubocop-ast 1.17.0-alt1:sisyphus+296637.15100.56.4@1654666112
[x86_64] MI2a: target SELECTED: gem-rubocop-ast 1.17.0-alt1:sisyphus+296637.15100.56.4@1654666112
[x86_64] MI2a: requesting to install gem-rubocop-ast (unspec'd ver; inspect with Debug::pkgMark-shallow)
[x86_64] MI2a: marked for install (shallow): gem-rubocop-ast
[x86_64] MI2a: satisfying Depends: gem(ruby-progressbar) >= 1.7
[x86_64] MI2a: maybe install (a providing target): gem-ruby-progressbar 1.13.0-alt1:sisyphus+334339.4000.37.1@1702424636
[x86_64] MI2a: target SELECTED: gem-ruby-progressbar 1.13.0-alt1:sisyphus+334339.4000.37.1@1702424636
[x86_64] MI2a: requesting to install gem-ruby-progressbar (unspec'd ver; inspect with Debug::pkgMark-shallow)
[x86_64] MI2a: marked for install (shallow): gem-ruby-progressbar
[x86_64] MI2a: satisfying Depends: gem(unicode-display_width) >= 2.4.0
[x86_64] MI2a: maybe install (a providing target): gem-unicode-display-width 2.5.0-alt1:sisyphus+344821.1500.45.2@1715887619
[x86_64] MI2a: target SELECTED: gem-unicode-display-width 2.5.0-alt1:sisyphus+344821.1500.45.2@1715887619
[x86_64] MI2a: requesting to install gem-unicode-display-width (unspec'd ver; inspect with Debug::pkgMark-shallow)
[x86_64] MI2a: marked for install (shallow): gem-unicode-display-width
[x86_64] MI2a: satisfying Depends: gem(lint_roller) >= 1.0
[x86_64] MI2a: maybe install (a providing target): gem-lint-roller 1.1.0-alt1:sisyphus+344821.10600.45.2@1715889322
[x86_64] MI2a: target SELECTED: gem-lint-roller 1.1.0-alt1:sisyphus+344821.10600.45.2@1715889322
[x86_64] MI2a: requesting to install gem-lint-roller (unspec'd ver; inspect with Debug::pkgMark-shallow)
[x86_64] MI2a: marked for install (shallow): gem-lint-roller
[x86_64] MI2a: satisfying Depends: gem(standard-custom) >= 1.0.0
[x86_64] MI2a: maybe install (a providing target): gem-standard-custom 1.0.2-alt1:sisyphus+344821.10700.45.2@1715889350
[x86_64] MI2a: target SELECTED: gem-standard-custom 1.0.2-alt1:sisyphus+344821.10700.45.2@1715889350
[x86_64] MI2a: requesting to install gem-standard-custom (unspec'd ver; inspect with Debug::pkgMark-shallow)
[x86_64] MI2a: marked for install (shallow): gem-standard-custom
[x86_64] MI2a: satisfying Depends: gem(standard-performance) >= 1.5
[x86_64] MI2a: maybe install (a providing target): gem-standard-performance 1.5.0-alt1:p11+374139.1670.17.1@1741946743
[x86_64] MI2a: target SELECTED: gem-standard-performance 1.5.0-alt1:p11+374139.1670.17.1@1741946743
[x86_64] MI2a: requesting to install gem-standard-performance (unspec'd ver; inspect with Debug::pkgMark-shallow)
[x86_64] MI2a: marked for install (shallow): gem-standard-performance
[x86_64] MI2a: satisfying Depends: gem(rubocop-performance) >= 1.11.3
[x86_64] MI2a: maybe install (a providing target): gem-rubocop-performance 1.21.0-alt1:sisyphus+344821.2000.45.2@1715887736
[x86_64] MI2a: target SELECTED: gem-rubocop-performance 1.21.0-alt1:sisyphus+344821.2000.45.2@1715887736
[x86_64] MI2a: requesting to install gem-rubocop-performance (unspec'd ver; inspect with Debug::pkgMark-shallow)
[x86_64] MI2a: marked for install (shallow): gem-rubocop-performance
[x86_64] MI2a: marked for install (shallow): gem-test-unit
[x86_64] MI2a: satisfying Depends: gem(power_assert) >= 0
[x86_64] MI2a: maybe install (a providing target): gem-power-assert 2.0.1-alt1:sisyphus+296637.272.56.4@1654656448
[x86_64] MI2a: target SELECTED: gem-power-assert 2.0.1-alt1:sisyphus+296637.272.56.4@1654656448
[x86_64] MI2a: requesting to install gem-power-assert (unspec'd ver; inspect with Debug::pkgMark-shallow)
[x86_64] MI2a: marked for install (shallow): gem-power-assert
[x86_64] rpm-build-ruby is already the newest version.
[x86_64] Version gem-rake#13.1.0-alt1.1:sisyphus+343176.100.1.1@1710938591 for gem(rake)>=13.0 is already installed
[x86_64] gem-rake is already the newest version.
[x86_64] Version ruby-stdlibs#3.1.4-alt4.4:sisyphus+344821.44.45.2@1715887248 for gem(bigdecimal)>=2.0 is already installed
[x86_64] ruby-stdlibs is already the newest version.
[x86_64] Selected version gem-get-process-mem#0.2.7-alt1:sisyphus+263530.63040.88.5@1629569994 for gem(get_process_mem)>=0.2
[x86_64] Selected version gem-puma#5.6.5-alt1:sisyphus+326046.200.1.3@1690697754 for gem(puma)>=2.7
[x86_64] Selected version gem-rack#1:3.0.10-alt2:sisyphus+344821.2610.45.2@1715887953 for gem(rack)>=3.0.0
[x86_64] Selected version gem-rackup#2:2.1.0-alt1:sisyphus+344821.520.45.2@1715887413 for gem(rackup)>=2.1
[x86_64] Selected version gem-standard#1.41.1-alt1:p11+374139.1660.17.1@1741946718 for gem(standard)>=0
[x86_64] Selected version gem-test-unit#3.6.2-alt1:sisyphus+347694.100.1.1@1715603465 for gem(test-unit)>=0
[x86_64] E: Couldn't find package gem(wait_for_it)>=0.1
[x86_64] hsh-install: Failed to calculate package file list.
[x86_64] hsh-install: Failed to generate package file list.
2025-Mar-28 21:46:30 :: [x86_64] gem-puma-worker-killer.git 1.0.0-alt1: remote: cannot build src.rpm
2025-Mar-28 21:46:30 :: [x86_64] #30 gem-puma-worker-killer.git 1.0.0-alt1: build FAILED
2025-Mar-28 21:46:30 :: [x86_64] requesting cancellation of task processing
[i586] <13>Mar 28 21:46:31 rpmi: libruby-3.1.4-alt4.4 sisyphus+344821.44.45.2 1715887288 installed
[i586] <13>Mar 28 21:46:31 rpmi: libruby-devel-3.1.4-alt4.4 sisyphus+344821.44.45.2 1715887288 installed
[i586] <13>Mar 28 21:46:31 rpmi: rpm-macros-ruby-1:3.1.4-alt4.4 sisyphus+344821.44.45.2 1715887288 installed
[i586] <13>Mar 28 21:46:31 rpmi: libyaml2-0.2.5-alt1 sisyphus+278391.100.1.1 1626094932 installed
[i586] <13>Mar 28 21:46:31 rpmi: libncurses6-6.3.20220618-alt4 sisyphus+327286.4600.14.1 1711486782 installed
[i586] <13>Mar 28 21:46:31 rpmi: openssl-config-3.2.0-alt1 p11+370688.200.3.1 1738846989 installed
[i586] <13>Mar 28 21:46:31 rpmi: chrpath-0.16-alt1 sisyphus+346101.200.3.1 1716459476 installed
[i586] <13>Mar 28 21:46:31 rpmi: setup-rb-5.999.6-alt10 sisyphus+342746.62.8.1 1710630324 installed
[i586] <13>Mar 28 21:46:31 rpmi: gem-setup-5.999.6-alt10 sisyphus+342746.62.8.1 1710630324 installed
[i586] <13>Mar 28 21:46:31 rpmi: libp11-kit-1:0.25.5-alt1 p11+352554.100.2.1 1721826049 installed
[i586] <13>Mar 28 21:46:31 rpmi: libtasn1-4.20.0-alt1 p11+374933.100.1.1 1739641427 installed
[i586] <13>Mar 28 21:46:31 rpmi: rpm-macros-alternatives-0.5.3-alt1 p11+371884.100.2.1 1738152096 installed
[i586] <13>Mar 28 21:46:31 rpmi: alternatives-0.5.3-alt1 p11+371884.100.2.1 1738152096 installed
[i586] <13>Mar 28 21:46:31 rpmi: ca-certificates-2024.12.10-alt1 p11+371739.200.1.1 1737807628 installed
[i586] <13>Mar 28 21:46:31 rpmi: ca-trust-0.2.0-alt1 sisyphus+344843.100.1.1 1712743326 installed
[i586] <13>Mar 28 21:46:31 rpmi: p11-kit-trust-1:0.25.5-alt1 p11+352554.100.2.1 1721826049 installed
[i586] <13>Mar 28 21:46:31 rpmi: libcrypto3-3.3.3-alt1 p11+374399.100.2.1 1739522622 installed
[i586] <13>Mar 28 21:46:31 rpmi: libssl3-3.3.3-alt1 p11+374399.100.2.1 1739522622 installed
[i586] <86>Mar 28 21:46:31 groupadd[622105]: group added to /etc/group: name=ruby, GID=999
[i586] <86>Mar 28 21:46:31 groupadd[622105]: group added to /etc/gshadow: name=ruby
[i586] <86>Mar 28 21:46:31 groupadd[622105]: new group: name=ruby, GID=999
[i586] <86>Mar 28 21:46:31 usermod[622111]: add 'root' to group 'ruby'
[i586] <13>Mar 28 21:46:31 rpmi: ruby-3.1.4-alt4.4 sisyphus+344821.44.45.2 1715887288 installed
[i586] NOTE: to make the environment variable changes come into effect, please relogin the terminal session
[i586] <13>Mar 28 21:46:31 rpmi: ruby-stdlibs-3.1.4-alt4.4 sisyphus+344821.44.45.2 1715887288 installed
[i586] <13>Mar 28 21:46:31 rpmi: gem-rake-13.1.0-alt1.1 sisyphus+343176.100.1.1 1710938591 installed
[i586] <13>Mar 28 21:46:31 rpmi: rake-13.1.0-alt1.1 sisyphus+343176.100.1.1 1710938591 installed
[i586] <13>Mar 28 21:46:31 rpmi: rpm-build-ruby-1:1.1.1-alt1 sisyphus+334339.50.37.1 1702423926 installed
[i586] Reading Package Lists...
[i586] Building Dependency Tree...
[i586] MI2a: marked for install (shallow): gem-get-process-mem
[i586] MI2a: satisfying Depends: gem(ffi) >= 1.0
[i586] MI2a: maybe install (a providing target): gem-ffi 1.17.0-alt2:p11+356670.100.3.1@1728295741
[i586] MI2a: target SELECTED: gem-ffi 1.17.0-alt2:p11+356670.100.3.1@1728295741
[i586] MI2a: requesting to install gem-ffi (unspec'd ver; inspect with Debug::pkgMark-shallow)
[i586] MI2a: marked for install (shallow): gem-ffi
[i586] MI2a: marked for install (shallow): gem-puma
[i586] MI2a: satisfying Depends: gem(nio4r) < 3
[i586] MI2a: maybe install (a providing target): gem-nio4r 2.5.8-alt1:sisyphus+296703.3120.105.2@1663321103
[i586] MI2a: target SELECTED: gem-nio4r 2.5.8-alt1:sisyphus+296703.3120.105.2@1663321103
[i586] MI2a: requesting to install gem-nio4r (unspec'd ver; inspect with Debug::pkgMark-shallow)
[i586] MI2a: marked for install (shallow): gem-nio4r
[i586] MI2a: marked for install (shallow): gem-rackup
[i586] MI2a: satisfying Depends: gem(webrick) >= 1.8
[i586] MI2a: maybe install (a providing target): gem-webrick 1.8.1-alt1:sisyphus+344821.500.45.2@1715887381
[i586] MI2a: target SELECTED: gem-webrick 1.8.1-alt1:sisyphus+344821.500.45.2@1715887381
[i586] MI2a: requesting to install gem-webrick (unspec'd ver; inspect with Debug::pkgMark-shallow)
[i586] MI2a: marked for install (shallow): gem-webrick
[i586] MI2a: marked for install (shallow): gem-standard
[i586] MI2a: satisfying Depends: gem(rubocop) >= 1.15.0
[i586] MI2a: maybe install (a providing target): gem-rubocop 1.63.1-alt1:sisyphus+344821.1700.45.2@1715887703
[i586] MI2a: target SELECTED: gem-rubocop 1.63.1-alt1:sisyphus+344821.1700.45.2@1715887703
[i586] MI2a: requesting to install gem-rubocop (unspec'd ver; inspect with Debug::pkgMark-shallow)
[i586] MI2a: marked for install (shallow): gem-rubocop
[i586] MI2a: satisfying Depends: gem(language_server-protocol) >= 3.17.0
[i586] MI2a: maybe install (a providing target): gem-language-server-protocol 3.17.0.3-alt1:sisyphus+344821.11100.45.2@1715889413
[i586] MI2a: target SELECTED: gem-language-server-protocol 3.17.0.3-alt1:sisyphus+344821.11100.45.2@1715889413
[i586] MI2a: requesting to install gem-language-server-protocol (unspec'd ver; inspect with Debug::pkgMark-shallow)
[i586] MI2a: marked for install (shallow): gem-language-server-protocol
[i586] MI2a: satisfying Depends: gem(parallel) >= 1.10
[i586] MI2a: maybe install (a providing target): gem-parallel 1.20.2-alt1:sisyphus+246775.3100.5.1@1630649785
[i586] MI2a: target SELECTED: gem-parallel 1.20.2-alt1:sisyphus+246775.3100.5.1@1630649785
[i586] MI2a: requesting to install gem-parallel (unspec'd ver; inspect with Debug::pkgMark-shallow)
[i586] MI2a: marked for install (shallow): gem-parallel
[i586] MI2a: satisfying Depends: gem(parser) >= 3.3.0.2
[i586] MI2a: maybe install (a providing target): gem-parser 3.3.0.5-alt1:sisyphus+343529.2100.9.8@1711478421
[i586] MI2a: target SELECTED: gem-parser 3.3.0.5-alt1:sisyphus+343529.2100.9.8@1711478421
[i586] MI2a: requesting to install gem-parser (unspec'd ver; inspect with Debug::pkgMark-shallow)
[i586] MI2a: marked for install (shallow): gem-parser
[i586] MI2a: satisfying Depends: gem(racc) >= 1.7.3
[i586] MI2a: maybe install (a providing target): gem-racc 1:1.7.3-alt2:sisyphus+344821.23500.45.2@1715892568
[i586] MI2a: target SELECTED: gem-racc 1:1.7.3-alt2:sisyphus+344821.23500.45.2@1715892568
[i586] MI2a: requesting to install gem-racc (unspec'd ver; inspect with Debug::pkgMark-shallow)
[i586] MI2a: marked for install (shallow): gem-racc
[i586] MI2a: satisfying Depends: racc = 1:1.7.3-alt2:sisyphus+344821.23500.45.2
[i586] MI2a: maybe install (a direct target): racc 1:1.7.3-alt2:sisyphus+344821.23500.45.2@1715892476
[i586] MI2a: target SELECTED: racc 1:1.7.3-alt2:sisyphus+344821.23500.45.2@1715892476
[i586] MI2a: requesting to install racc (unspec'd ver; inspect with Debug::pkgMark-shallow)
[i586] MI2a: marked for install (shallow): racc
[i586] MI2a: satisfying Depends: gem(ast) >= 2.4.1
[i586] MI2a: maybe install (a providing target): gem-ast 2.4.2-alt1:sisyphus+296741.20400.43.1@1666815589
[i586] MI2a: target SELECTED: gem-ast 2.4.2-alt1:sisyphus+296741.20400.43.1@1666815589
[i586] MI2a: requesting to install gem-ast (unspec'd ver; inspect with Debug::pkgMark-shallow)
[i586] MI2a: marked for install (shallow): gem-ast
[i586] MI2a: satisfying Depends: gem(rainbow) >= 2.2.2
[i586] MI2a: maybe install (a providing target): gem-rainbow 3.1.0-alt1:sisyphus+246775.2600.5.1@1630649650
[i586] MI2a: target SELECTED: gem-rainbow 3.1.0-alt1:sisyphus+246775.2600.5.1@1630649650
[i586] MI2a: requesting to install gem-rainbow (unspec'd ver; inspect with Debug::pkgMark-shallow)
[i586] MI2a: marked for install (shallow): gem-rainbow
[i586] MI2a: satisfying Depends: gem(regexp_parser) >= 1.8
[i586] MI2a: maybe install (a providing target): gem-regexp-parser 2.6.1-alt1:sisyphus+309698.4300.23.1@1671598410
[i586] MI2a: target SELECTED: gem-regexp-parser 2.6.1-alt1:sisyphus+309698.4300.23.1@1671598410
[i586] MI2a: requesting to install gem-regexp-parser (unspec'd ver; inspect with Debug::pkgMark-shallow)
[i586] MI2a: marked for install (shallow): gem-regexp-parser
[i586] MI2a: satisfying Depends: gem(rexml) >= 3.2.5
[i586] MI2a: maybe install (a providing target): gem-rexml 3.2.8-alt1:p11+348801.200.2.1@1719910579
[i586] MI2a: target SELECTED: gem-rexml 3.2.8-alt1:p11+348801.200.2.1@1719910579
[i586] MI2a: requesting to install gem-rexml (unspec'd ver; inspect with Debug::pkgMark-shallow)
[i586] MI2a: marked for install (shallow): gem-rexml
[i586] MI2a: satisfying Depends: gem(strscan) >= 3.0.9
[i586] MI2a: maybe install (a providing target): gem-strscan 3.1.1-alt0.1:p11+348801.100.2.1@1719910548
[i586] MI2a: target SELECTED: gem-strscan 3.1.1-alt0.1:p11+348801.100.2.1@1719910548
[i586] MI2a: requesting to install gem-strscan (unspec'd ver; inspect with Debug::pkgMark-shallow)
[i586] MI2a: marked for install (shallow): gem-strscan
[i586] MI2a: satisfying Depends: gem(rubocop-ast) >= 1.7.0
[i586] MI2a: maybe install (a providing target): gem-rubocop-ast 1.17.0-alt1:sisyphus+296637.15100.56.4@1654666112
[i586] MI2a: target SELECTED: gem-rubocop-ast 1.17.0-alt1:sisyphus+296637.15100.56.4@1654666112
[i586] MI2a: requesting to install gem-rubocop-ast (unspec'd ver; inspect with Debug::pkgMark-shallow)
[i586] MI2a: marked for install (shallow): gem-rubocop-ast
[i586] MI2a: satisfying Depends: gem(ruby-progressbar) >= 1.7
[i586] MI2a: maybe install (a providing target): gem-ruby-progressbar 1.13.0-alt1:sisyphus+334339.4000.37.1@1702424636
[i586] MI2a: target SELECTED: gem-ruby-progressbar 1.13.0-alt1:sisyphus+334339.4000.37.1@1702424636
[i586] MI2a: requesting to install gem-ruby-progressbar (unspec'd ver; inspect with Debug::pkgMark-shallow)
[i586] MI2a: marked for install (shallow): gem-ruby-progressbar
[i586] MI2a: satisfying Depends: gem(unicode-display_width) >= 2.4.0
[i586] MI2a: maybe install (a providing target): gem-unicode-display-width 2.5.0-alt1:sisyphus+344821.1500.45.2@1715887619
[i586] MI2a: target SELECTED: gem-unicode-display-width 2.5.0-alt1:sisyphus+344821.1500.45.2@1715887619
[i586] MI2a: requesting to install gem-unicode-display-width (unspec'd ver; inspect with Debug::pkgMark-shallow)
[i586] MI2a: marked for install (shallow): gem-unicode-display-width
[i586] MI2a: satisfying Depends: gem(lint_roller) >= 1.0
[i586] MI2a: maybe install (a providing target): gem-lint-roller 1.1.0-alt1:sisyphus+344821.10600.45.2@1715889322
[i586] MI2a: target SELECTED: gem-lint-roller 1.1.0-alt1:sisyphus+344821.10600.45.2@1715889322
[i586] MI2a: requesting to install gem-lint-roller (unspec'd ver; inspect with Debug::pkgMark-shallow)
[i586] MI2a: marked for install (shallow): gem-lint-roller
[i586] MI2a: satisfying Depends: gem(standard-custom) >= 1.0.0
[i586] MI2a: maybe install (a providing target): gem-standard-custom 1.0.2-alt1:sisyphus+344821.10700.45.2@1715889350
[i586] MI2a: target SELECTED: gem-standard-custom 1.0.2-alt1:sisyphus+344821.10700.45.2@1715889350
[i586] MI2a: requesting to install gem-standard-custom (unspec'd ver; inspect with Debug::pkgMark-shallow)
[i586] MI2a: marked for install (shallow): gem-standard-custom
[i586] MI2a: satisfying Depends: gem(standard-performance) >= 1.5
[i586] MI2a: maybe install (a providing target): gem-standard-performance 1.5.0-alt1:p11+374139.1670.17.1@1741946743
[i586] MI2a: target SELECTED: gem-standard-performance 1.5.0-alt1:p11+374139.1670.17.1@1741946743
[i586] MI2a: requesting to install gem-standard-performance (unspec'd ver; inspect with Debug::pkgMark-shallow)
[i586] MI2a: marked for install (shallow): gem-standard-performance
[i586] MI2a: satisfying Depends: gem(rubocop-performance) >= 1.11.3
[i586] MI2a: maybe install (a providing target): gem-rubocop-performance 1.21.0-alt1:sisyphus+344821.2000.45.2@1715887736
[i586] MI2a: target SELECTED: gem-rubocop-performance 1.21.0-alt1:sisyphus+344821.2000.45.2@1715887736
[i586] MI2a: requesting to install gem-rubocop-performance (unspec'd ver; inspect with Debug::pkgMark-shallow)
[i586] MI2a: marked for install (shallow): gem-rubocop-performance
[i586] MI2a: marked for install (shallow): gem-test-unit
[i586] MI2a: satisfying Depends: gem(power_assert) >= 0
[i586] MI2a: maybe install (a providing target): gem-power-assert 2.0.1-alt1:sisyphus+296637.272.56.4@1654656448
[i586] MI2a: target SELECTED: gem-power-assert 2.0.1-alt1:sisyphus+296637.272.56.4@1654656448
[i586] MI2a: requesting to install gem-power-assert (unspec'd ver; inspect with Debug::pkgMark-shallow)
[i586] MI2a: marked for install (shallow): gem-power-assert
[i586] rpm-build-ruby is already the newest version.
[i586] Version gem-rake#13.1.0-alt1.1:sisyphus+343176.100.1.1@1710938591 for gem(rake)>=13.0 is already installed
[i586] gem-rake is already the newest version.
[i586] Version ruby-stdlibs#3.1.4-alt4.4:sisyphus+344821.44.45.2@1715887288 for gem(bigdecimal)>=2.0 is already installed
[i586] ruby-stdlibs is already the newest version.
[i586] Selected version gem-get-process-mem#0.2.7-alt1:sisyphus+263530.63040.88.5@1629569994 for gem(get_process_mem)>=0.2
[i586] Selected version gem-puma#5.6.5-alt1:sisyphus+326046.200.1.3@1690697757 for gem(puma)>=2.7
[i586] Selected version gem-rack#1:3.0.10-alt2:sisyphus+344821.2610.45.2@1715887953 for gem(rack)>=3.0.0
[i586] Selected version gem-rackup#2:2.1.0-alt1:sisyphus+344821.520.45.2@1715887413 for gem(rackup)>=2.1
[i586] Selected version gem-standard#1.41.1-alt1:p11+374139.1660.17.1@1741946718 for gem(standard)>=0
[i586] Selected version gem-test-unit#3.6.2-alt1:sisyphus+347694.100.1.1@1715603465 for gem(test-unit)>=0
[i586] E: Couldn't find package gem(wait_for_it)>=0.1
[i586] hsh-install: Failed to calculate package file list.
[i586] hsh-install: Failed to generate package file list.
2025-Mar-28 21:46:32 :: [i586] gem-puma-worker-killer.git 1.0.0-alt1: remote: cannot build src.rpm
2025-Mar-28 21:46:32 :: [i586] #30 gem-puma-worker-killer.git 1.0.0-alt1: build FAILED
2025-Mar-28 21:46:45 :: [aarch64] #20 gem-concurrent-ruby.git 1.3.5-alt1: build OK
2025-Mar-28 21:46:45 :: [aarch64] task processing CANCELLED
2025-Mar-28 21:46:30 :: [x86_64] build FAILED
2025-Mar-28 21:46:32 :: [i586] build FAILED
2025-Mar-28 21:46:45 :: [aarch64] build FAILED
2025-Mar-28 21:46:46 :: task #379263 for p11 FAILED
^ permalink raw reply [flat|nested] 6+ messages in thread
* [#379263] p11 FAILED (try 5) gem-concurrent-ruby.git=1.3.5-alt1 gem-wait-for-it.git=0.2.1-alt1 ...
2025-03-25 21:22 [#379263] p11 FAILED pcs.git=0.11.6-alt2 Girar awaiter (sin)
` (2 preceding siblings ...)
2025-03-28 21:46 ` [#379263] p11 FAILED (try 4) gem-concurrent-ruby.git=1.3.5-alt1 gem-puma-worker-killer.git=1.0.0-alt1 Girar awaiter (sin)
@ 2025-03-28 22:00 ` Girar awaiter (sin)
2025-03-28 22:09 ` [#379263] p11 FAILED (try 6) " Girar awaiter (sin)
4 siblings, 0 replies; 6+ messages in thread
From: Girar awaiter (sin) @ 2025-03-28 22:00 UTC (permalink / raw)
To: Evgeny Sinelnikov
Cc: sisyphus-incominger, girar-builder-p11, girar-builder-p11
https://git.altlinux.org/tasks/379263/logs/events.5.1.log
https://packages.altlinux.org/tasks/379263
subtask name aarch64 i586 x86_64
#24 gem-wait-for-it 42 28 28
#30 gem-puma-worker-killer 42 27 28
#40 gem-puma 56 37 36
#100 pcs 1:47 1:12 1:09
2025-Mar-28 21:53:15 :: task #379263 for p11 resumed by sin:
2025-Mar-28 21:53:15 :: message: fix_regression
#20 build 1.3.5-alt1 from /gears/g/gem-concurrent-ruby.git fetched at 2025-Mar-25 21:34:04 from sisyphus
#24 build 0.2.1-alt1 from /gears/g/gem-wait-for-it.git fetched at 2025-Mar-28 21:53:01 from sisyphus
#30 build 1.0.0-alt1 from /gears/g/gem-puma-worker-killer.git fetched at 2025-Mar-28 21:44:42 from sisyphus
#40 build 6.6.0-alt1 from /gears/g/gem-puma.git fetched at 2025-Mar-25 21:25:11 from sisyphus
#100 build 0.11.6-alt2 from /gears/p/pcs.git fetched at 2025-Mar-25 21:18:32 from sisyphus
2025-Mar-28 21:53:15 :: created build repo
2025-Mar-28 21:53:16 :: [x86_64] #20 gem-concurrent-ruby.git 1.3.5-alt1: build start
2025-Mar-28 21:53:16 :: [aarch64] #20 gem-concurrent-ruby.git 1.3.5-alt1: build start
2025-Mar-28 21:53:16 :: [i586] #20 gem-concurrent-ruby.git 1.3.5-alt1: build start
2025-Mar-28 21:53:28 :: [i586] #20 gem-concurrent-ruby.git 1.3.5-alt1: build OK (cached)
2025-Mar-28 21:53:28 :: [i586] #24 gem-wait-for-it.git 0.2.1-alt1: build start
2025-Mar-28 21:53:29 :: [x86_64] #20 gem-concurrent-ruby.git 1.3.5-alt1: build OK (cached)
2025-Mar-28 21:53:29 :: [x86_64] #24 gem-wait-for-it.git 0.2.1-alt1: build start
2025-Mar-28 21:53:39 :: [aarch64] #20 gem-concurrent-ruby.git 1.3.5-alt1: build OK (cached)
2025-Mar-28 21:53:39 :: [aarch64] #24 gem-wait-for-it.git 0.2.1-alt1: build start
2025-Mar-28 21:53:56 :: [i586] #24 gem-wait-for-it.git 0.2.1-alt1: build OK
2025-Mar-28 21:53:56 :: [i586] #30 gem-puma-worker-killer.git 1.0.0-alt1: build start
2025-Mar-28 21:53:57 :: [x86_64] #24 gem-wait-for-it.git 0.2.1-alt1: build OK
2025-Mar-28 21:53:57 :: [x86_64] #30 gem-puma-worker-killer.git 1.0.0-alt1: build start
2025-Mar-28 21:54:21 :: [aarch64] #24 gem-wait-for-it.git 0.2.1-alt1: build OK
2025-Mar-28 21:54:22 :: [aarch64] #30 gem-puma-worker-killer.git 1.0.0-alt1: build start
2025-Mar-28 21:54:23 :: [i586] #30 gem-puma-worker-killer.git 1.0.0-alt1: build OK
2025-Mar-28 21:54:24 :: [i586] #40 gem-puma.git 6.6.0-alt1: build start
2025-Mar-28 21:54:25 :: [x86_64] #30 gem-puma-worker-killer.git 1.0.0-alt1: build OK
2025-Mar-28 21:54:25 :: [x86_64] #40 gem-puma.git 6.6.0-alt1: build start
2025-Mar-28 21:55:01 :: [i586] #40 gem-puma.git 6.6.0-alt1: build OK
2025-Mar-28 21:55:01 :: [i586] #100 pcs.git 0.11.6-alt2: build start
2025-Mar-28 21:55:01 :: [x86_64] #40 gem-puma.git 6.6.0-alt1: build OK
2025-Mar-28 21:55:01 :: [x86_64] #100 pcs.git 0.11.6-alt2: build start
2025-Mar-28 21:55:04 :: [aarch64] #30 gem-puma-worker-killer.git 1.0.0-alt1: build OK
2025-Mar-28 21:55:04 :: [aarch64] #40 gem-puma.git 6.6.0-alt1: build start
2025-Mar-28 21:56:00 :: [aarch64] #40 gem-puma.git 6.6.0-alt1: build OK
2025-Mar-28 21:56:00 :: [aarch64] #100 pcs.git 0.11.6-alt2: build start
2025-Mar-28 21:56:10 :: [x86_64] #100 pcs.git 0.11.6-alt2: build OK
2025-Mar-28 21:56:13 :: [i586] #100 pcs.git 0.11.6-alt2: build OK
2025-Mar-28 21:57:47 :: [aarch64] #100 pcs.git 0.11.6-alt2: build OK
2025-Mar-28 21:58:16 :: #20: gem-concurrent-ruby.git 1.3.5-alt1: build check OK
2025-Mar-28 21:58:27 :: #24: gem-wait-for-it.git 0.2.1-alt1: build check OK
2025-Mar-28 21:58:38 :: #30: gem-puma-worker-killer.git 1.0.0-alt1: build check OK
2025-Mar-28 21:58:54 :: #40: gem-puma.git 6.6.0-alt1: build check OK
2025-Mar-28 21:59:06 :: #100: pcs.git 0.11.6-alt2: build check OK
2025-Mar-28 21:59:08 :: build check OK
2025-Mar-28 21:59:25 :: noarch check OK
2025-Mar-28 21:59:27 :: plan: src +5 -3 =19592, aarch64 +7 -7 =33988, i586 +7 -7 =33137, noarch +17 -11 =20490, x86_64 +7 -7 =34763
#20 gem-concurrent-ruby 1.2.3-alt1 -> 1.3.5-alt1
Thu Mar 06 2025 Pavel Skrylev <majioa@altlinux> 1.3.5-alt1
- ^ 1.2.3 -> 1.3.5
#40 gem-puma 5.6.5-alt1 -> 6.6.0-alt1
Thu Mar 06 2025 Pavel Skrylev <majioa@altlinux> 6.6.0-alt1
- ^ 6.4.3 -> 6.6.0
- * define explicit dependencies
Tue Oct 08 2024 Pavel Skrylev <majioa@altlinux> 6.4.3-alt1
- ^ 5.6.8 -> 6.4.3
Fri Jul 26 2024 Pavel Skrylev <majioa@altlinux> 5.6.8-alt1
- ^ 5.6.5 -> 5.6.8
#100 pcs 0.11.6-alt1 -> 1:0.11.6-alt2
Tue Oct 08 2024 Pavel Skrylev <majioa@altlinux> 1:0.11.6-alt2
- ! fixed rack/handler for new rack 3.x (closes #51647)
2025-Mar-28 21:59:27 :: pcs: closes bugs: 51647
2025-Mar-28 22:00:05 :: patched apt indices
2025-Mar-28 22:00:13 :: created next repo
2025-Mar-28 22:00:22 :: duplicate provides check OK
x86_64: NEW unmet dependencies detected:
gem-puma-plugin-systemd#0.1.5-alt1:sisyphus+263530.2340.88.5@1629543026 gem(puma) < 6
i586: NEW unmet dependencies detected:
gem-puma-plugin-systemd#0.1.5-alt1:sisyphus+263530.2340.88.5@1629543026 gem(puma) < 6
aarch64: NEW unmet dependencies detected:
gem-puma-plugin-systemd#0.1.5-alt1:sisyphus+263530.2340.88.5@1629543026 gem(puma) < 6
ACLs of affected packages (1):
gem-puma-plugin-systemd
2025-Mar-28 22:00:59 :: unmets: x86_64 +1 -0 =1, i586 +1 -0 =1, aarch64 +1 -0 =4
2025-Mar-28 22:00:59 :: dependencies check FAILED
2025-Mar-28 22:00:59 :: task #379263 for p11 FAILED
^ permalink raw reply [flat|nested] 6+ messages in thread
* [#379263] p11 FAILED (try 6) gem-concurrent-ruby.git=1.3.5-alt1 gem-wait-for-it.git=0.2.1-alt1 ...
2025-03-25 21:22 [#379263] p11 FAILED pcs.git=0.11.6-alt2 Girar awaiter (sin)
` (3 preceding siblings ...)
2025-03-28 22:00 ` [#379263] p11 FAILED (try 5) gem-concurrent-ruby.git=1.3.5-alt1 gem-wait-for-it.git=0.2.1-alt1 Girar awaiter (sin)
@ 2025-03-28 22:09 ` Girar awaiter (sin)
4 siblings, 0 replies; 6+ messages in thread
From: Girar awaiter (sin) @ 2025-03-28 22:09 UTC (permalink / raw)
To: Evgeny Sinelnikov
Cc: sisyphus-incominger, girar-builder-p11, girar-builder-p11
https://git.altlinux.org/tasks/379263/logs/events.6.1.log
https://packages.altlinux.org/tasks/379263
subtask name aarch64 i586 x86_64
#60 gem-nio4r 51 34 34
#70 gem-puma-plugin-systemd ? failed failed
2025-Mar-28 22:07:23 :: task #379263 for p11 resumed by sin:
2025-Mar-28 22:07:23 :: message: fix_regression
#20 build 1.3.5-alt1 from /gears/g/gem-concurrent-ruby.git fetched at 2025-Mar-25 21:34:04 from sisyphus
#24 build 0.2.1-alt1 from /gears/g/gem-wait-for-it.git fetched at 2025-Mar-28 21:53:01 from sisyphus
#30 build 1.0.0-alt1 from /gears/g/gem-puma-worker-killer.git fetched at 2025-Mar-28 21:44:42 from sisyphus
#40 build 6.6.0-alt1 from /gears/g/gem-puma.git fetched at 2025-Mar-25 21:25:11 from sisyphus
#60 build 2.7.3-alt1 from /gears/g/gem-nio4r.git fetched at 2025-Mar-28 22:06:35 from sisyphus
#70 build 0.1.5.9-alt1 from /gears/g/gem-puma-plugin-systemd.git fetched at 2025-Mar-28 22:07:09 from sisyphus
#100 build 0.11.6-alt2 from /gears/p/pcs.git fetched at 2025-Mar-25 21:18:32 from sisyphus
2025-Mar-28 22:07:24 :: created build repo
2025-Mar-28 22:07:25 :: [x86_64] #20 gem-concurrent-ruby.git 1.3.5-alt1: build start
2025-Mar-28 22:07:25 :: [i586] #20 gem-concurrent-ruby.git 1.3.5-alt1: build start
2025-Mar-28 22:07:25 :: [aarch64] #20 gem-concurrent-ruby.git 1.3.5-alt1: build start
2025-Mar-28 22:07:42 :: [i586] #20 gem-concurrent-ruby.git 1.3.5-alt1: build OK (cached)
2025-Mar-28 22:07:42 :: [i586] #24 gem-wait-for-it.git 0.2.1-alt1: build start
2025-Mar-28 22:07:43 :: [x86_64] #20 gem-concurrent-ruby.git 1.3.5-alt1: build OK (cached)
2025-Mar-28 22:07:43 :: [x86_64] #24 gem-wait-for-it.git 0.2.1-alt1: build start
2025-Mar-28 22:07:54 :: [i586] #24 gem-wait-for-it.git 0.2.1-alt1: build OK (cached)
2025-Mar-28 22:07:54 :: [i586] #30 gem-puma-worker-killer.git 1.0.0-alt1: build start
2025-Mar-28 22:07:55 :: [x86_64] #24 gem-wait-for-it.git 0.2.1-alt1: build OK (cached)
2025-Mar-28 22:07:56 :: [x86_64] #30 gem-puma-worker-killer.git 1.0.0-alt1: build start
2025-Mar-28 22:07:58 :: [aarch64] #20 gem-concurrent-ruby.git 1.3.5-alt1: build OK (cached)
2025-Mar-28 22:07:58 :: [aarch64] #24 gem-wait-for-it.git 0.2.1-alt1: build start
2025-Mar-28 22:08:06 :: [i586] #30 gem-puma-worker-killer.git 1.0.0-alt1: build OK (cached)
2025-Mar-28 22:08:06 :: [i586] #40 gem-puma.git 6.6.0-alt1: build start
2025-Mar-28 22:08:08 :: [x86_64] #30 gem-puma-worker-killer.git 1.0.0-alt1: build OK (cached)
2025-Mar-28 22:08:08 :: [x86_64] #40 gem-puma.git 6.6.0-alt1: build start
2025-Mar-28 22:08:18 :: [i586] #40 gem-puma.git 6.6.0-alt1: build OK (cached)
2025-Mar-28 22:08:18 :: [i586] #60 gem-nio4r.git 2.7.3-alt1: build start
2025-Mar-28 22:08:20 :: [aarch64] #24 gem-wait-for-it.git 0.2.1-alt1: build OK (cached)
2025-Mar-28 22:08:20 :: [aarch64] #30 gem-puma-worker-killer.git 1.0.0-alt1: build start
2025-Mar-28 22:08:21 :: [x86_64] #40 gem-puma.git 6.6.0-alt1: build OK (cached)
2025-Mar-28 22:08:21 :: [x86_64] #60 gem-nio4r.git 2.7.3-alt1: build start
2025-Mar-28 22:08:43 :: [aarch64] #30 gem-puma-worker-killer.git 1.0.0-alt1: build OK (cached)
2025-Mar-28 22:08:43 :: [aarch64] #40 gem-puma.git 6.6.0-alt1: build start
2025-Mar-28 22:08:52 :: [i586] #60 gem-nio4r.git 2.7.3-alt1: build OK
2025-Mar-28 22:08:53 :: [i586] #70 gem-puma-plugin-systemd.git 0.1.5.9-alt1: build start
2025-Mar-28 22:08:55 :: [x86_64] #60 gem-nio4r.git 2.7.3-alt1: build OK
2025-Mar-28 22:08:55 :: [x86_64] #70 gem-puma-plugin-systemd.git 0.1.5.9-alt1: build start
2025-Mar-28 22:09:05 :: [aarch64] #40 gem-puma.git 6.6.0-alt1: build OK (cached)
2025-Mar-28 22:09:05 :: [aarch64] #60 gem-nio4r.git 2.7.3-alt1: build start
[i586] (ruby 3.1.4 i686-linux)
[i586] ###### Bundler::GemspecError:
[i586] [!] There was an error while loading `puma-plugin-systemd.gemspec`: undefined local variable or method `s' for main:Object
[i586] --
[i586] # "source_code_uri" => "https://github.com/sj26/puma-plugin-systemd"
[i586] ###### NameError: undefined local variable or method `s' for Setup::Source::Gem::M77940255500684253877335947735815909169:Module
[i586] Did you mean? sh
[i586] --
[i586] Processing files: gem-puma-plugin-systemd-doc-0.1.5.9-alt1
[i586] error: No such file or directory: /usr/src/tmp/gem-puma-plugin-systemd-buildroot/usr/lib/ruby/gemie/ri/puma-plugin-systemd-0.1.5.9
[i586] Executing(%doc): /bin/sh -e /usr/src/tmp/rpm-tmp.1314
[i586] --
[i586] RPM build errors:
[i586] No such file or directory: /usr/src/tmp/gem-puma-plugin-systemd-buildroot/usr/lib/ruby/gemie/ri/puma-plugin-systemd-0.1.5.9
2025-Mar-28 22:09:14 :: [i586] gem-puma-plugin-systemd.git 0.1.5.9-alt1: remote: build failed
2025-Mar-28 22:09:14 :: [i586] #70 gem-puma-plugin-systemd.git 0.1.5.9-alt1: build FAILED
2025-Mar-28 22:09:15 :: [i586] requesting cancellation of task processing
[x86_64] (ruby 3.1.4 x86_64-linux)
[x86_64] ###### Bundler::GemspecError:
[x86_64] [!] There was an error while loading `puma-plugin-systemd.gemspec`: undefined local variable or method `s' for main:Object
[x86_64] --
[x86_64] # "source_code_uri" => "https://github.com/sj26/puma-plugin-systemd"
[x86_64] ###### NameError: undefined local variable or method `s' for Setup::Source::Gem::M287867692564021026476281155216641033240:Module
[x86_64] Did you mean? sh
[x86_64] --
[x86_64] Processing files: gem-puma-plugin-systemd-doc-0.1.5.9-alt1
[x86_64] error: No such file or directory: /usr/src/tmp/gem-puma-plugin-systemd-buildroot/usr/lib/ruby/gemie/ri/puma-plugin-systemd-0.1.5.9
[x86_64] Executing(%doc): /bin/sh -e /usr/src/tmp/rpm-tmp.28803
[x86_64] --
[x86_64] RPM build errors:
[x86_64] No such file or directory: /usr/src/tmp/gem-puma-plugin-systemd-buildroot/usr/lib/ruby/gemie/ri/puma-plugin-systemd-0.1.5.9
2025-Mar-28 22:09:18 :: [x86_64] gem-puma-plugin-systemd.git 0.1.5.9-alt1: remote: build failed
2025-Mar-28 22:09:18 :: [x86_64] #70 gem-puma-plugin-systemd.git 0.1.5.9-alt1: build FAILED
2025-Mar-28 22:09:56 :: [aarch64] #60 gem-nio4r.git 2.7.3-alt1: build OK
2025-Mar-28 22:09:57 :: [aarch64] task processing CANCELLED
2025-Mar-28 22:09:15 :: [i586] build FAILED
2025-Mar-28 22:09:18 :: [x86_64] build FAILED
2025-Mar-28 22:09:57 :: [aarch64] build FAILED
2025-Mar-28 22:09:57 :: task #379263 for p11 FAILED
^ permalink raw reply [flat|nested] 6+ messages in thread
end of thread, other threads:[~2025-03-28 22:09 UTC | newest]
Thread overview: 6+ messages (download: mbox.gz / follow: Atom feed)
-- links below jump to the message on this page --
2025-03-25 21:22 [#379263] p11 FAILED pcs.git=0.11.6-alt2 Girar awaiter (sin)
2025-03-25 21:25 ` [#379263] p11 FAILED (try 2) gem-puma.git=6.6.0-alt1 pcs.git=0.11.6-alt2 Girar awaiter (sin)
2025-03-25 21:35 ` [#379263] p11 FAILED (try 3) gem-concurrent-ruby.git=1.3.5-alt1 gem-puma.git=6.6.0-alt1 Girar awaiter (sin)
2025-03-28 21:46 ` [#379263] p11 FAILED (try 4) gem-concurrent-ruby.git=1.3.5-alt1 gem-puma-worker-killer.git=1.0.0-alt1 Girar awaiter (sin)
2025-03-28 22:00 ` [#379263] p11 FAILED (try 5) gem-concurrent-ruby.git=1.3.5-alt1 gem-wait-for-it.git=0.2.1-alt1 Girar awaiter (sin)
2025-03-28 22:09 ` [#379263] p11 FAILED (try 6) " Girar awaiter (sin)
ALT Linux Girar Builder robot reports
This inbox may be cloned and mirrored by anyone:
git clone --mirror http://lore.altlinux.org/sisyphus-incominger/0 sisyphus-incominger/git/0.git
# If you have public-inbox 1.1+ installed, you may
# initialize and index your mirror using the following commands:
public-inbox-init -V2 sisyphus-incominger sisyphus-incominger/ http://lore.altlinux.org/sisyphus-incominger \
sisyphus-incominger@lists.altlinux.org sisyphus-incominger@lists.altlinux.ru sisyphus-incominger@lists.altlinux.com
public-inbox-index sisyphus-incominger
Example config snippet for mirrors.
Newsgroup available over NNTP:
nntp://lore.altlinux.org/org.altlinux.lists.sisyphus-incominger
AGPL code for this site: git clone https://public-inbox.org/public-inbox.git