ALT Linux Girar Builder robot reports
 help / color / mirror / Atom feed
From: "Girar awaiter (serjigva)" <girar-builder@altlinux.org>
To: Sergey Gvozdetskiy <serjigva@altlinux.org>
Cc: sisyphus-incominger@lists.altlinux.org,
	girar-builder-sisyphus@altlinux.org
Subject: [#379109] [test-only] FAILED (try 2) ftxui.git=6.0.0-alt1 pciex.git=0.0.2-alt1
Date: Mon, 24 Mar 2025 13:50:21 +0000
Message-ID: <girar.task.379109.2.1@gyle.mskdc.altlinux.org> (raw)
In-Reply-To: <girar.task.379109.1.1@gyle.mskdc.altlinux.org>

https://git.altlinux.org/tasks/379109/logs/events.2.1.log
https://packages.altlinux.org/tasks/379109

subtask  name   aarch64    i586  x86_64
   #200  pciex   failed  failed  failed

2025-Mar-24 13:48:49 :: test-only task #379109 for sisyphus resumed by serjigva:
2025-Mar-24 13:48:49 :: message: ftxui_new_version
#100 build 6.0.0-alt1 from /people/serjigva/packages/ftxui.git fetched at 2025-Mar-24 13:42:53
#200 build 0.0.2-alt1 from /gears/p/pciex.git fetched at 2025-Mar-24 13:48:09 from sisyphus
2025-Mar-24 13:48:50 :: created build repo
2025-Mar-24 13:48:51 :: [x86_64] #100 ftxui.git 6.0.0-alt1: build start
2025-Mar-24 13:48:51 :: [i586] #100 ftxui.git 6.0.0-alt1: build start
2025-Mar-24 13:48:51 :: [aarch64] #100 ftxui.git 6.0.0-alt1: build start
2025-Mar-24 13:49:09 :: [i586] #100 ftxui.git 6.0.0-alt1: build OK (cached)
2025-Mar-24 13:49:09 :: [i586] #200 pciex.git 0.0.2-alt1: build start
2025-Mar-24 13:49:09 :: [x86_64] #100 ftxui.git 6.0.0-alt1: build OK (cached)
2025-Mar-24 13:49:10 :: [x86_64] #200 pciex.git 0.0.2-alt1: build start
2025-Mar-24 13:49:28 :: [aarch64] #100 ftxui.git 6.0.0-alt1: build OK (cached)
2025-Mar-24 13:49:28 :: [aarch64] #200 pciex.git 0.0.2-alt1: build start
[i586]                  from /usr/src/RPM/BUILD/pciex-0.0.2/src/ui/ext_cap_comp.cpp:4:
[i586] /usr/src/RPM/BUILD/pciex-0.0.2/src/ui/common_comp.h:20:20: error: 'ftxui::Element ui::PushPullButton::Render()' marked 'override', but does not override
[i586]    20 |     ftxui::Element Render() override;
[i586] --
[i586]                  from /usr/src/RPM/BUILD/pciex-0.0.2/src/ui/compat_cap_comp.cpp:7:
[i586] /usr/src/RPM/BUILD/pciex-0.0.2/src/ui/common_comp.h:20:20: error: 'ftxui::Element ui::PushPullButton::Render()' marked 'override', but does not override
[i586]    20 |     ftxui::Element Render() override;
[i586] --
[i586] In file included from /usr/src/RPM/BUILD/pciex-0.0.2/src/main.cpp:11:
[i586] /usr/src/RPM/BUILD/pciex-0.0.2/src/ui/screen.h:212:20: error: 'ftxui::Element ui::PCITopoUIComp::Render()' marked 'override', but does not override
[i586]   212 |     ftxui::Element Render() override final;
[i586] /usr/src/RPM/BUILD/pciex-0.0.2/src/ui/screen.h:212:20: error: 'ftxui::Element ui::PCITopoUIComp::Render()' marked 'final', but is not virtual
[i586] /usr/src/RPM/BUILD/pciex-0.0.2/src/ui/screen.h:275:20: error: 'ftxui::Element ui::ScrollableComp::Render()' marked 'override', but does not override
[i586]   275 |     ftxui::Element Render() override final;
[i586] /usr/src/RPM/BUILD/pciex-0.0.2/src/ui/screen.h:275:20: error: 'ftxui::Element ui::ScrollableComp::Render()' marked 'final', but is not virtual
[i586] /usr/src/RPM/BUILD/pciex-0.0.2/src/ui/screen.h:302:20: error: 'ftxui::Element ui::PCIRegsComponent::Render()' marked 'override', but does not override
[i586]   302 |     ftxui::Element Render() override;
[i586] /usr/src/RPM/BUILD/pciex-0.0.2/src/ui/screen.h:325:20: error: 'ftxui::Element ui::BorderedHoverComp::Render()' marked 'override', but does not override
[i586]   325 |     ftxui::Element Render() override final;
[i586] /usr/src/RPM/BUILD/pciex-0.0.2/src/ui/screen.h:325:20: error: 'ftxui::Element ui::BorderedHoverComp::Render()' marked 'final', but is not virtual
[i586] gmake[2]: *** [CMakeFiles/pciex.dir/build.make:135: CMakeFiles/pciex.dir/src/main.cpp.o] Error 1
[i586] --
[i586] In file included from /usr/src/RPM/BUILD/pciex-0.0.2/src/ui/common_comp.cpp:7:
[i586] /usr/src/RPM/BUILD/pciex-0.0.2/src/ui/common_comp.h:20:20: error: 'ftxui::Element ui::PushPullButton::Render()' marked 'override', but does not override
[i586]    20 |     ftxui::Element Render() override;
2025-Mar-24 13:49:35 :: [i586] pciex.git 0.0.2-alt1: remote: build failed
2025-Mar-24 13:49:35 :: [i586] #200 pciex.git 0.0.2-alt1: build FAILED
2025-Mar-24 13:49:35 :: [i586] requesting cancellation of task processing
[x86_64]                  from /usr/src/RPM/BUILD/pciex-0.0.2/src/ui/compat_cap_comp.cpp:7:
[x86_64] /usr/src/RPM/BUILD/pciex-0.0.2/src/ui/common_comp.h:20:20: error: 'ftxui::Element ui::PushPullButton::Render()' marked 'override', but does not override
[x86_64]    20 |     ftxui::Element Render() override;
[x86_64] --
[x86_64]                  from /usr/src/RPM/BUILD/pciex-0.0.2/src/ui/ext_cap_comp.cpp:4:
[x86_64] /usr/src/RPM/BUILD/pciex-0.0.2/src/ui/common_comp.h:20:20: error: 'ftxui::Element ui::PushPullButton::Render()' marked 'override', but does not override
[x86_64]    20 |     ftxui::Element Render() override;
[x86_64] --
[x86_64] In file included from /usr/src/RPM/BUILD/pciex-0.0.2/src/main.cpp:11:
[x86_64] /usr/src/RPM/BUILD/pciex-0.0.2/src/ui/screen.h:212:20: error: 'ftxui::Element ui::PCITopoUIComp::Render()' marked 'override', but does not override
[x86_64]   212 |     ftxui::Element Render() override final;
[x86_64] /usr/src/RPM/BUILD/pciex-0.0.2/src/ui/screen.h:212:20: error: 'ftxui::Element ui::PCITopoUIComp::Render()' marked 'final', but is not virtual
[x86_64] /usr/src/RPM/BUILD/pciex-0.0.2/src/ui/screen.h:275:20: error: 'ftxui::Element ui::ScrollableComp::Render()' marked 'override', but does not override
[x86_64]   275 |     ftxui::Element Render() override final;
[x86_64] /usr/src/RPM/BUILD/pciex-0.0.2/src/ui/screen.h:275:20: error: 'ftxui::Element ui::ScrollableComp::Render()' marked 'final', but is not virtual
[x86_64] /usr/src/RPM/BUILD/pciex-0.0.2/src/ui/screen.h:302:20: error: 'ftxui::Element ui::PCIRegsComponent::Render()' marked 'override', but does not override
[x86_64]   302 |     ftxui::Element Render() override;
[x86_64] /usr/src/RPM/BUILD/pciex-0.0.2/src/ui/screen.h:325:20: error: 'ftxui::Element ui::BorderedHoverComp::Render()' marked 'override', but does not override
[x86_64]   325 |     ftxui::Element Render() override final;
[x86_64] /usr/src/RPM/BUILD/pciex-0.0.2/src/ui/screen.h:325:20: error: 'ftxui::Element ui::BorderedHoverComp::Render()' marked 'final', but is not virtual
[x86_64] gmake[2]: *** [CMakeFiles/pciex.dir/build.make:135: CMakeFiles/pciex.dir/src/main.cpp.o] Error 1
[x86_64] --
[x86_64] In file included from /usr/src/RPM/BUILD/pciex-0.0.2/src/ui/screen.cpp:7:
[x86_64] /usr/src/RPM/BUILD/pciex-0.0.2/src/ui/screen.h:212:20: error: 'ftxui::Element ui::PCITopoUIComp::Render()' marked 'override', but does not override
[x86_64]   212 |     ftxui::Element Render() override final;
2025-Mar-24 13:49:36 :: [x86_64] pciex.git 0.0.2-alt1: remote: build failed
2025-Mar-24 13:49:36 :: [x86_64] #200 pciex.git 0.0.2-alt1: build FAILED
[aarch64]                  from /usr/src/RPM/BUILD/pciex-0.0.2/src/ui/ext_cap_comp.cpp:4:
[aarch64] /usr/src/RPM/BUILD/pciex-0.0.2/src/ui/common_comp.h:20:20: error: 'ftxui::Element ui::PushPullButton::Render()' marked 'override', but does not override
[aarch64]    20 |     ftxui::Element Render() override;
[aarch64] --
[aarch64]                  from /usr/src/RPM/BUILD/pciex-0.0.2/src/ui/compat_cap_comp.cpp:7:
[aarch64] /usr/src/RPM/BUILD/pciex-0.0.2/src/ui/common_comp.h:20:20: error: 'ftxui::Element ui::PushPullButton::Render()' marked 'override', but does not override
[aarch64]    20 |     ftxui::Element Render() override;
[aarch64] --
[aarch64] In file included from /usr/src/RPM/BUILD/pciex-0.0.2/src/main.cpp:11:
[aarch64] /usr/src/RPM/BUILD/pciex-0.0.2/src/ui/screen.h:212:20: error: 'ftxui::Element ui::PCITopoUIComp::Render()' marked 'override', but does not override
[aarch64]   212 |     ftxui::Element Render() override final;
[aarch64] /usr/src/RPM/BUILD/pciex-0.0.2/src/ui/screen.h:212:20: error: 'ftxui::Element ui::PCITopoUIComp::Render()' marked 'final', but is not virtual
[aarch64] /usr/src/RPM/BUILD/pciex-0.0.2/src/ui/screen.h:275:20: error: 'ftxui::Element ui::ScrollableComp::Render()' marked 'override', but does not override
[aarch64]   275 |     ftxui::Element Render() override final;
[aarch64] /usr/src/RPM/BUILD/pciex-0.0.2/src/ui/screen.h:275:20: error: 'ftxui::Element ui::ScrollableComp::Render()' marked 'final', but is not virtual
[aarch64] /usr/src/RPM/BUILD/pciex-0.0.2/src/ui/screen.h:302:20: error: 'ftxui::Element ui::PCIRegsComponent::Render()' marked 'override', but does not override
[aarch64]   302 |     ftxui::Element Render() override;
[aarch64] /usr/src/RPM/BUILD/pciex-0.0.2/src/ui/screen.h:325:20: error: 'ftxui::Element ui::BorderedHoverComp::Render()' marked 'override', but does not override
[aarch64]   325 |     ftxui::Element Render() override final;
[aarch64] /usr/src/RPM/BUILD/pciex-0.0.2/src/ui/screen.h:325:20: error: 'ftxui::Element ui::BorderedHoverComp::Render()' marked 'final', but is not virtual
[aarch64] gmake[2]: *** [CMakeFiles/pciex.dir/build.make:135: CMakeFiles/pciex.dir/src/main.cpp.o] Error 1
[aarch64] --
[aarch64] In file included from /usr/src/RPM/BUILD/pciex-0.0.2/src/ui/common_comp.cpp:7:
[aarch64] /usr/src/RPM/BUILD/pciex-0.0.2/src/ui/common_comp.h:20:20: error: 'ftxui::Element ui::PushPullButton::Render()' marked 'override', but does not override
[aarch64]    20 |     ftxui::Element Render() override;
2025-Mar-24 13:50:21 :: [aarch64] pciex.git 0.0.2-alt1: remote: build failed
2025-Mar-24 13:50:21 :: [aarch64] #200 pciex.git 0.0.2-alt1: build FAILED
2025-Mar-24 13:49:35 :: [i586] build FAILED
2025-Mar-24 13:49:36 :: [x86_64] build FAILED
2025-Mar-24 13:50:21 :: [aarch64] build FAILED
2025-Mar-24 13:50:21 :: task #379109 for sisyphus FAILED


  reply	other threads:[~2025-03-24 13:50 UTC|newest]

Thread overview: 4+ messages / expand[flat|nested]  mbox.gz  Atom feed  top
2025-03-24 13:46 [#379109] [test-only] FAILED ftxui.git=6.0.0-alt1 Girar awaiter (serjigva)
2025-03-24 13:50 ` Girar awaiter (serjigva) [this message]
2025-03-28 15:23 ` [#379109] TESTED (try 3) ftxui.git=6.0.0-alt1 pciex.git=0.0.2-alt2 Girar awaiter (serjigva)
2025-03-28 15:26 ` [#379109] DONE (try 4) " Girar pender (serjigva)

Reply instructions:

You may reply publicly to this message via plain-text email
using any one of the following methods:

* Save the following mbox file, import it into your mail client,
  and reply-to-all from there: mbox

  Avoid top-posting and favor interleaved quoting:
  https://en.wikipedia.org/wiki/Posting_style#Interleaved_style

* Reply using the --to, --cc, and --in-reply-to
  switches of git-send-email(1):

  git send-email \
    --in-reply-to=girar.task.379109.2.1@gyle.mskdc.altlinux.org \
    --to=girar-builder@altlinux.org \
    --cc=devel@lists.altlinux.org \
    --cc=girar-builder-sisyphus@altlinux.org \
    --cc=serjigva@altlinux.org \
    --cc=sisyphus-incominger@lists.altlinux.org \
    /path/to/YOUR_REPLY

  https://kernel.org/pub/software/scm/git/docs/git-send-email.html

* If your mail client supports setting the In-Reply-To header
  via mailto: links, try the mailto: link

ALT Linux Girar Builder robot reports

This inbox may be cloned and mirrored by anyone:

	git clone --mirror http://lore.altlinux.org/sisyphus-incominger/0 sisyphus-incominger/git/0.git

	# If you have public-inbox 1.1+ installed, you may
	# initialize and index your mirror using the following commands:
	public-inbox-init -V2 sisyphus-incominger sisyphus-incominger/ http://lore.altlinux.org/sisyphus-incominger \
		sisyphus-incominger@lists.altlinux.org sisyphus-incominger@lists.altlinux.ru sisyphus-incominger@lists.altlinux.com
	public-inbox-index sisyphus-incominger

Example config snippet for mirrors.
Newsgroup available over NNTP:
	nntp://lore.altlinux.org/org.altlinux.lists.sisyphus-incominger


AGPL code for this site: git clone https://public-inbox.org/public-inbox.git