* [#379109] [test-only] FAILED ftxui.git=6.0.0-alt1 @ 2025-03-24 13:46 Girar awaiter (serjigva) 2025-03-24 13:50 ` [#379109] [test-only] FAILED (try 2) ftxui.git=6.0.0-alt1 pciex.git=0.0.2-alt1 Girar awaiter (serjigva) ` (2 more replies) 0 siblings, 3 replies; 4+ messages in thread From: Girar awaiter (serjigva) @ 2025-03-24 13:46 UTC (permalink / raw) To: Sergey Gvozdetskiy; +Cc: sisyphus-incominger, girar-builder-sisyphus https://git.altlinux.org/tasks/379109/logs/events.1.1.log https://packages.altlinux.org/tasks/379109 subtask name aarch64 i586 x86_64 #100 ftxui 1:28 57 54 2025-Mar-24 13:42:54 :: test-only task #379109 for sisyphus started by serjigva: #100 build 6.0.0-alt1 from /people/serjigva/packages/ftxui.git fetched at 2025-Mar-24 13:42:53 2025-Mar-24 13:42:56 :: [x86_64] #100 ftxui.git 6.0.0-alt1: build start 2025-Mar-24 13:42:56 :: [i586] #100 ftxui.git 6.0.0-alt1: build start 2025-Mar-24 13:42:56 :: [aarch64] #100 ftxui.git 6.0.0-alt1: build start 2025-Mar-24 13:43:50 :: [x86_64] #100 ftxui.git 6.0.0-alt1: build OK 2025-Mar-24 13:43:53 :: [i586] #100 ftxui.git 6.0.0-alt1: build OK 2025-Mar-24 13:44:24 :: [aarch64] #100 ftxui.git 6.0.0-alt1: build OK 2025-Mar-24 13:44:38 :: #100: ftxui.git 6.0.0-alt1: build check OK 2025-Mar-24 13:44:39 :: build check OK 2025-Mar-24 13:44:42 :: noarch check OK 2025-Mar-24 13:44:44 :: plan: src +1 -1 =20009, aarch64 +3 -3 =34725, i586 +3 -3 =33600, x86_64 +3 -3 =35528 #100 ftxui 5.1.0-alt1 -> 6.0.0-alt1 Mon Mar 24 2025 Sergey Gvozdetskiy <serjigva@altlinux> 6.0.0-alt1 - 5.1.0 -> 6.0.0 2025-Mar-24 13:45:24 :: patched apt indices 2025-Mar-24 13:45:33 :: created next repo 2025-Mar-24 13:45:43 :: duplicate provides check OK x86_64: NEW unmet dependencies detected: pciex#0.0.2-alt1:sisyphus+368421.200.2.1@1736436506 libftxui-component.so.5.0.0()(64bit) >= set:mgd7IsDbx3NN2Di0YjNZ5FAgMdgk23xZdZpzf5AS9WjuJzwLGGEbhZzwEaqLlqklN51x5RY5x9EChe4Pr41TsaCCiSWNVWLIv5JhViyUMGLALOQ39WwvwgZ8YaMBzHWuZh4T8 pciex#0.0.2-alt1:sisyphus+368421.200.2.1@1736436506 libftxui-dom.so.5.0.0()(64bit) >= set:lfpKkZg5wKqortIwk6DflqIwhVxQDkidZ8ZD3c6UcbC8XgwjTwCjZBEZiDXtY9cZlCS5uU1Exzr1luG81ZFKOKgIdz37kSafTzHMNCGHZGdZ4gGjB8fPtMI39skWV0f pciex#0.0.2-alt1:sisyphus+368421.200.2.1@1736436506 libftxui-screen.so.5.0.0()(64bit) >= set:kgGggZAhAHYYS4GTtMf8MGL pciex-debuginfo#0.0.2-alt1:sisyphus+368421.200.2.1@1736436506 debug64(libftxui-component.so.5.0.0) pciex-debuginfo#0.0.2-alt1:sisyphus+368421.200.2.1@1736436506 debug64(libftxui-dom.so.5.0.0) pciex-debuginfo#0.0.2-alt1:sisyphus+368421.200.2.1@1736436506 debug64(libftxui-screen.so.5.0.0) i586: NEW unmet dependencies detected: pciex#0.0.2-alt1:sisyphus+368421.200.2.1@1736436448 libftxui-component.so.5.0.0 >= set:mgd7IsDbx3NN2Di0YjNZ5FAgMdgk23xZdZpzf5AS9WjuJzwLGGEbhZzwuCB6llshgohdvho2GpA3NY6hMdDyFFAJusKZrJUZr9hrkKA8eIWbVHcZ09WwvwgZ8YaMBzHWuZh4T8 pciex#0.0.2-alt1:sisyphus+368421.200.2.1@1736436448 libftxui-dom.so.5.0.0 >= set:lfpKkZg5wKqortIwk6DflqIwhVxQDkidZ8ZD3c6UcbC8XgwjTwCjZBEZiDXtY9cZlCS5uU1Exzr1luG81ZFKOKgIdz37kSafTzHMNCGHZGdZ4gGjB8fPtMI39skWV0f pciex#0.0.2-alt1:sisyphus+368421.200.2.1@1736436448 libftxui-screen.so.5.0.0 >= set:kgGggZAhAHYYS4GTtMf8MGL pciex-debuginfo#0.0.2-alt1:sisyphus+368421.200.2.1@1736436448 debug(libftxui-component.so.5.0.0) pciex-debuginfo#0.0.2-alt1:sisyphus+368421.200.2.1@1736436448 debug(libftxui-dom.so.5.0.0) pciex-debuginfo#0.0.2-alt1:sisyphus+368421.200.2.1@1736436448 debug(libftxui-screen.so.5.0.0) aarch64: NEW unmet dependencies detected: pciex#0.0.2-alt1:sisyphus+368421.200.2.1@1736436632 libftxui-component.so.5.0.0()(64bit) >= set:mgd7IsDbx3NN2Di0YjNZ5FAgMdgk23xZdZpzf5AS9WjuJzwLGGEbhZzwEaqLlqklN51x5RY5x9EChe4Pr41TsaCCiSWNVWLIv5JhViyUMGLALOQ39WwvwgZ8YaMBzHWuZh4T8 pciex#0.0.2-alt1:sisyphus+368421.200.2.1@1736436632 libftxui-dom.so.5.0.0()(64bit) >= set:lfpKkZg5wKqortIwk6DflqIwhVxQDkidZ8ZD3c6UcbC8XgwjTwCjZBEZiDXtY9cZlCS5uU1Exzr1luG81ZFKOKgIdz37kSafTzHMNCGHZGdZ4gGjB8fPtMI39skWV0f pciex#0.0.2-alt1:sisyphus+368421.200.2.1@1736436632 libftxui-screen.so.5.0.0()(64bit) >= set:kgGggZAhAHYYS4GTtMf8MGL pciex-debuginfo#0.0.2-alt1:sisyphus+368421.200.2.1@1736436632 debug64(libftxui-component.so.5.0.0) pciex-debuginfo#0.0.2-alt1:sisyphus+368421.200.2.1@1736436632 debug64(libftxui-dom.so.5.0.0) pciex-debuginfo#0.0.2-alt1:sisyphus+368421.200.2.1@1736436632 debug64(libftxui-screen.so.5.0.0) ACLs of affected packages (1): pciex serjigva @everybody 2025-Mar-24 13:46:22 :: unmets: x86_64 +6 -0 =6, i586 +6 -0 =6, aarch64 +6 -0 =9 2025-Mar-24 13:46:22 :: dependencies check FAILED 2025-Mar-24 13:46:22 :: task #379109 for sisyphus FAILED ^ permalink raw reply [flat|nested] 4+ messages in thread
* [#379109] [test-only] FAILED (try 2) ftxui.git=6.0.0-alt1 pciex.git=0.0.2-alt1 2025-03-24 13:46 [#379109] [test-only] FAILED ftxui.git=6.0.0-alt1 Girar awaiter (serjigva) @ 2025-03-24 13:50 ` Girar awaiter (serjigva) 2025-03-28 15:23 ` [#379109] TESTED (try 3) ftxui.git=6.0.0-alt1 pciex.git=0.0.2-alt2 Girar awaiter (serjigva) 2025-03-28 15:26 ` [#379109] DONE (try 4) " Girar pender (serjigva) 2 siblings, 0 replies; 4+ messages in thread From: Girar awaiter (serjigva) @ 2025-03-24 13:50 UTC (permalink / raw) To: Sergey Gvozdetskiy; +Cc: sisyphus-incominger, girar-builder-sisyphus https://git.altlinux.org/tasks/379109/logs/events.2.1.log https://packages.altlinux.org/tasks/379109 subtask name aarch64 i586 x86_64 #200 pciex failed failed failed 2025-Mar-24 13:48:49 :: test-only task #379109 for sisyphus resumed by serjigva: 2025-Mar-24 13:48:49 :: message: ftxui_new_version #100 build 6.0.0-alt1 from /people/serjigva/packages/ftxui.git fetched at 2025-Mar-24 13:42:53 #200 build 0.0.2-alt1 from /gears/p/pciex.git fetched at 2025-Mar-24 13:48:09 from sisyphus 2025-Mar-24 13:48:50 :: created build repo 2025-Mar-24 13:48:51 :: [x86_64] #100 ftxui.git 6.0.0-alt1: build start 2025-Mar-24 13:48:51 :: [i586] #100 ftxui.git 6.0.0-alt1: build start 2025-Mar-24 13:48:51 :: [aarch64] #100 ftxui.git 6.0.0-alt1: build start 2025-Mar-24 13:49:09 :: [i586] #100 ftxui.git 6.0.0-alt1: build OK (cached) 2025-Mar-24 13:49:09 :: [i586] #200 pciex.git 0.0.2-alt1: build start 2025-Mar-24 13:49:09 :: [x86_64] #100 ftxui.git 6.0.0-alt1: build OK (cached) 2025-Mar-24 13:49:10 :: [x86_64] #200 pciex.git 0.0.2-alt1: build start 2025-Mar-24 13:49:28 :: [aarch64] #100 ftxui.git 6.0.0-alt1: build OK (cached) 2025-Mar-24 13:49:28 :: [aarch64] #200 pciex.git 0.0.2-alt1: build start [i586] from /usr/src/RPM/BUILD/pciex-0.0.2/src/ui/ext_cap_comp.cpp:4: [i586] /usr/src/RPM/BUILD/pciex-0.0.2/src/ui/common_comp.h:20:20: error: 'ftxui::Element ui::PushPullButton::Render()' marked 'override', but does not override [i586] 20 | ftxui::Element Render() override; [i586] -- [i586] from /usr/src/RPM/BUILD/pciex-0.0.2/src/ui/compat_cap_comp.cpp:7: [i586] /usr/src/RPM/BUILD/pciex-0.0.2/src/ui/common_comp.h:20:20: error: 'ftxui::Element ui::PushPullButton::Render()' marked 'override', but does not override [i586] 20 | ftxui::Element Render() override; [i586] -- [i586] In file included from /usr/src/RPM/BUILD/pciex-0.0.2/src/main.cpp:11: [i586] /usr/src/RPM/BUILD/pciex-0.0.2/src/ui/screen.h:212:20: error: 'ftxui::Element ui::PCITopoUIComp::Render()' marked 'override', but does not override [i586] 212 | ftxui::Element Render() override final; [i586] /usr/src/RPM/BUILD/pciex-0.0.2/src/ui/screen.h:212:20: error: 'ftxui::Element ui::PCITopoUIComp::Render()' marked 'final', but is not virtual [i586] /usr/src/RPM/BUILD/pciex-0.0.2/src/ui/screen.h:275:20: error: 'ftxui::Element ui::ScrollableComp::Render()' marked 'override', but does not override [i586] 275 | ftxui::Element Render() override final; [i586] /usr/src/RPM/BUILD/pciex-0.0.2/src/ui/screen.h:275:20: error: 'ftxui::Element ui::ScrollableComp::Render()' marked 'final', but is not virtual [i586] /usr/src/RPM/BUILD/pciex-0.0.2/src/ui/screen.h:302:20: error: 'ftxui::Element ui::PCIRegsComponent::Render()' marked 'override', but does not override [i586] 302 | ftxui::Element Render() override; [i586] /usr/src/RPM/BUILD/pciex-0.0.2/src/ui/screen.h:325:20: error: 'ftxui::Element ui::BorderedHoverComp::Render()' marked 'override', but does not override [i586] 325 | ftxui::Element Render() override final; [i586] /usr/src/RPM/BUILD/pciex-0.0.2/src/ui/screen.h:325:20: error: 'ftxui::Element ui::BorderedHoverComp::Render()' marked 'final', but is not virtual [i586] gmake[2]: *** [CMakeFiles/pciex.dir/build.make:135: CMakeFiles/pciex.dir/src/main.cpp.o] Error 1 [i586] -- [i586] In file included from /usr/src/RPM/BUILD/pciex-0.0.2/src/ui/common_comp.cpp:7: [i586] /usr/src/RPM/BUILD/pciex-0.0.2/src/ui/common_comp.h:20:20: error: 'ftxui::Element ui::PushPullButton::Render()' marked 'override', but does not override [i586] 20 | ftxui::Element Render() override; 2025-Mar-24 13:49:35 :: [i586] pciex.git 0.0.2-alt1: remote: build failed 2025-Mar-24 13:49:35 :: [i586] #200 pciex.git 0.0.2-alt1: build FAILED 2025-Mar-24 13:49:35 :: [i586] requesting cancellation of task processing [x86_64] from /usr/src/RPM/BUILD/pciex-0.0.2/src/ui/compat_cap_comp.cpp:7: [x86_64] /usr/src/RPM/BUILD/pciex-0.0.2/src/ui/common_comp.h:20:20: error: 'ftxui::Element ui::PushPullButton::Render()' marked 'override', but does not override [x86_64] 20 | ftxui::Element Render() override; [x86_64] -- [x86_64] from /usr/src/RPM/BUILD/pciex-0.0.2/src/ui/ext_cap_comp.cpp:4: [x86_64] /usr/src/RPM/BUILD/pciex-0.0.2/src/ui/common_comp.h:20:20: error: 'ftxui::Element ui::PushPullButton::Render()' marked 'override', but does not override [x86_64] 20 | ftxui::Element Render() override; [x86_64] -- [x86_64] In file included from /usr/src/RPM/BUILD/pciex-0.0.2/src/main.cpp:11: [x86_64] /usr/src/RPM/BUILD/pciex-0.0.2/src/ui/screen.h:212:20: error: 'ftxui::Element ui::PCITopoUIComp::Render()' marked 'override', but does not override [x86_64] 212 | ftxui::Element Render() override final; [x86_64] /usr/src/RPM/BUILD/pciex-0.0.2/src/ui/screen.h:212:20: error: 'ftxui::Element ui::PCITopoUIComp::Render()' marked 'final', but is not virtual [x86_64] /usr/src/RPM/BUILD/pciex-0.0.2/src/ui/screen.h:275:20: error: 'ftxui::Element ui::ScrollableComp::Render()' marked 'override', but does not override [x86_64] 275 | ftxui::Element Render() override final; [x86_64] /usr/src/RPM/BUILD/pciex-0.0.2/src/ui/screen.h:275:20: error: 'ftxui::Element ui::ScrollableComp::Render()' marked 'final', but is not virtual [x86_64] /usr/src/RPM/BUILD/pciex-0.0.2/src/ui/screen.h:302:20: error: 'ftxui::Element ui::PCIRegsComponent::Render()' marked 'override', but does not override [x86_64] 302 | ftxui::Element Render() override; [x86_64] /usr/src/RPM/BUILD/pciex-0.0.2/src/ui/screen.h:325:20: error: 'ftxui::Element ui::BorderedHoverComp::Render()' marked 'override', but does not override [x86_64] 325 | ftxui::Element Render() override final; [x86_64] /usr/src/RPM/BUILD/pciex-0.0.2/src/ui/screen.h:325:20: error: 'ftxui::Element ui::BorderedHoverComp::Render()' marked 'final', but is not virtual [x86_64] gmake[2]: *** [CMakeFiles/pciex.dir/build.make:135: CMakeFiles/pciex.dir/src/main.cpp.o] Error 1 [x86_64] -- [x86_64] In file included from /usr/src/RPM/BUILD/pciex-0.0.2/src/ui/screen.cpp:7: [x86_64] /usr/src/RPM/BUILD/pciex-0.0.2/src/ui/screen.h:212:20: error: 'ftxui::Element ui::PCITopoUIComp::Render()' marked 'override', but does not override [x86_64] 212 | ftxui::Element Render() override final; 2025-Mar-24 13:49:36 :: [x86_64] pciex.git 0.0.2-alt1: remote: build failed 2025-Mar-24 13:49:36 :: [x86_64] #200 pciex.git 0.0.2-alt1: build FAILED [aarch64] from /usr/src/RPM/BUILD/pciex-0.0.2/src/ui/ext_cap_comp.cpp:4: [aarch64] /usr/src/RPM/BUILD/pciex-0.0.2/src/ui/common_comp.h:20:20: error: 'ftxui::Element ui::PushPullButton::Render()' marked 'override', but does not override [aarch64] 20 | ftxui::Element Render() override; [aarch64] -- [aarch64] from /usr/src/RPM/BUILD/pciex-0.0.2/src/ui/compat_cap_comp.cpp:7: [aarch64] /usr/src/RPM/BUILD/pciex-0.0.2/src/ui/common_comp.h:20:20: error: 'ftxui::Element ui::PushPullButton::Render()' marked 'override', but does not override [aarch64] 20 | ftxui::Element Render() override; [aarch64] -- [aarch64] In file included from /usr/src/RPM/BUILD/pciex-0.0.2/src/main.cpp:11: [aarch64] /usr/src/RPM/BUILD/pciex-0.0.2/src/ui/screen.h:212:20: error: 'ftxui::Element ui::PCITopoUIComp::Render()' marked 'override', but does not override [aarch64] 212 | ftxui::Element Render() override final; [aarch64] /usr/src/RPM/BUILD/pciex-0.0.2/src/ui/screen.h:212:20: error: 'ftxui::Element ui::PCITopoUIComp::Render()' marked 'final', but is not virtual [aarch64] /usr/src/RPM/BUILD/pciex-0.0.2/src/ui/screen.h:275:20: error: 'ftxui::Element ui::ScrollableComp::Render()' marked 'override', but does not override [aarch64] 275 | ftxui::Element Render() override final; [aarch64] /usr/src/RPM/BUILD/pciex-0.0.2/src/ui/screen.h:275:20: error: 'ftxui::Element ui::ScrollableComp::Render()' marked 'final', but is not virtual [aarch64] /usr/src/RPM/BUILD/pciex-0.0.2/src/ui/screen.h:302:20: error: 'ftxui::Element ui::PCIRegsComponent::Render()' marked 'override', but does not override [aarch64] 302 | ftxui::Element Render() override; [aarch64] /usr/src/RPM/BUILD/pciex-0.0.2/src/ui/screen.h:325:20: error: 'ftxui::Element ui::BorderedHoverComp::Render()' marked 'override', but does not override [aarch64] 325 | ftxui::Element Render() override final; [aarch64] /usr/src/RPM/BUILD/pciex-0.0.2/src/ui/screen.h:325:20: error: 'ftxui::Element ui::BorderedHoverComp::Render()' marked 'final', but is not virtual [aarch64] gmake[2]: *** [CMakeFiles/pciex.dir/build.make:135: CMakeFiles/pciex.dir/src/main.cpp.o] Error 1 [aarch64] -- [aarch64] In file included from /usr/src/RPM/BUILD/pciex-0.0.2/src/ui/common_comp.cpp:7: [aarch64] /usr/src/RPM/BUILD/pciex-0.0.2/src/ui/common_comp.h:20:20: error: 'ftxui::Element ui::PushPullButton::Render()' marked 'override', but does not override [aarch64] 20 | ftxui::Element Render() override; 2025-Mar-24 13:50:21 :: [aarch64] pciex.git 0.0.2-alt1: remote: build failed 2025-Mar-24 13:50:21 :: [aarch64] #200 pciex.git 0.0.2-alt1: build FAILED 2025-Mar-24 13:49:35 :: [i586] build FAILED 2025-Mar-24 13:49:36 :: [x86_64] build FAILED 2025-Mar-24 13:50:21 :: [aarch64] build FAILED 2025-Mar-24 13:50:21 :: task #379109 for sisyphus FAILED ^ permalink raw reply [flat|nested] 4+ messages in thread
* [#379109] TESTED (try 3) ftxui.git=6.0.0-alt1 pciex.git=0.0.2-alt2 2025-03-24 13:46 [#379109] [test-only] FAILED ftxui.git=6.0.0-alt1 Girar awaiter (serjigva) 2025-03-24 13:50 ` [#379109] [test-only] FAILED (try 2) ftxui.git=6.0.0-alt1 pciex.git=0.0.2-alt1 Girar awaiter (serjigva) @ 2025-03-28 15:23 ` Girar awaiter (serjigva) 2025-03-28 15:26 ` [#379109] DONE (try 4) " Girar pender (serjigva) 2 siblings, 0 replies; 4+ messages in thread From: Girar awaiter (serjigva) @ 2025-03-28 15:23 UTC (permalink / raw) To: Sergey Gvozdetskiy; +Cc: sisyphus-incominger, girar-builder-sisyphus https://git.altlinux.org/tasks/379109/logs/events.3.1.log https://packages.altlinux.org/tasks/379109 subtask name aarch64 i586 x86_64 #300 ftxui 1:45 1:06 1:02 #400 pciex 1:03 40 38 2025-Mar-28 15:15:26 :: test-only task #379109 for sisyphus resumed by serjigva: 2025-Mar-28 15:15:26 :: message: ftxui_new_version #100 removed #200 removed #300 build 6.0.0-alt1 from /people/serjigva/packages/ftxui.git fetched at 2025-Mar-28 15:04:41 #400 build 0.0.2-alt2 from /people/serjigva/packages/pciex.git fetched at 2025-Mar-28 15:14:54 2025-Mar-28 15:15:27 :: created build repo 2025-Mar-28 15:15:28 :: [aarch64] #300 ftxui.git 6.0.0-alt1: build start 2025-Mar-28 15:15:28 :: [x86_64] #300 ftxui.git 6.0.0-alt1: build start 2025-Mar-28 15:15:28 :: [i586] #300 ftxui.git 6.0.0-alt1: build start 2025-Mar-28 15:16:30 :: [x86_64] #300 ftxui.git 6.0.0-alt1: build OK 2025-Mar-28 15:16:31 :: [x86_64] #400 pciex.git 0.0.2-alt2: build start 2025-Mar-28 15:16:34 :: [i586] #300 ftxui.git 6.0.0-alt1: build OK 2025-Mar-28 15:16:34 :: [i586] #400 pciex.git 0.0.2-alt2: build start 2025-Mar-28 15:17:09 :: [x86_64] #400 pciex.git 0.0.2-alt2: build OK 2025-Mar-28 15:17:13 :: [aarch64] #300 ftxui.git 6.0.0-alt1: build OK 2025-Mar-28 15:17:14 :: [aarch64] #400 pciex.git 0.0.2-alt2: build start 2025-Mar-28 15:17:14 :: [i586] #400 pciex.git 0.0.2-alt2: build OK 2025-Mar-28 15:18:17 :: [aarch64] #400 pciex.git 0.0.2-alt2: build OK 2025-Mar-28 15:18:30 :: #300: ftxui.git 6.0.0-alt1: build check OK 2025-Mar-28 15:18:39 :: #400: pciex.git 0.0.2-alt2: build check OK 2025-Mar-28 15:18:40 :: build check OK 2025-Mar-28 15:18:46 :: noarch check OK 2025-Mar-28 15:18:48 :: plan: src +2 -2 =20033, aarch64 +5 -5 =34820, i586 +5 -5 =33689, x86_64 +5 -5 =35626 #300 ftxui 5.1.0-alt1 -> 6.0.0-alt1 Fri Mar 28 2025 Sergey Gvozdetskiy <serjigva@altlinux> 6.0.0-alt1 - 5.1.0 -> 6.0.0. #400 pciex 0.0.2-alt1 -> 0.0.2-alt2 Fri Mar 28 2025 Sergey Gvozdetskiy <serjigva@altlinux> 0.0.2-alt2 - Applied hotfix patch from upstream to link libftxui-6.0.0. - Added some fixes to create pciex_version.h which provides correct output with --version argument. 2025-Mar-28 15:19:27 :: patched apt indices 2025-Mar-28 15:19:35 :: created next repo 2025-Mar-28 15:19:45 :: duplicate provides check OK 2025-Mar-28 15:20:22 :: dependencies check OK 2025-Mar-28 15:20:51 :: [x86_64 i586 aarch64] ELF symbols check OK i586: libftxui-devel=6.0.0-alt1 post-install unowned files: /usr/lib/cmake 2025-Mar-28 15:21:05 :: [i586] #300 libftxui-devel: install check OK x86_64: libftxui-devel=6.0.0-alt1 post-install unowned files: /usr/lib64/cmake 2025-Mar-28 15:21:06 :: [x86_64] #300 libftxui-devel: install check OK 2025-Mar-28 15:21:11 :: [i586] #300 libftxui0: install check OK 2025-Mar-28 15:21:12 :: [x86_64] #300 libftxui0: install check OK aarch64: libftxui-devel=6.0.0-alt1 post-install unowned files: /usr/lib64/cmake 2025-Mar-28 15:21:14 :: [aarch64] #300 libftxui-devel: install check OK 2025-Mar-28 15:21:19 :: [i586] #300 libftxui0-debuginfo: install check OK 2025-Mar-28 15:21:20 :: [x86_64] #300 libftxui0-debuginfo: install check OK 2025-Mar-28 15:21:25 :: [aarch64] #300 libftxui0: install check OK 2025-Mar-28 15:21:26 :: [i586] #400 pciex: install check OK 2025-Mar-28 15:21:27 :: [x86_64] #400 pciex: install check OK 2025-Mar-28 15:21:34 :: [i586] #400 pciex-debuginfo: install check OK 2025-Mar-28 15:21:35 :: [x86_64] #400 pciex-debuginfo: install check OK 2025-Mar-28 15:21:38 :: [aarch64] #300 libftxui0-debuginfo: install check OK 2025-Mar-28 15:21:49 :: [aarch64] #400 pciex: install check OK 2025-Mar-28 15:22:03 :: [aarch64] #400 pciex-debuginfo: install check OK 2025-Mar-28 15:22:04 :: [x86_64-i586] plan: #2 +2 -2 =11597 2025-Mar-28 15:22:22 :: [x86_64-i586] arepo build OK 2025-Mar-28 15:22:38 :: [x86_64-i586] generated apt indices 2025-Mar-28 15:22:40 :: [x86_64-i586] created next repo 2025-Mar-28 15:22:51 :: [x86_64-i586] dependencies check OK 2025-Mar-28 15:22:53 :: gears inheritance check OK 2025-Mar-28 15:22:53 :: srpm inheritance check OK girar-check-perms: access to ftxui ALLOWED for serjigva: project leader check-subtask-perms: #300: ftxui: allowed for serjigva girar-check-perms: access to pciex ALLOWED for serjigva: project leader check-subtask-perms: #400: pciex: allowed for serjigva 2025-Mar-28 15:22:54 :: acl check OK 2025-Mar-28 15:23:07 :: created contents_index files 2025-Mar-28 15:23:15 :: created hash files: aarch64 i586 src x86_64-i586 x86_64 2025-Mar-28 15:23:18 :: task #379109 for sisyphus TESTED ^ permalink raw reply [flat|nested] 4+ messages in thread
* [#379109] DONE (try 4) ftxui.git=6.0.0-alt1 pciex.git=0.0.2-alt2 2025-03-24 13:46 [#379109] [test-only] FAILED ftxui.git=6.0.0-alt1 Girar awaiter (serjigva) 2025-03-24 13:50 ` [#379109] [test-only] FAILED (try 2) ftxui.git=6.0.0-alt1 pciex.git=0.0.2-alt1 Girar awaiter (serjigva) 2025-03-28 15:23 ` [#379109] TESTED (try 3) ftxui.git=6.0.0-alt1 pciex.git=0.0.2-alt2 Girar awaiter (serjigva) @ 2025-03-28 15:26 ` Girar pender (serjigva) 2 siblings, 0 replies; 4+ messages in thread From: Girar pender (serjigva) @ 2025-03-28 15:26 UTC (permalink / raw) To: Sergey Gvozdetskiy; +Cc: sisyphus-incominger, girar-builder-sisyphus https://git.altlinux.org/tasks/archive/done/_370/379109/logs/events.4.1.log https://packages.altlinux.org/tasks/379109 2025-Mar-28 15:25:23 :: task #379109 for sisyphus resumed by serjigva: 2025-Mar-28 15:25:23 :: message: ftxui_new_version girar-check-perms: access to ftxui ALLOWED for serjigva: project leader check-subtask-perms: #300: ftxui: allowed for serjigva girar-check-perms: access to pciex ALLOWED for serjigva: project leader check-subtask-perms: #400: pciex: allowed for serjigva 2025-Mar-28 15:25:23 :: task is ready for commit 2025-Mar-28 15:25:28 :: repo clone OK 2025-Mar-28 15:25:28 :: packages update OK 2025-Mar-28 15:25:35 :: [x86_64 i586 aarch64] update OK 2025-Mar-28 15:25:36 :: [x86_64-i586] update OK 2025-Mar-28 15:25:36 :: repo update OK 2025-Mar-28 15:25:46 :: repo save OK 2025-Mar-28 15:25:46 :: src index update OK 2025-Mar-28 15:25:46 :: updated /gears/f/ftxui.git branch `sisyphus' 2025-Mar-28 15:25:46 :: updated /gears/p/pciex.git branch `sisyphus' 2025-Mar-28 15:26:40 :: gears update OK 2025-Mar-28 15:26:40 :: task #379109 for sisyphus DONE ^ permalink raw reply [flat|nested] 4+ messages in thread
end of thread, other threads:[~2025-03-28 15:26 UTC | newest] Thread overview: 4+ messages (download: mbox.gz / follow: Atom feed) -- links below jump to the message on this page -- 2025-03-24 13:46 [#379109] [test-only] FAILED ftxui.git=6.0.0-alt1 Girar awaiter (serjigva) 2025-03-24 13:50 ` [#379109] [test-only] FAILED (try 2) ftxui.git=6.0.0-alt1 pciex.git=0.0.2-alt1 Girar awaiter (serjigva) 2025-03-28 15:23 ` [#379109] TESTED (try 3) ftxui.git=6.0.0-alt1 pciex.git=0.0.2-alt2 Girar awaiter (serjigva) 2025-03-28 15:26 ` [#379109] DONE (try 4) " Girar pender (serjigva)
ALT Linux Girar Builder robot reports This inbox may be cloned and mirrored by anyone: git clone --mirror http://lore.altlinux.org/sisyphus-incominger/0 sisyphus-incominger/git/0.git # If you have public-inbox 1.1+ installed, you may # initialize and index your mirror using the following commands: public-inbox-init -V2 sisyphus-incominger sisyphus-incominger/ http://lore.altlinux.org/sisyphus-incominger \ sisyphus-incominger@lists.altlinux.org sisyphus-incominger@lists.altlinux.ru sisyphus-incominger@lists.altlinux.com public-inbox-index sisyphus-incominger Example config snippet for mirrors. Newsgroup available over NNTP: nntp://lore.altlinux.org/org.altlinux.lists.sisyphus-incominger AGPL code for this site: git clone https://public-inbox.org/public-inbox.git