From mboxrd@z Thu Jan  1 00:00:00 1970
Return-Path: <girar-builder@altlinux.org>
X-Spam-Checker-Version: SpamAssassin 3.4.1 (2015-04-28) on
 sa.local.altlinux.org
X-Spam-Level: 
X-Spam-Status: No, score=-3.3 required=5.0 tests=BAYES_00,RP_MATCHES_RCVD
 autolearn=unavailable autolearn_force=no version=3.4.1
Date: Fri, 21 Mar 2025 12:54:32 +0000
From: "Girar awaiter (darisishe)" <girar-builder@altlinux.org>
To: Sergey Konev <darisishe@altlinux.org>
Subject: [#378500] p11 FAILED (try 4)
 kernel-modules-zfs-6.12.git=sisyphus/kernel-modules-zfs-6.12-2.3.1-alt2 ...
Message-ID: <girar.task.378500.4.1@gyle.mskdc.altlinux.org>
Mail-Followup-To: Girar awaiter robot <girar-builder@altlinux.org>
References: <girar.task.378500.3.1@gyle.mskdc.altlinux.org>
 <girar.task.378500.2.1@gyle.mskdc.altlinux.org>
 <girar.task.378500.1.1@gyle.mskdc.altlinux.org>
MIME-Version: 1.0
Content-Type: text/plain; charset=us-ascii
Content-Disposition: inline
In-Reply-To: <girar.task.378500.1.1@gyle.mskdc.altlinux.org>
X-girar-task-id: 378500
X-girar-task-owner: darisishe
X-girar-task-repo: p11
X-girar-task-try: 4
X-girar-task-iter: 1
X-girar-task-status: FAILED
X-girar-task-URL: https://git.altlinux.org/tasks/378500/
X-girar-task-log: logs/events.4.1.log
X-girar-task-summary: [#378500] p11 FAILED (try 4)
 kernel-modules-zfs-6.12.git=sisyphus/kernel-modules-zfs-6.12-2.3.1-alt2
 proxmox-backup.git=3.3.3.1-alt3 make-initrd-pbs.git=1.0.6-alt1
 rpm-build-initrd-pbs.git=0.1-alt1
 proxmox-backup-restore-image.git=3.3.3.1-alt1
User-Agent: Mutt/1.10.1 (2018-07-13)
Cc: sisyphus-incominger@lists.altlinux.org, girar-builder-p11@altlinux.org,
 girar-builder-p11@lists.altlinux.org
X-BeenThere: sisyphus-incominger@lists.altlinux.org
X-Mailman-Version: 2.1.12
Precedence: list
Reply-To: ALT Devel discussion list <devel@lists.altlinux.org>
List-Id: ALT Linux Girar Builder robot reports
 <sisyphus-incominger.lists.altlinux.org>
List-Unsubscribe: <https://lists.altlinux.org/mailman/options/sisyphus-incominger>, 
 <mailto:sisyphus-incominger-request@lists.altlinux.org?subject=unsubscribe>
List-Archive: <http://lists.altlinux.org/pipermail/sisyphus-incominger>
List-Post: <mailto:sisyphus-incominger@lists.altlinux.org>
List-Help: <mailto:sisyphus-incominger-request@lists.altlinux.org?subject=help>
List-Subscribe: <https://lists.altlinux.org/mailman/listinfo/sisyphus-incominger>, 
 <mailto:sisyphus-incominger-request@lists.altlinux.org?subject=subscribe>
X-List-Received-Date: Fri, 21 Mar 2025 12:54:35 -0000
Archived-At: <http://lore.altlinux.org/sisyphus-incominger/girar.task.378500.4.1@gyle.mskdc.altlinux.org/>
List-Archive: <http://lore.altlinux.org/sisyphus-incominger/>

https://git.altlinux.org/tasks/378500/logs/events.4.1.log
https://packages.altlinux.org/tasks/378500

subtask  name                     aarch64  i586  x86_64
   #600  kernel-modules-zfs-6.12   failed     -  failed

2025-Mar-21 12:53:52 :: shared task #378500 for p11 resumed by darisishe:
2025-Mar-21 12:53:52 :: message: New_restore-image_build_strategy
#100 removed
#200 removed
#240 removed
#300 removed
#400 removed
#440 removed
#460 removed
#470 removed
#500 removed
#600 build sisyphus/kernel-modules-zfs-6.12-2.3.1-alt2 from /gears/k/kernel-modules-zfs-6.12.git fetched at 2025-Mar-21 12:52:25 from sisyphus
#700 build 3.3.3.1-alt3 from /gears/p/proxmox-backup.git fetched at 2025-Mar-21 12:53:01 from sisyphus
#1000 build 1.0.6-alt1 from /gears/m/make-initrd-pbs.git fetched at 2025-Mar-21 12:53:06 from sisyphus
#1100 build 0.1-alt1 from /gears/r/rpm-build-initrd-pbs.git fetched at 2025-Mar-21 12:53:13 from sisyphus
#1200 build 3.3.3.1-alt1 from /gears/p/proxmox-backup-restore-image.git fetched at 2025-Mar-21 12:53:19 from sisyphus
2025-Mar-21 12:53:53 :: created build repo
2025-Mar-21 12:53:54 :: [i586] #600 kernel-modules-zfs-6.12.git sisyphus/kernel-modules-zfs-6.12-2.3.1-alt2: build start
2025-Mar-21 12:53:54 :: [aarch64] #600 kernel-modules-zfs-6.12.git sisyphus/kernel-modules-zfs-6.12-2.3.1-alt2: build start
2025-Mar-21 12:53:54 :: [x86_64] #600 kernel-modules-zfs-6.12.git sisyphus/kernel-modules-zfs-6.12-2.3.1-alt2: build start
2025-Mar-21 12:54:13 :: [i586] #600 kernel-modules-zfs-6.12.git sisyphus/kernel-modules-zfs-6.12-2.3.1-alt2: build SKIPPED
2025-Mar-21 12:54:14 :: [i586] #700 proxmox-backup.git 3.3.3.1-alt3: build start
[x86_64] <13>Mar 21 12:54:11 rpmi: rpmquery-strictdep-1-alt1 sisyphus+227992.440.11.1 1556321045 installed
[x86_64] <13>Mar 21 12:54:11 rpmi: chrooted-0.3.12-alt1 sisyphus+327286.5300.14.1 1711487147 installed
[x86_64] <13>Mar 21 12:54:11 rpmi: chrooted-resolv-0.3.1-alt2 sisyphus+276781.100.1.1 1625232499 installed
[x86_64] <13>Mar 21 12:54:11 rpmi: pciids-20240429-alt1 sisyphus+347144.100.1.1 1714367867 installed
[x86_64] <13>Mar 21 12:54:11 rpmi: libpci-3.13.0-alt1 p11+350696.100.1.1 1717993790 installed
[x86_64] <13>Mar 21 12:54:11 rpmi: pciutils-3.13.0-alt1 p11+350696.100.1.1 1717993790 installed
[x86_64] <13>Mar 21 12:54:11 rpmi: libjson-c5-0.17-alt1 sisyphus+332175.100.1.1 1697724741 installed
[x86_64] <13>Mar 21 12:54:11 rpmi: libdevmapper-1.02.204-alt1 p11+375051.100.2.1 1741773900 installed
[x86_64] <13>Mar 21 12:54:11 rpmi: mount-2.39.2-alt1 p11+348780.400.1.1 1716835569 installed
[x86_64] <13>Mar 21 12:54:11 rpmi: losetup-2.39.2-alt1 p11+348780.400.1.1 1716835569 installed
[x86_64] <13>Mar 21 12:54:11 rpmi: openssl-config-3.2.0-alt1 p11+370688.200.3.1 1738846989 installed
[x86_64] <13>Mar 21 12:54:11 rpmi: lsblk-2.39.2-alt1 p11+348780.400.1.1 1716835569 installed
[x86_64] <13>Mar 21 12:54:11 rpmi: libp11-kit-1:0.25.5-alt1 p11+352554.100.2.1 1721826035 installed
[x86_64] <13>Mar 21 12:54:11 rpmi: libtasn1-4.20.0-alt1 p11+374933.100.1.1 1739641422 installed
[x86_64] <13>Mar 21 12:54:11 rpmi: rpm-macros-alternatives-0.5.3-alt1 p11+371884.100.2.1 1738152096 installed
[x86_64] <13>Mar 21 12:54:11 rpmi: alternatives-0.5.3-alt1 p11+371884.100.2.1 1738152096 installed
[x86_64] <13>Mar 21 12:54:11 rpmi: ca-certificates-2024.12.10-alt1 p11+371739.200.1.1 1737807628 installed
[x86_64] <13>Mar 21 12:54:11 rpmi: ca-trust-0.2.0-alt1 sisyphus+344843.100.1.1 1712743326 installed
[x86_64] <13>Mar 21 12:54:11 rpmi: p11-kit-trust-1:0.25.5-alt1 p11+352554.100.2.1 1721826035 installed
[x86_64] <13>Mar 21 12:54:11 rpmi: libcrypto3-3.3.3-alt1 p11+374399.100.2.1 1739522329 installed
[x86_64] <13>Mar 21 12:54:11 rpmi: libkmod-31-alt1 sisyphus+330699.100.1.1 1696072422 installed
[x86_64] <13>Mar 21 12:54:11 rpmi: kmod-31-alt1 sisyphus+330699.100.1.1 1696072422 installed
[x86_64] <13>Mar 21 12:54:11 rpmi: dmsetup-1.02.204-alt1 p11+375051.100.2.1 1741773900 installed
[x86_64] <86>Mar 21 12:54:11 groupadd[1011326]: group added to /etc/group: name=tape, GID=999
[x86_64] <86>Mar 21 12:54:11 groupadd[1011326]: group added to /etc/gshadow: name=tape
[x86_64] <86>Mar 21 12:54:11 groupadd[1011326]: new group: name=tape, GID=999
[x86_64] <86>Mar 21 12:54:11 groupadd[1011337]: group added to /etc/group: name=dialout, GID=998
[x86_64] <86>Mar 21 12:54:11 groupadd[1011337]: group added to /etc/gshadow: name=dialout
[x86_64] <86>Mar 21 12:54:11 groupadd[1011337]: new group: name=dialout, GID=998
[x86_64] <86>Mar 21 12:54:11 groupadd[1011343]: group added to /etc/group: name=input, GID=997
[x86_64] <86>Mar 21 12:54:11 groupadd[1011343]: group added to /etc/gshadow: name=input
[x86_64] <86>Mar 21 12:54:11 groupadd[1011343]: new group: name=input, GID=997
[x86_64] <86>Mar 21 12:54:11 groupadd[1011349]: group added to /etc/group: name=video, GID=996
[x86_64] <86>Mar 21 12:54:11 groupadd[1011349]: group added to /etc/gshadow: name=video
[x86_64] <86>Mar 21 12:54:11 groupadd[1011349]: new group: name=video, GID=996
[x86_64] <86>Mar 21 12:54:11 groupadd[1011355]: group added to /etc/group: name=render, GID=995
[x86_64] <86>Mar 21 12:54:11 groupadd[1011355]: group added to /etc/gshadow: name=render
[x86_64] <86>Mar 21 12:54:11 groupadd[1011355]: new group: name=render, GID=995
[x86_64] <86>Mar 21 12:54:11 groupadd[1011361]: group added to /etc/group: name=sgx, GID=994
[x86_64] <86>Mar 21 12:54:11 groupadd[1011361]: group added to /etc/gshadow: name=sgx
[x86_64] <86>Mar 21 12:54:11 groupadd[1011361]: new group: name=sgx, GID=994
[x86_64] <13>Mar 21 12:54:12 rpmi: udev-1:255.11-alt1 p11+356646.300.27.1 1729412525 installed
[x86_64] <13>Mar 21 12:54:12 rpmi: make-initrd-2.51.0-alt1.1 p11+376076.100.1.1 1740493661 installed
[x86_64] <13>Mar 21 12:54:12 rpmi: rpm-build-kernel-0.126-alt1 p11+374291.100.2.1 1739432687 installed
[x86_64] <13>Mar 21 12:54:13 rpmi: kernel-headers-modules-6.12-6.12.19-alt1 p11+377864.100.2.1 1742322471 installed
[x86_64] environment: line 3: shift: shift count out of range
[x86_64] warning: line 40: Deprecated PreReq converted to Requires(pre,postun): PreReq: kernel-image-6.12 = 6.12.19-alt1
[x86_64] Reading Package Lists...
[x86_64] Building Dependency Tree...
[x86_64] kernel-headers-modules-6.12 is already the newest version.
[x86_64] Version kernel-headers-modules-6.12#6.12.19-alt1:p11+377864.100.2.1@1742322471 for kernel-headers-modules-6.12=6.12.19-alt1 is already installed
[x86_64] kernel-headers-modules-6.12 is already the newest version.
[x86_64] rpm-build-kernel is already the newest version.
[x86_64] Version kernel-headers-modules-6.12#6.12.19-alt1:p11+377864.100.2.1@1742322471 for kernel-headers-modules-6.12=6.12.19-alt1 is already installed
[x86_64] kernel-headers-modules-6.12 is already the newest version.
[x86_64] E: Version ='2.3.1' for 'kernel-source-zfs' was not found
[x86_64] hsh-install: Failed to calculate package file list.
[x86_64] hsh-install: Failed to generate package file list.
2025-Mar-21 12:54:14 :: [x86_64] kernel-modules-zfs-6.12.git sisyphus/kernel-modules-zfs-6.12-2.3.1-alt2: remote: cannot build src.rpm
2025-Mar-21 12:54:14 :: [x86_64] #600 kernel-modules-zfs-6.12.git sisyphus/kernel-modules-zfs-6.12-2.3.1-alt2: build FAILED
2025-Mar-21 12:54:14 :: [x86_64] requesting cancellation of task processing
2025-Mar-21 12:54:28 :: [i586] #700 proxmox-backup.git 3.3.3.1-alt3: build SKIPPED
2025-Mar-21 12:54:29 :: [i586] task processing CANCELLED
[aarch64] <13>Mar 21 12:54:27 rpmi: rpmquery-strictdep-1-alt1 sisyphus+227992.440.11.1 1556321045 installed
[aarch64] <13>Mar 21 12:54:27 rpmi: chrooted-0.3.12-alt1 sisyphus+327286.5300.14.1 1711487147 installed
[aarch64] <13>Mar 21 12:54:27 rpmi: chrooted-resolv-0.3.1-alt2 sisyphus+276781.100.1.1 1625232497 installed
[aarch64] <13>Mar 21 12:54:27 rpmi: pciids-20240429-alt1 sisyphus+347144.100.1.1 1714367867 installed
[aarch64] <13>Mar 21 12:54:27 rpmi: libpci-3.13.0-alt1 p11+350696.100.1.1 1717993797 installed
[aarch64] <13>Mar 21 12:54:27 rpmi: pciutils-3.13.0-alt1 p11+350696.100.1.1 1717993797 installed
[aarch64] <13>Mar 21 12:54:27 rpmi: libjson-c5-0.17-alt1 sisyphus+332175.100.1.1 1697724764 installed
[aarch64] <13>Mar 21 12:54:27 rpmi: libdevmapper-1.02.204-alt1 p11+375051.100.2.1 1741773981 installed
[aarch64] <13>Mar 21 12:54:27 rpmi: mount-2.39.2-alt1 p11+348780.400.1.1 1716835741 installed
[aarch64] <13>Mar 21 12:54:27 rpmi: losetup-2.39.2-alt1 p11+348780.400.1.1 1716835741 installed
[aarch64] <13>Mar 21 12:54:27 rpmi: openssl-config-3.2.0-alt1 p11+370688.200.3.1 1738846989 installed
[aarch64] <13>Mar 21 12:54:27 rpmi: lsblk-2.39.2-alt1 p11+348780.400.1.1 1716835741 installed
[aarch64] <13>Mar 21 12:54:27 rpmi: libp11-kit-1:0.25.5-alt1 p11+352554.100.2.1 1721826177 installed
[aarch64] <13>Mar 21 12:54:27 rpmi: libtasn1-4.20.0-alt1 p11+374933.100.1.1 1739641456 installed
[aarch64] <13>Mar 21 12:54:27 rpmi: rpm-macros-alternatives-0.5.3-alt1 p11+371884.100.2.1 1738152096 installed
[aarch64] <13>Mar 21 12:54:27 rpmi: alternatives-0.5.3-alt1 p11+371884.100.2.1 1738152096 installed
[aarch64] <13>Mar 21 12:54:27 rpmi: ca-certificates-2024.12.10-alt1 p11+371739.200.1.1 1737807628 installed
[aarch64] <13>Mar 21 12:54:27 rpmi: ca-trust-0.2.0-alt1 sisyphus+344843.100.1.1 1712743326 installed
[aarch64] <13>Mar 21 12:54:27 rpmi: p11-kit-trust-1:0.25.5-alt1 p11+352554.100.2.1 1721826177 installed
[aarch64] <13>Mar 21 12:54:27 rpmi: libcrypto3-3.3.3-alt1 p11+374399.100.2.1 1739522843 installed
[aarch64] <13>Mar 21 12:54:27 rpmi: libkmod-31-alt1 sisyphus+330699.100.1.1 1696072458 installed
[aarch64] <13>Mar 21 12:54:27 rpmi: kmod-31-alt1 sisyphus+330699.100.1.1 1696072458 installed
[aarch64] <13>Mar 21 12:54:27 rpmi: dmsetup-1.02.204-alt1 p11+375051.100.2.1 1741773981 installed
[aarch64] <86>Mar 21 12:54:27 groupadd[3890286]: group added to /etc/group: name=tape, GID=999
[aarch64] <86>Mar 21 12:54:27 groupadd[3890286]: group added to /etc/gshadow: name=tape
[aarch64] <86>Mar 21 12:54:27 groupadd[3890286]: new group: name=tape, GID=999
[aarch64] <86>Mar 21 12:54:27 groupadd[3890292]: group added to /etc/group: name=dialout, GID=998
[aarch64] <86>Mar 21 12:54:27 groupadd[3890292]: group added to /etc/gshadow: name=dialout
[aarch64] <86>Mar 21 12:54:27 groupadd[3890292]: new group: name=dialout, GID=998
[aarch64] <86>Mar 21 12:54:27 groupadd[3890298]: group added to /etc/group: name=input, GID=997
[aarch64] <86>Mar 21 12:54:27 groupadd[3890298]: group added to /etc/gshadow: name=input
[aarch64] <86>Mar 21 12:54:27 groupadd[3890298]: new group: name=input, GID=997
[aarch64] <86>Mar 21 12:54:27 groupadd[3890304]: group added to /etc/group: name=video, GID=996
[aarch64] <86>Mar 21 12:54:27 groupadd[3890304]: group added to /etc/gshadow: name=video
[aarch64] <86>Mar 21 12:54:27 groupadd[3890304]: new group: name=video, GID=996
[aarch64] <86>Mar 21 12:54:27 groupadd[3890310]: group added to /etc/group: name=render, GID=995
[aarch64] <86>Mar 21 12:54:27 groupadd[3890310]: group added to /etc/gshadow: name=render
[aarch64] <86>Mar 21 12:54:27 groupadd[3890310]: new group: name=render, GID=995
[aarch64] <86>Mar 21 12:54:27 groupadd[3890316]: group added to /etc/group: name=sgx, GID=994
[aarch64] <86>Mar 21 12:54:27 groupadd[3890316]: group added to /etc/gshadow: name=sgx
[aarch64] <86>Mar 21 12:54:27 groupadd[3890316]: new group: name=sgx, GID=994
[aarch64] <13>Mar 21 12:54:27 rpmi: udev-1:255.11-alt1 p11+356646.300.27.1 1729412866 installed
[aarch64] <13>Mar 21 12:54:28 rpmi: make-initrd-2.51.0-alt1.1 p11+376076.100.1.1 1740493715 installed
[aarch64] <13>Mar 21 12:54:28 rpmi: rpm-build-kernel-0.126-alt1 p11+374291.100.2.1 1739432696 installed
[aarch64] <13>Mar 21 12:54:29 rpmi: kernel-headers-modules-6.12-6.12.19-alt1 p11+377864.100.2.1 1742323279 installed
[aarch64] environment: line 3: shift: shift count out of range
[aarch64] warning: line 40: Deprecated PreReq converted to Requires(pre,postun): PreReq: kernel-image-6.12 = 6.12.19-alt1
[aarch64] Reading Package Lists...
[aarch64] Building Dependency Tree...
[aarch64] kernel-headers-modules-6.12 is already the newest version.
[aarch64] Version kernel-headers-modules-6.12#6.12.19-alt1:p11+377864.100.2.1@1742323279 for kernel-headers-modules-6.12=6.12.19-alt1 is already installed
[aarch64] kernel-headers-modules-6.12 is already the newest version.
[aarch64] rpm-build-kernel is already the newest version.
[aarch64] Version kernel-headers-modules-6.12#6.12.19-alt1:p11+377864.100.2.1@1742323279 for kernel-headers-modules-6.12=6.12.19-alt1 is already installed
[aarch64] kernel-headers-modules-6.12 is already the newest version.
[aarch64] E: Version ='2.3.1' for 'kernel-source-zfs' was not found
[aarch64] hsh-install: Failed to calculate package file list.
[aarch64] hsh-install: Failed to generate package file list.
2025-Mar-21 12:54:31 :: [aarch64] kernel-modules-zfs-6.12.git sisyphus/kernel-modules-zfs-6.12-2.3.1-alt2: remote: cannot build src.rpm
2025-Mar-21 12:54:31 :: [aarch64] #600 kernel-modules-zfs-6.12.git sisyphus/kernel-modules-zfs-6.12-2.3.1-alt2: build FAILED
2025-Mar-21 12:54:14 :: [x86_64] build FAILED
2025-Mar-21 12:54:29 :: [i586] build FAILED
2025-Mar-21 12:54:31 :: [aarch64] build FAILED
2025-Mar-21 12:54:32 :: task #378500 for p11 FAILED