* [#378362] [test-only] FAILED libcbor.git=0.12.0-alt1
@ 2025-03-18 7:45 Girar awaiter (ancieg)
2025-03-18 8:01 ` [#378362] [test-only] FAILED (try 2) libcbor.git=0.12.0-alt1 fwupd.git=2.0.6-alt1 itk.git=5.4.2-alt1 Girar awaiter (ancieg)
` (2 more replies)
0 siblings, 3 replies; 4+ messages in thread
From: Girar awaiter (ancieg) @ 2025-03-18 7:45 UTC (permalink / raw)
To: Anton Zhukharev; +Cc: sisyphus-incominger, girar-builder-sisyphus
https://git.altlinux.org/tasks/378362/logs/events.1.1.log
https://packages.altlinux.org/tasks/378362
subtask name aarch64 i586 x86_64
#100 libcbor 1:03 44 42
2025-Mar-18 07:42:00 :: test-only task #378362 for sisyphus started by ancieg:
#100 build 0.12.0-alt1 from /people/ancieg/packages/libcbor.git fetched at 2025-Mar-18 07:41:59
2025-Mar-18 07:42:02 :: [i586] #100 libcbor.git 0.12.0-alt1: build start
2025-Mar-18 07:42:02 :: [x86_64] #100 libcbor.git 0.12.0-alt1: build start
2025-Mar-18 07:42:02 :: [aarch64] #100 libcbor.git 0.12.0-alt1: build start
2025-Mar-18 07:42:44 :: [x86_64] #100 libcbor.git 0.12.0-alt1: build OK
2025-Mar-18 07:42:46 :: [i586] #100 libcbor.git 0.12.0-alt1: build OK
2025-Mar-18 07:43:05 :: [aarch64] #100 libcbor.git 0.12.0-alt1: build OK
2025-Mar-18 07:43:18 :: #100: libcbor.git 0.12.0-alt1: build check OK
2025-Mar-18 07:43:19 :: build check OK
2025-Mar-18 07:43:21 :: noarch check OK
2025-Mar-18 07:43:23 :: plan: src +1 -1 =19987, aarch64 +3 -3 =34796, i586 +3 -3 =33680, x86_64 +3 -3 =35602
#100 libcbor 0.11.0-alt1 -> 0.12.0-alt1
Tue Mar 18 2025 Anton Zhukharev <ancieg@altlinux> 0.12.0-alt1
- Updated to 0.12.0.
- Enabled check during building.
- Followed Shared Libs Policy.
2025-Mar-18 07:44:03 :: patched apt indices
2025-Mar-18 07:44:11 :: created next repo
2025-Mar-18 07:44:22 :: duplicate provides check OK
x86_64: NEW unmet dependencies detected:
fwupd#2.0.6-alt1:sisyphus+374676.200.2.1@1739548790 libcbor.so.0.11()(64bit) >= set:lfIZqEiO9QWHn60WcYE6wPuxIqkPszZz5ZdCZygGRvZb4p4jjgsqcQ6TuSkN7nLacpyMLS8Z8Q7RHfYdnVHZurI3
fwupd-debuginfo#2.0.6-alt1:sisyphus+374676.200.2.1@1739548790 debug64(libcbor.so.0.11)
libfido2#1.15.0-alt1:sisyphus+352095.100.1.1@1720020163 libcbor.so.0.11()(64bit) >= set:lfIZi9Giz3U8tYmRHEjhH1Hwh1gNb2pREeujDR9plFZcxCZBlKBJRvZbspBcpKleMUZxF98ed5ZcZH82zj3rGeUb3c842TwBRaKWRT7EZdTo7
libfido2-debuginfo#1.15.0-alt1:sisyphus+352095.100.1.1@1720020163 debug64(libcbor.so.0.11)
libitk5.4#5.4.2-alt1:sisyphus+374353.300.12.1@1740067623 libcbor.so.0.11()(64bit) >= set:lgmv9hRQUIT1yBZg2cQwbI85w6RZoQGQIpwR8XnaiZLnGNdSzDyBxfBBcMRnfgJSgq0qo0
libitk5.4-debuginfo#5.4.2-alt1:sisyphus+374353.300.12.1@1740067623 debug64(libcbor.so.0.11)
slicer#5.8.0-alt1:sisyphus+374353.1360.12.1@1740072714 libcbor.so.0.11()(64bit)
slicer-debuginfo#5.8.0-alt1:sisyphus+374353.1360.12.1@1740072714 debug64(libcbor.so.0.11)
i586: NEW unmet dependencies detected:
fwupd#2.0.6-alt1:sisyphus+374676.200.2.1@1739548796 libcbor.so.0.11 >= set:lfIZqEiO9QWHn60WcYE6wPuxIqkPszZz5ZdCZygGRvZb4p4jjgsqcQ6TuSkN7nLacpyMLS8Z8Q7RHfYdnVHZurI3
fwupd-debuginfo#2.0.6-alt1:sisyphus+374676.200.2.1@1739548796 debug(libcbor.so.0.11)
libfido2#1.15.0-alt1:sisyphus+352095.100.1.1@1720020164 libcbor.so.0.11 >= set:lfIZi9Giz3U8tYmRHEjhH1Hwh1gNb2pREeujDR9plFZcxCZBlKBJRv7TB9PJO16ZL8d1NFFEDZDh46D6SktMn6og84K1bHlsRHLfgXXrI3
libfido2-debuginfo#1.15.0-alt1:sisyphus+352095.100.1.1@1720020164 debug(libcbor.so.0.11)
libitk5.4#5.4.2-alt1:sisyphus+374353.300.12.1@1740068493 libcbor.so.0.11 >= set:lgmv9hRQUIT1yBZg2cQwbI85w6RZoQGQIpwR8XnaiZLnGNdSzDyBxfBBcMRnfgJSgq0qo0
libitk5.4-debuginfo#5.4.2-alt1:sisyphus+374353.300.12.1@1740068493 debug(libcbor.so.0.11)
aarch64: NEW unmet dependencies detected:
fwupd#2.0.6-alt1:sisyphus+374676.200.2.1@1739548866 libcbor.so.0.11()(64bit) >= set:lfIZqEiO9QWHn60WcYE6wPuxIqkPszZz5ZdCZygGRvZb4p4jjgsqcQ6TuSkN7nLacpyMLS8Z8Q7RHfYdnVHZurI3
fwupd-debuginfo#2.0.6-alt1:sisyphus+374676.200.2.1@1739548866 debug64(libcbor.so.0.11)
libfido2#1.15.0-alt1:sisyphus+352095.100.1.1@1720020183 libcbor.so.0.11()(64bit) >= set:lfIZi9Giz3U8tYmRHEjhH1Hwh1gNb2pREeujDR9plFZcxCZBlKBJRvZbspBcpKleMUZxF98ed5ZcZH82zj3rGeUb3c842TwBRaKWRT7EZdTo7
libfido2-debuginfo#1.15.0-alt1:sisyphus+352095.100.1.1@1720020183 debug64(libcbor.so.0.11)
libitk5.4#5.4.2-alt1:sisyphus+374353.300.12.1@1740072198 libcbor.so.0.11()(64bit) >= set:lgmv9hRQUIT1yBZg2cQwbI85w6RZoQGQIpwR8XnaiZLnGNdSzDyBxfBBcMRnfgJSgq0qo0
libitk5.4-debuginfo#5.4.2-alt1:sisyphus+374353.300.12.1@1740072198 debug64(libcbor.so.0.11)
slicer#5.8.0-alt1:sisyphus+374353.1360.12.1@1740080906 libcbor.so.0.11()(64bit)
slicer-debuginfo#5.8.0-alt1:sisyphus+374353.1360.12.1@1740080906 debug64(libcbor.so.0.11)
ACLs of affected packages (4):
fwupd rider nickel egori
itk morozovaes @everybody
libfido2 ancieg @everybody
slicer rider @everybody
2025-Mar-18 07:45:02 :: unmets: x86_64 +8 -0 =8, i586 +6 -0 =6, aarch64 +8 -0 =11
2025-Mar-18 07:45:02 :: dependencies check FAILED
2025-Mar-18 07:45:02 :: task #378362 for sisyphus FAILED
^ permalink raw reply [flat|nested] 4+ messages in thread
* [#378362] [test-only] FAILED (try 2) libcbor.git=0.12.0-alt1 fwupd.git=2.0.6-alt1 itk.git=5.4.2-alt1 ...
2025-03-18 7:45 [#378362] [test-only] FAILED libcbor.git=0.12.0-alt1 Girar awaiter (ancieg)
@ 2025-03-18 8:01 ` Girar awaiter (ancieg)
2025-03-28 8:24 ` [#378362] TESTED (try 3) libcbor.git=0.12.0-alt1 fwupd.git=2.0.7-alt1 itk.git=5.4.3-alt1 Girar awaiter (ancieg)
2025-03-28 10:42 ` [#378362] DONE (try 4) " Girar pender (ancieg)
2 siblings, 0 replies; 4+ messages in thread
From: Girar awaiter (ancieg) @ 2025-03-18 8:01 UTC (permalink / raw)
To: Anton Zhukharev; +Cc: sisyphus-incominger, girar-builder-sisyphus
[-- Warning: decoded text below may be mangled, UTF-8 assumed --]
[-- Attachment #1: Type: text/plain; charset=unknown-8bit, Size: 3353 bytes --]
https://git.altlinux.org/tasks/378362/logs/events.2.1.log
https://packages.altlinux.org/tasks/378362
subtask name aarch64 i586 x86_64
#200 fwupd failed 3:10 failed
2025-Mar-18 07:58:12 :: test-only task #378362 for sisyphus resumed by ancieg:
2025-Mar-18 07:58:12 :: message: Update libcbor and rebuild deps
#100 build 0.12.0-alt1 from /people/ancieg/packages/libcbor.git fetched at 2025-Mar-18 07:41:59
#200 build 2.0.6-alt1 from /gears/f/fwupd.git fetched at 2025-Mar-18 07:57:31 from sisyphus
#300 build 5.4.2-alt1 from /gears/i/itk.git fetched at 2025-Mar-18 07:57:42 from sisyphus
#400 build 1.15.0-alt1 from /gears/l/libfido2.git fetched at 2025-Mar-18 07:57:43 from sisyphus
#500 build 5.8.0-alt1 from /gears/s/slicer.git fetched at 2025-Mar-18 07:57:45 from sisyphus
2025-Mar-18 07:58:13 :: created build repo
2025-Mar-18 07:58:14 :: [i586] #100 libcbor.git 0.12.0-alt1: build start
2025-Mar-18 07:58:14 :: [x86_64] #100 libcbor.git 0.12.0-alt1: build start
2025-Mar-18 07:58:14 :: [aarch64] #100 libcbor.git 0.12.0-alt1: build start
2025-Mar-18 07:58:32 :: [i586] #100 libcbor.git 0.12.0-alt1: build OK (cached)
2025-Mar-18 07:58:32 :: [i586] #200 fwupd.git 2.0.6-alt1: build start
2025-Mar-18 07:58:33 :: [x86_64] #100 libcbor.git 0.12.0-alt1: build OK (cached)
2025-Mar-18 07:58:33 :: [x86_64] #200 fwupd.git 2.0.6-alt1: build start
2025-Mar-18 07:58:59 :: [aarch64] #100 libcbor.git 0.12.0-alt1: build OK (cached)
2025-Mar-18 07:58:59 :: [aarch64] #200 fwupd.git 2.0.6-alt1: build start
[x86_64] [1288/1349] Generating plugins/uefi-capsule/ux-capsule-tar with a custom command
[x86_64] FAILED: plugins/uefi-capsule/uefi-capsule-ux.tar.xz
[x86_64] /usr/bin/python3 ../plugins/uefi-capsule/make-images.py --podir /usr/src/RPM/BUILD/fwupd-2.0.6/po --label 'Installing firmware update…' --out plugins/uefi-capsule/uefi-capsule-ux.tar.xz
[x86_64] --
[x86_64] Pango.shape(label_translated, length, items[0].analysis, gs)
[x86_64] TypeError: Pango.shape() takes exactly 3 arguments (4 given)
[x86_64] [1289/1349] Linking target libfwupd/fwupd-context-test
2025-Mar-18 07:59:52 :: [x86_64] fwupd.git 2.0.6-alt1: remote: build failed
2025-Mar-18 07:59:52 :: [x86_64] #200 fwupd.git 2.0.6-alt1: build FAILED
2025-Mar-18 07:59:52 :: [x86_64] requesting cancellation of task processing
[aarch64] [1211/1265] Generating plugins/uefi-capsule/ux-capsule-tar with a custom command
[aarch64] FAILED: plugins/uefi-capsule/uefi-capsule-ux.tar.xz
[aarch64] /usr/bin/python3 ../plugins/uefi-capsule/make-images.py --podir /usr/src/RPM/BUILD/fwupd-2.0.6/po --label 'Installing firmware update…' --out plugins/uefi-capsule/uefi-capsule-ux.tar.xz
[aarch64] --
[aarch64] Pango.shape(label_translated, length, items[0].analysis, gs)
[aarch64] TypeError: Pango.shape() takes exactly 3 arguments (4 given)
[aarch64] [1212/1265] Linking target libfwupd/fwupd-thread-test
2025-Mar-18 08:01:25 :: [aarch64] fwupd.git 2.0.6-alt1: remote: build failed
2025-Mar-18 08:01:25 :: [aarch64] #200 fwupd.git 2.0.6-alt1: build FAILED
2025-Mar-18 08:01:42 :: [i586] #200 fwupd.git 2.0.6-alt1: build OK
2025-Mar-18 08:01:42 :: [i586] task processing CANCELLED
2025-Mar-18 07:59:52 :: [x86_64] build FAILED
2025-Mar-18 08:01:25 :: [aarch64] build FAILED
2025-Mar-18 08:01:42 :: [i586] build FAILED
2025-Mar-18 08:01:43 :: task #378362 for sisyphus FAILED
^ permalink raw reply [flat|nested] 4+ messages in thread
* [#378362] TESTED (try 3) libcbor.git=0.12.0-alt1 fwupd.git=2.0.7-alt1 itk.git=5.4.3-alt1 ...
2025-03-18 7:45 [#378362] [test-only] FAILED libcbor.git=0.12.0-alt1 Girar awaiter (ancieg)
2025-03-18 8:01 ` [#378362] [test-only] FAILED (try 2) libcbor.git=0.12.0-alt1 fwupd.git=2.0.6-alt1 itk.git=5.4.2-alt1 Girar awaiter (ancieg)
@ 2025-03-28 8:24 ` Girar awaiter (ancieg)
2025-03-28 10:42 ` [#378362] DONE (try 4) " Girar pender (ancieg)
2 siblings, 0 replies; 4+ messages in thread
From: Girar awaiter (ancieg) @ 2025-03-28 8:24 UTC (permalink / raw)
To: Anton Zhukharev
Cc: sisyphus-incominger, girar-builder-sisyphus, Egor Ignatov,
Anton Farygin, Nikolai Kostrigin, Elizaveta Morozova
https://git.altlinux.org/tasks/378362/logs/events.3.1.log
https://packages.altlinux.org/tasks/378362
subtask name aarch64 i586 x86_64
#600 libcbor 1:20 50 49
#700 fwupd 4:37 3:13 3:03
#1000 itk 29:25 14:46 12:16
#1100 libfido2 1:20 58 57
#1200 slicer 51:12 - 33:27
2025-Mar-28 06:26:38 :: test-only task #378362 for sisyphus resumed by ancieg:
2025-Mar-28 06:26:38 :: message: Update libcbor and rebuild deps
#40 removed
#100 removed
#200 removed
#300 removed
#400 removed
#500 removed
#600 build 0.12.0-alt1 from /people/ancieg/packages/libcbor.git fetched at 2025-Mar-28 06:25:29
#700 build 2.0.7-alt1 from /gears/f/fwupd.git fetched at 2025-Mar-28 06:25:36 from sisyphus
#1000 build 5.4.3-alt1 from /gears/i/itk.git fetched at 2025-Mar-28 06:25:49 from sisyphus
#1100 build 1.15.0-alt1 from /gears/l/libfido2.git fetched at 2025-Mar-28 06:25:56 from sisyphus
#1200 build 5.8.0-alt1 from /gears/s/slicer.git fetched at 2025-Mar-28 06:26:01 from sisyphus
2025-Mar-28 06:26:39 :: created build repo
2025-Mar-28 06:26:40 :: [x86_64] #600 libcbor.git 0.12.0-alt1: build start
2025-Mar-28 06:26:40 :: [aarch64] #600 libcbor.git 0.12.0-alt1: build start
2025-Mar-28 06:26:40 :: [i586] #600 libcbor.git 0.12.0-alt1: build start
2025-Mar-28 06:27:29 :: [x86_64] #600 libcbor.git 0.12.0-alt1: build OK
2025-Mar-28 06:27:29 :: [x86_64] #700 fwupd.git 2.0.7-alt1: build start
2025-Mar-28 06:27:30 :: [i586] #600 libcbor.git 0.12.0-alt1: build OK
2025-Mar-28 06:27:30 :: [i586] #700 fwupd.git 2.0.7-alt1: build start
2025-Mar-28 06:28:00 :: [aarch64] #600 libcbor.git 0.12.0-alt1: build OK
2025-Mar-28 06:28:00 :: [aarch64] #700 fwupd.git 2.0.7-alt1: build start
2025-Mar-28 06:30:32 :: [x86_64] #700 fwupd.git 2.0.7-alt1: build OK
2025-Mar-28 06:30:32 :: [x86_64] #1000 itk.git 5.4.3-alt1: build start
2025-Mar-28 06:30:43 :: [i586] #700 fwupd.git 2.0.7-alt1: build OK
2025-Mar-28 06:30:43 :: [i586] #1000 itk.git 5.4.3-alt1: build start
2025-Mar-28 06:32:37 :: [aarch64] #700 fwupd.git 2.0.7-alt1: build OK
2025-Mar-28 06:32:37 :: [aarch64] #1000 itk.git 5.4.3-alt1: build start
2025-Mar-28 06:42:48 :: [x86_64] #1000 itk.git 5.4.3-alt1: build OK
2025-Mar-28 06:42:48 :: [x86_64] #1100 libfido2.git 1.15.0-alt1: build start
2025-Mar-28 06:43:45 :: [x86_64] #1100 libfido2.git 1.15.0-alt1: build OK
2025-Mar-28 06:43:45 :: [x86_64] #1200 slicer.git 5.8.0-alt1: build start
2025-Mar-28 06:45:29 :: [i586] #1000 itk.git 5.4.3-alt1: build OK
2025-Mar-28 06:45:29 :: [i586] #1100 libfido2.git 1.15.0-alt1: build start
2025-Mar-28 06:46:27 :: [i586] #1100 libfido2.git 1.15.0-alt1: build OK
2025-Mar-28 06:46:27 :: [i586] #1200 slicer.git 5.8.0-alt1: build start
2025-Mar-28 06:46:43 :: [i586] #1200 slicer.git 5.8.0-alt1: build SKIPPED
2025-Mar-28 07:02:02 :: [aarch64] #1000 itk.git 5.4.3-alt1: build OK
2025-Mar-28 07:02:02 :: [aarch64] #1100 libfido2.git 1.15.0-alt1: build start
2025-Mar-28 07:03:22 :: [aarch64] #1100 libfido2.git 1.15.0-alt1: build OK
2025-Mar-28 07:03:23 :: [aarch64] #1200 slicer.git 5.8.0-alt1: build start
2025-Mar-28 07:17:12 :: [x86_64] #1200 slicer.git 5.8.0-alt1: build OK
2025-Mar-28 07:54:35 :: [aarch64] #1200 slicer.git 5.8.0-alt1: build OK
2025-Mar-28 07:54:48 :: #600: libcbor.git 0.12.0-alt1: build check OK
2025-Mar-28 07:55:23 :: #700: fwupd.git 2.0.7-alt1: build check OK
2025-Mar-28 07:56:03 :: #1000: itk.git 5.4.3-alt1: build check OK
2025-Mar-28 07:56:21 :: #1100: libfido2.git 1.15.0-alt1: build check OK
2025-Mar-28 07:56:40 :: #1200: slicer.git 5.8.0-alt1: build check OK
2025-Mar-28 07:56:42 :: build check OK
--- fwupd-2.0.7-alt1.x86_64.rpm.share 2025-03-28 07:56:48.336821030 +0000
+++ fwupd-2.0.7-alt1.i586.rpm.share 2025-03-28 07:56:48.596823509 +0000
@@ -23,3 +23,2 @@
/usr/share/fwupd/simple_client.py 100755 python3 script text executable
-/usr/share/fwupd/uefi-capsule-ux.tar.xz 100644 xz compressed data
/usr/share/icons/hicolor/128x128/apps/org.freedesktop.fwupd.png 100644 PNG image, non-interlaced
warning (#700): non-identical /usr/share part
--- fwupd-tests-2.0.7-alt1.x86_64.rpm.share 2025-03-28 07:56:51.246848785 +0000
+++ fwupd-tests-2.0.7-alt1.i586.rpm.share 2025-03-28 07:56:51.403850283 +0000
@@ -112,13 +112,2 @@
/usr/share/installed-tests/fwupd/device-tests/wistron-dock-40b7.json 100644 ASCII text
-/usr/share/installed-tests/fwupd/efi 40755 directory
-/usr/share/installed-tests/fwupd/efi/esrt 40755 directory
-/usr/share/installed-tests/fwupd/efi/esrt/entries 40755 directory
-/usr/share/installed-tests/fwupd/efi/esrt/entries/entry0 40755 directory
-/usr/share/installed-tests/fwupd/efi/esrt/entries/entry0/capsule_flags 100644 ASCII text
-/usr/share/installed-tests/fwupd/efi/esrt/entries/entry0/fw_class 100644 ASCII text
-/usr/share/installed-tests/fwupd/efi/esrt/entries/entry0/fw_type 100644 ASCII text
-/usr/share/installed-tests/fwupd/efi/esrt/entries/entry0/fw_version 100644 ASCII text
-/usr/share/installed-tests/fwupd/efi/esrt/entries/entry0/last_attempt_status 100644 ASCII text
-/usr/share/installed-tests/fwupd/efi/esrt/entries/entry0/last_attempt_version 100644 ASCII text
-/usr/share/installed-tests/fwupd/efi/esrt/entries/entry0/lowest_supported_fw_version 100644 ASCII text
/usr/share/installed-tests/fwupd/enumeration-data 40755 directory
warning (#700): non-identical /usr/share part
--- fwupd-tests-2.0.7-alt1.x86_64.rpm.share 2025-03-28 07:56:53.760872764 +0000
+++ fwupd-tests-2.0.7-alt1.aarch64.rpm.share 2025-03-28 07:56:53.912874214 +0000
@@ -14,3 +14,2 @@
/usr/share/installed-tests/fwupd/device-tests/amd-dgpu.json 100644 ASCII text
-/usr/share/installed-tests/fwupd/device-tests/amd-pmc.json 100644 ASCII text
/usr/share/installed-tests/fwupd/device-tests/analogix-anx7518.json 100644 ASCII text
@@ -22,3 +21,2 @@
/usr/share/installed-tests/fwupd/device-tests/caldigit-element.json 100644 ASCII text
-/usr/share/installed-tests/fwupd/device-tests/caldigit-ts4-tbt.json 100644 ASCII text
/usr/share/installed-tests/fwupd/device-tests/caldigit-ts4.json 100644 ASCII text
@@ -105,3 +103,2 @@
/usr/share/installed-tests/fwupd/device-tests/uefi-dbx.json 100644 ASCII text
-/usr/share/installed-tests/fwupd/device-tests/uefi-pk.json 100644 ASCII text
/usr/share/installed-tests/fwupd/device-tests/ugreen-cm260.json 100644 ASCII text
@@ -126,3 +123,2 @@
/usr/share/installed-tests/fwupd/enumeration-data/amd-dgpu-setup.json 100644 ASCII text
-/usr/share/installed-tests/fwupd/enumeration-data/amd-pmc-setup.json 100644 ASCII text
/usr/share/installed-tests/fwupd/enumeration-data/asus-hid-setup.json 100644 ASCII text
@@ -152,3 +148,2 @@
/usr/share/installed-tests/fwupd/enumeration-data/synaptics-panamera-setup.json 100644 ASCII text
-/usr/share/installed-tests/fwupd/enumeration-data/uefi-pk-setup.json 100644 ASCII text, with very long lines
/usr/share/installed-tests/fwupd/enumeration-data/wacom-movink-13-setup.json 100644 ASCII text, with very long lines
@@ -262,9 +257,2 @@
/usr/share/installed-tests/fwupd/tests/elf.builder.xml 100644 ASCII text
-/usr/share/installed-tests/fwupd/tests/empty_pcr 40755 directory
-/usr/share/installed-tests/fwupd/tests/empty_pcr/tpm0 40755 directory
-/usr/share/installed-tests/fwupd/tests/empty_pcr/tpm0/active 100644 ASCII text
-/usr/share/installed-tests/fwupd/tests/empty_pcr/tpm0/caps 100644 ASCII text
-/usr/share/installed-tests/fwupd/tests/empty_pcr/tpm0/enabled 100644 ASCII text
-/usr/share/installed-tests/fwupd/tests/empty_pcr/tpm0/owned 100644 ASCII text
-/usr/share/installed-tests/fwupd/tests/empty_pcr/tpm0/pcrs 100644 ASCII text
/usr/share/installed-tests/fwupd/tests/fdt.builder.xml 100644 ASCII text
@@ -311,8 +299,2 @@
/usr/share/installed-tests/fwupd/tests/sys_vendor 100644 ASCII text
-/usr/share/installed-tests/fwupd/tests/tpm0 40755 directory
-/usr/share/installed-tests/fwupd/tests/tpm0/active 100644 ASCII text
-/usr/share/installed-tests/fwupd/tests/tpm0/caps 100644 ASCII text
-/usr/share/installed-tests/fwupd/tests/tpm0/enabled 100644 ASCII text
-/usr/share/installed-tests/fwupd/tests/tpm0/owned 100644 ASCII text
-/usr/share/installed-tests/fwupd/tests/tpm0/pcrs 100644 ASCII text
/usr/share/installed-tests/fwupd/tests/uf2.builder.xml 100644 ASCII HTML document text
warning (#700): non-identical /usr/share part
--- fwupd-2.0.7-alt1.i586.rpm.share 2025-03-28 07:56:54.303877943 +0000
+++ fwupd-2.0.7-alt1.aarch64.rpm.share 2025-03-28 07:56:54.306877972 +0000
@@ -23,2 +23,3 @@
/usr/share/fwupd/simple_client.py 100755 python3 script text executable
+/usr/share/fwupd/uefi-capsule-ux.tar.xz 100644 xz compressed data
/usr/share/icons/hicolor/128x128/apps/org.freedesktop.fwupd.png 100644 PNG image, non-interlaced
warning (#700): non-identical /usr/share part
--- fwupd-tests-2.0.7-alt1.i586.rpm.share 2025-03-28 07:56:54.333878229 +0000
+++ fwupd-tests-2.0.7-alt1.aarch64.rpm.share 2025-03-28 07:56:54.335878248 +0000
@@ -14,3 +14,2 @@
/usr/share/installed-tests/fwupd/device-tests/amd-dgpu.json 100644 ASCII text
-/usr/share/installed-tests/fwupd/device-tests/amd-pmc.json 100644 ASCII text
/usr/share/installed-tests/fwupd/device-tests/analogix-anx7518.json 100644 ASCII text
@@ -22,3 +21,2 @@
/usr/share/installed-tests/fwupd/device-tests/caldigit-element.json 100644 ASCII text
-/usr/share/installed-tests/fwupd/device-tests/caldigit-ts4-tbt.json 100644 ASCII text
/usr/share/installed-tests/fwupd/device-tests/caldigit-ts4.json 100644 ASCII text
@@ -105,3 +103,2 @@
/usr/share/installed-tests/fwupd/device-tests/uefi-dbx.json 100644 ASCII text
-/usr/share/installed-tests/fwupd/device-tests/uefi-pk.json 100644 ASCII text
/usr/share/installed-tests/fwupd/device-tests/ugreen-cm260.json 100644 ASCII text
@@ -112,2 +109,13 @@
/usr/share/installed-tests/fwupd/device-tests/wistron-dock-40b7.json 100644 ASCII text
+/usr/share/installed-tests/fwupd/efi 40755 directory
+/usr/share/installed-tests/fwupd/efi/esrt 40755 directory
+/usr/share/installed-tests/fwupd/efi/esrt/entries 40755 directory
+/usr/share/installed-tests/fwupd/efi/esrt/entries/entry0 40755 directory
+/usr/share/installed-tests/fwupd/efi/esrt/entries/entry0/capsule_flags 100644 ASCII text
+/usr/share/installed-tests/fwupd/efi/esrt/entries/entry0/fw_class 100644 ASCII text
+/usr/share/installed-tests/fwupd/efi/esrt/entries/entry0/fw_type 100644 ASCII text
+/usr/share/installed-tests/fwupd/efi/esrt/entries/entry0/fw_version 100644 ASCII text
+/usr/share/installed-tests/fwupd/efi/esrt/entries/entry0/last_attempt_status 100644 ASCII text
+/usr/share/installed-tests/fwupd/efi/esrt/entries/entry0/last_attempt_version 100644 ASCII text
+/usr/share/installed-tests/fwupd/efi/esrt/entries/entry0/lowest_supported_fw_version 100644 ASCII text
/usr/share/installed-tests/fwupd/enumeration-data 40755 directory
@@ -115,3 +123,2 @@
/usr/share/installed-tests/fwupd/enumeration-data/amd-dgpu-setup.json 100644 ASCII text
-/usr/share/installed-tests/fwupd/enumeration-data/amd-pmc-setup.json 100644 ASCII text
/usr/share/installed-tests/fwupd/enumeration-data/asus-hid-setup.json 100644 ASCII text
@@ -141,3 +148,2 @@
/usr/share/installed-tests/fwupd/enumeration-data/synaptics-panamera-setup.json 100644 ASCII text
-/usr/share/installed-tests/fwupd/enumeration-data/uefi-pk-setup.json 100644 ASCII text, with very long lines
/usr/share/installed-tests/fwupd/enumeration-data/wacom-movink-13-setup.json 100644 ASCII text, with very long lines
@@ -251,9 +257,2 @@
/usr/share/installed-tests/fwupd/tests/elf.builder.xml 100644 ASCII text
-/usr/share/installed-tests/fwupd/tests/empty_pcr 40755 directory
-/usr/share/installed-tests/fwupd/tests/empty_pcr/tpm0 40755 directory
-/usr/share/installed-tests/fwupd/tests/empty_pcr/tpm0/active 100644 ASCII text
-/usr/share/installed-tests/fwupd/tests/empty_pcr/tpm0/caps 100644 ASCII text
-/usr/share/installed-tests/fwupd/tests/empty_pcr/tpm0/enabled 100644 ASCII text
-/usr/share/installed-tests/fwupd/tests/empty_pcr/tpm0/owned 100644 ASCII text
-/usr/share/installed-tests/fwupd/tests/empty_pcr/tpm0/pcrs 100644 ASCII text
/usr/share/installed-tests/fwupd/tests/fdt.builder.xml 100644 ASCII text
@@ -300,8 +299,2 @@
/usr/share/installed-tests/fwupd/tests/sys_vendor 100644 ASCII text
-/usr/share/installed-tests/fwupd/tests/tpm0 40755 directory
-/usr/share/installed-tests/fwupd/tests/tpm0/active 100644 ASCII text
-/usr/share/installed-tests/fwupd/tests/tpm0/caps 100644 ASCII text
-/usr/share/installed-tests/fwupd/tests/tpm0/enabled 100644 ASCII text
-/usr/share/installed-tests/fwupd/tests/tpm0/owned 100644 ASCII text
-/usr/share/installed-tests/fwupd/tests/tpm0/pcrs 100644 ASCII text
/usr/share/installed-tests/fwupd/tests/uf2.builder.xml 100644 ASCII HTML document text
warning (#700): non-identical /usr/share part
2025-Mar-28 07:58:51 :: noarch check OK
2025-Mar-28 07:58:53 :: plan: src +5 -5 =20030, aarch64 +31 -31 =34815, i586 +26 -26 =33686, noarch +2 -2 =21209, x86_64 +31 -31 =35621
#600 libcbor 0.11.0-alt1 -> 0.12.0-alt1
Tue Mar 18 2025 Anton Zhukharev <ancieg@altlinux> 0.12.0-alt1
- Updated to 0.12.0.
- Enabled check during building.
- Followed Shared Libs policy.
2025-Mar-28 07:59:42 :: patched apt indices
2025-Mar-28 07:59:51 :: created next repo
2025-Mar-28 08:00:01 :: duplicate provides check OK
2025-Mar-28 08:00:40 :: dependencies check OK
2025-Mar-28 08:01:31 :: [x86_64 i586 aarch64] ELF symbols check OK
i586: fwupd=2.0.7-alt1 post-install unowned files:
/usr/lib/systemd/system-shutdown
/usr/share/dbus-1
/usr/share/dbus-1/interfaces
/usr/share/dbus-1/system-services
/usr/share/dbus-1/system.d
/usr/share/fish
/usr/share/fish/vendor_completions.d
/usr/share/icons/hicolor/128x128
/usr/share/icons/hicolor/128x128/apps
/usr/share/icons/hicolor/64x64
/usr/share/icons/hicolor/64x64/apps
/usr/share/icons/hicolor/scalable
/usr/share/icons/hicolor/scalable/apps
/usr/share/metainfo
/usr/share/polkit-1
/usr/share/polkit-1/actions
/usr/share/polkit-1/rules.d
2025-Mar-28 08:01:50 :: [i586] #700 fwupd: install check OK
x86_64: fwupd=2.0.7-alt1 post-install unowned files:
/etc/grub.d
/usr/lib/systemd/system-shutdown
/usr/share/dbus-1
/usr/share/dbus-1/interfaces
/usr/share/dbus-1/system-services
/usr/share/dbus-1/system.d
/usr/share/fish
/usr/share/fish/vendor_completions.d
/usr/share/icons/hicolor/128x128
/usr/share/icons/hicolor/128x128/apps
/usr/share/icons/hicolor/64x64
/usr/share/icons/hicolor/64x64/apps
/usr/share/icons/hicolor/scalable
/usr/share/icons/hicolor/scalable/apps
/usr/share/metainfo
/usr/share/polkit-1
/usr/share/polkit-1/actions
/usr/share/polkit-1/rules.d
2025-Mar-28 08:01:51 :: [x86_64] #700 fwupd: install check OK
aarch64: fwupd=2.0.7-alt1 post-install unowned files:
/etc/grub.d
/usr/lib/systemd/system-shutdown
/usr/lib/sysusers.d
/usr/share/dbus-1
/usr/share/dbus-1/interfaces
/usr/share/dbus-1/system-services
/usr/share/dbus-1/system.d
/usr/share/fish
/usr/share/fish/vendor_completions.d
/usr/share/icons/hicolor/128x128
/usr/share/icons/hicolor/128x128/apps
/usr/share/icons/hicolor/64x64
/usr/share/icons/hicolor/64x64/apps
/usr/share/icons/hicolor/scalable
/usr/share/icons/hicolor/scalable/apps
/usr/share/metainfo
/usr/share/polkit-1
/usr/share/polkit-1/actions
/usr/share/polkit-1/rules.d
2025-Mar-28 08:02:00 :: [aarch64] #700 fwupd: install check OK
2025-Mar-28 08:02:07 :: [x86_64] #700 fwupd-debuginfo: install check OK
2025-Mar-28 08:02:07 :: [i586] #700 fwupd-debuginfo: install check OK
2025-Mar-28 08:02:18 :: [x86_64] #700 fwupd-plugin-modem-manager: install check OK
2025-Mar-28 08:02:19 :: [i586] #700 fwupd-plugin-modem-manager: install check OK
2025-Mar-28 08:02:23 :: [aarch64] #700 fwupd-debuginfo: install check OK
2025-Mar-28 08:02:35 :: [x86_64] #700 fwupd-plugin-modem-manager-debuginfo: install check OK
2025-Mar-28 08:02:36 :: [i586] #700 fwupd-plugin-modem-manager-debuginfo: install check OK
2025-Mar-28 08:02:39 :: [aarch64] #700 fwupd-plugin-modem-manager: install check OK
x86_64: fwupd-tests=2.0.7-alt1 post-install unowned files:
/usr/libexec/installed-tests
/usr/share/installed-tests
2025-Mar-28 08:02:48 :: [x86_64] #700 fwupd-tests: install check OK
i586: fwupd-tests=2.0.7-alt1 post-install unowned files:
/usr/libexec/installed-tests
/usr/share/installed-tests
2025-Mar-28 08:02:49 :: [i586] #700 fwupd-tests: install check OK
2025-Mar-28 08:03:03 :: [aarch64] #700 fwupd-plugin-modem-manager-debuginfo: install check OK
2025-Mar-28 08:03:06 :: [x86_64] #700 fwupd-tests-debuginfo: install check OK
2025-Mar-28 08:03:08 :: [i586] #700 fwupd-tests-debuginfo: install check OK
2025-Mar-28 08:03:13 :: [x86_64] #1000 itk-doc: install check OK
2025-Mar-28 08:03:14 :: [i586] #1000 itk-doc: install check OK
aarch64: fwupd-tests=2.0.7-alt1 post-install unowned files:
/usr/libexec/installed-tests
/usr/share/installed-tests
2025-Mar-28 08:03:23 :: [aarch64] #700 fwupd-tests: install check OK
2025-Mar-28 08:03:24 :: [x86_64] #1000 itk-examples: install check OK
2025-Mar-28 08:03:26 :: [i586] #1000 itk-examples: install check OK
2025-Mar-28 08:03:50 :: [aarch64] #700 fwupd-tests-debuginfo: install check OK
2025-Mar-28 08:04:00 :: [aarch64] #1000 itk-doc: install check OK
2025-Mar-28 08:04:00 :: [x86_64] #1000 itk-examples-debuginfo: install check OK
2025-Mar-28 08:04:07 :: [i586] #1000 itk-examples-debuginfo: install check OK
2025-Mar-28 08:04:11 :: [x86_64] #1000 itk-testdriver: install check OK
2025-Mar-28 08:04:18 :: [aarch64] #1000 itk-examples: install check OK
2025-Mar-28 08:04:18 :: [i586] #1000 itk-testdriver: install check OK
2025-Mar-28 08:04:37 :: [x86_64] #1000 itk-testdriver-debuginfo: install check OK
x86_64: libcbor-devel=0.12.0-alt1 post-install unowned files:
/usr/lib64/cmake
2025-Mar-28 08:04:45 :: [x86_64] #600 libcbor-devel: install check OK
2025-Mar-28 08:04:47 :: [i586] #1000 itk-testdriver-debuginfo: install check OK
2025-Mar-28 08:04:51 :: [x86_64] #600 libcbor0.12: install check OK
i586: libcbor-devel=0.12.0-alt1 post-install unowned files:
/usr/lib/cmake
2025-Mar-28 08:04:54 :: [i586] #600 libcbor-devel: install check OK
2025-Mar-28 08:04:58 :: [x86_64] #600 libcbor0.12-debuginfo: install check OK
2025-Mar-28 08:04:59 :: [i586] #600 libcbor0.12: install check OK
2025-Mar-28 08:05:05 :: [x86_64] #1100 libfido2: install check OK
2025-Mar-28 08:05:06 :: [i586] #600 libcbor0.12-debuginfo: install check OK
2025-Mar-28 08:05:13 :: [aarch64] #1000 itk-examples-debuginfo: install check OK
2025-Mar-28 08:05:13 :: [i586] #1100 libfido2: install check OK
2025-Mar-28 08:05:13 :: [x86_64] #1100 libfido2-debuginfo: install check OK
2025-Mar-28 08:05:20 :: [x86_64] #1100 libfido2-devel: install check OK
2025-Mar-28 08:05:21 :: [i586] #1100 libfido2-debuginfo: install check OK
2025-Mar-28 08:05:27 :: [x86_64] #1100 libfido2-tools: install check OK
2025-Mar-28 08:05:28 :: [i586] #1100 libfido2-devel: install check OK
2025-Mar-28 08:05:29 :: [aarch64] #1000 itk-testdriver: install check OK
2025-Mar-28 08:05:35 :: [i586] #1100 libfido2-tools: install check OK
2025-Mar-28 08:05:35 :: [x86_64] #1100 libfido2-tools-debuginfo: install check OK
2025-Mar-28 08:05:43 :: [i586] #1100 libfido2-tools-debuginfo: install check OK
2025-Mar-28 08:05:45 :: [x86_64] #700 libfwupd-devel: install check OK
2025-Mar-28 08:05:52 :: [x86_64] #700 libfwupd-devel-docs: install check OK
2025-Mar-28 08:05:53 :: [i586] #700 libfwupd-devel: install check OK
2025-Mar-28 08:06:00 :: [i586] #700 libfwupd-devel-docs: install check OK
2025-Mar-28 08:06:01 :: [x86_64] #700 libfwupd3: install check OK
2025-Mar-28 08:06:08 :: [i586] #700 libfwupd3: install check OK
2025-Mar-28 08:06:08 :: [aarch64] #1000 itk-testdriver-debuginfo: install check OK
2025-Mar-28 08:06:13 :: [x86_64] #700 libfwupd3-debuginfo: install check OK
aarch64: libcbor-devel=0.12.0-alt1 post-install unowned files:
/usr/lib64/cmake
2025-Mar-28 08:06:20 :: [aarch64] #600 libcbor-devel: install check OK
2025-Mar-28 08:06:21 :: [i586] #700 libfwupd3-debuginfo: install check OK
2025-Mar-28 08:06:30 :: [aarch64] #600 libcbor0.12: install check OK
2025-Mar-28 08:06:41 :: [aarch64] #600 libcbor0.12-debuginfo: install check OK
2025-Mar-28 08:06:53 :: [aarch64] #1100 libfido2: install check OK
2025-Mar-28 08:07:01 :: [x86_64] #1000 libitk-devel: install check OK
2025-Mar-28 08:07:06 :: [aarch64] #1100 libfido2-debuginfo: install check OK
2025-Mar-28 08:07:13 :: [x86_64] #1000 libitk5.4: install check OK
2025-Mar-28 08:07:16 :: [i586] #1000 libitk-devel: install check OK
2025-Mar-28 08:07:17 :: [aarch64] #1100 libfido2-devel: install check OK
2025-Mar-28 08:07:28 :: [i586] #1000 libitk5.4: install check OK
2025-Mar-28 08:07:29 :: [aarch64] #1100 libfido2-tools: install check OK
2025-Mar-28 08:07:39 :: [x86_64] #1000 libitk5.4-debuginfo: install check OK
2025-Mar-28 08:07:42 :: [aarch64] #1100 libfido2-tools-debuginfo: install check OK
2025-Mar-28 08:07:54 :: [x86_64] #1000 libitk5.4-glue: install check OK
2025-Mar-28 08:07:57 :: [i586] #1000 libitk5.4-debuginfo: install check OK
2025-Mar-28 08:07:57 :: [aarch64] #700 libfwupd-devel: install check OK
2025-Mar-28 08:08:08 :: [aarch64] #700 libfwupd-devel-docs: install check OK
2025-Mar-28 08:08:12 :: [i586] #1000 libitk5.4-glue: install check OK
2025-Mar-28 08:08:22 :: [aarch64] #700 libfwupd3: install check OK
2025-Mar-28 08:08:38 :: [x86_64] #1000 libitk5.4-glue-debuginfo: install check OK
2025-Mar-28 08:08:40 :: [aarch64] #700 libfwupd3-debuginfo: install check OK
2025-Mar-28 08:09:04 :: [i586] #1000 libitk5.4-glue-debuginfo: install check OK
2025-Mar-28 08:09:17 :: [x86_64] #1200 slicer: install check OK
2025-Mar-28 08:09:51 :: [aarch64] #1000 libitk-devel: install check OK
2025-Mar-28 08:10:09 :: [aarch64] #1000 libitk5.4: install check OK
2025-Mar-28 08:10:48 :: [aarch64] #1000 libitk5.4-debuginfo: install check OK
2025-Mar-28 08:11:10 :: [aarch64] #1000 libitk5.4-glue: install check OK
2025-Mar-28 08:11:49 :: [x86_64] #1200 slicer-debuginfo: install check OK
2025-Mar-28 08:12:17 :: [aarch64] #1000 libitk5.4-glue-debuginfo: install check OK
2025-Mar-28 08:12:31 :: [x86_64] #1200 slicer-devel: install check OK
x86_64: slicer-qt5-designer-plugin=5.8.0-alt1 post-install unowned files:
/usr/lib64/qt5/plugins/designer
2025-Mar-28 08:13:10 :: [x86_64] #1200 slicer-qt5-designer-plugin: install check OK
2025-Mar-28 08:13:14 :: [aarch64] #1200 slicer: install check OK
2025-Mar-28 08:15:41 :: [x86_64] #1200 slicer-qt5-designer-plugin-debuginfo: install check OK
2025-Mar-28 08:16:56 :: [aarch64] #1200 slicer-debuginfo: install check OK
2025-Mar-28 08:17:55 :: [aarch64] #1200 slicer-devel: install check OK
aarch64: slicer-qt5-designer-plugin=5.8.0-alt1 post-install unowned files:
/usr/lib64/qt5/plugins/designer
2025-Mar-28 08:18:52 :: [aarch64] #1200 slicer-qt5-designer-plugin: install check OK
2025-Mar-28 08:22:31 :: [aarch64] #1200 slicer-qt5-designer-plugin-debuginfo: install check OK
2025-Mar-28 08:22:33 :: [x86_64-i586] plan: #11 +11 -11 =11596
2025-Mar-28 08:23:20 :: [x86_64-i586] arepo build OK
2025-Mar-28 08:23:35 :: [x86_64-i586] generated apt indices
2025-Mar-28 08:23:36 :: [x86_64-i586] created next repo
2025-Mar-28 08:23:47 :: [x86_64-i586] dependencies check OK
2025-Mar-28 08:23:49 :: gears inheritance check OK
2025-Mar-28 08:23:49 :: srpm inheritance check OK
girar-check-perms: access to libcbor ALLOWED for ancieg: project leader
check-subtask-perms: #600: libcbor: allowed for ancieg
girar-check-perms: access to fwupd ALLOWED for ancieg: rebuild is allowed by default
check-subtask-perms: #700: fwupd: allowed for ancieg
girar-check-perms: access to itk ALLOWED for ancieg: project leader welcomes random builders
check-subtask-perms: #1000: itk: allowed for ancieg
girar-check-perms: access to libfido2 ALLOWED for ancieg: project leader
check-subtask-perms: #1100: libfido2: allowed for ancieg
girar-check-perms: access to slicer ALLOWED for ancieg: project leader welcomes random builders
check-subtask-perms: #1200: slicer: allowed for ancieg
2025-Mar-28 08:23:50 :: acl check OK
2025-Mar-28 08:24:13 :: created contents_index files
2025-Mar-28 08:24:23 :: created hash files: aarch64 i586 noarch src x86_64-i586 x86_64
2025-Mar-28 08:24:26 :: task #378362 for sisyphus TESTED
^ permalink raw reply [flat|nested] 4+ messages in thread
* [#378362] DONE (try 4) libcbor.git=0.12.0-alt1 fwupd.git=2.0.7-alt1 itk.git=5.4.3-alt1 ...
2025-03-18 7:45 [#378362] [test-only] FAILED libcbor.git=0.12.0-alt1 Girar awaiter (ancieg)
2025-03-18 8:01 ` [#378362] [test-only] FAILED (try 2) libcbor.git=0.12.0-alt1 fwupd.git=2.0.6-alt1 itk.git=5.4.2-alt1 Girar awaiter (ancieg)
2025-03-28 8:24 ` [#378362] TESTED (try 3) libcbor.git=0.12.0-alt1 fwupd.git=2.0.7-alt1 itk.git=5.4.3-alt1 Girar awaiter (ancieg)
@ 2025-03-28 10:42 ` Girar pender (ancieg)
2 siblings, 0 replies; 4+ messages in thread
From: Girar pender (ancieg) @ 2025-03-28 10:42 UTC (permalink / raw)
To: Anton Zhukharev
Cc: sisyphus-incominger, girar-builder-sisyphus, Egor Ignatov,
Anton Farygin, Nikolai Kostrigin, Elizaveta Morozova
https://git.altlinux.org/tasks/archive/done/_369/378362/logs/events.4.2.log
https://packages.altlinux.org/tasks/378362
subtask name aarch64 i586 x86_64
#540 libcbor 1:20 50 49
#700 fwupd 4:43 3:15 3:04
#1000 itk 29:49 14:56 12:24
#1100 libfido2 1:23 58 58
#1200 slicer 51:45 - 35:01
2025-Mar-28 10:25:41 :: task #378362 for sisyphus resumed by ancieg:
2025-Mar-28 10:25:41 :: message: Update libcbor and rebuild deps
#40 removed
#100 removed
#200 removed
#300 removed
#400 removed
#500 removed
#540 build 0.12.0-alt1 from /people/ancieg/packages/libcbor.git fetched at 2025-Mar-28 08:25:54
#600 removed
#700 build 2.0.7-alt1 from /gears/f/fwupd.git fetched at 2025-Mar-28 06:25:36 from sisyphus
#1000 build 5.4.3-alt1 from /gears/i/itk.git fetched at 2025-Mar-28 06:25:49 from sisyphus
#1100 build 1.15.0-alt1 from /gears/l/libfido2.git fetched at 2025-Mar-28 06:25:56 from sisyphus
#1200 build 5.8.0-alt1 from /gears/s/slicer.git fetched at 2025-Mar-28 06:26:01 from sisyphus
2025-Mar-28 10:25:42 :: created build repo
2025-Mar-28 10:25:43 :: [i586] #540 libcbor.git 0.12.0-alt1: build start
2025-Mar-28 10:25:43 :: [x86_64] #540 libcbor.git 0.12.0-alt1: build start
2025-Mar-28 10:25:43 :: [aarch64] #540 libcbor.git 0.12.0-alt1: build start
2025-Mar-28 10:26:01 :: [i586] #540 libcbor.git 0.12.0-alt1: build OK (cached)
2025-Mar-28 10:26:01 :: [i586] #700 fwupd.git 2.0.7-alt1: build start
2025-Mar-28 10:26:02 :: [x86_64] #540 libcbor.git 0.12.0-alt1: build OK (cached)
2025-Mar-28 10:26:02 :: [x86_64] #700 fwupd.git 2.0.7-alt1: build start
2025-Mar-28 10:26:15 :: [i586] #700 fwupd.git 2.0.7-alt1: build OK (cached)
2025-Mar-28 10:26:16 :: [i586] #1000 itk.git 5.4.3-alt1: build start
2025-Mar-28 10:26:17 :: [x86_64] #700 fwupd.git 2.0.7-alt1: build OK (cached)
2025-Mar-28 10:26:17 :: [x86_64] #1000 itk.git 5.4.3-alt1: build start
2025-Mar-28 10:26:19 :: [aarch64] #540 libcbor.git 0.12.0-alt1: build OK (cached)
2025-Mar-28 10:26:19 :: [aarch64] #700 fwupd.git 2.0.7-alt1: build start
2025-Mar-28 10:26:32 :: [i586] #1000 itk.git 5.4.3-alt1: build OK (cached)
2025-Mar-28 10:26:32 :: [i586] #1100 libfido2.git 1.15.0-alt1: build start
2025-Mar-28 10:26:35 :: [x86_64] #1000 itk.git 5.4.3-alt1: build OK (cached)
2025-Mar-28 10:26:35 :: [x86_64] #1100 libfido2.git 1.15.0-alt1: build start
2025-Mar-28 10:26:45 :: [i586] #1100 libfido2.git 1.15.0-alt1: build OK (cached)
2025-Mar-28 10:26:46 :: [i586] #1200 slicer.git 5.8.0-alt1: build start
2025-Mar-28 10:26:47 :: [aarch64] #700 fwupd.git 2.0.7-alt1: build OK (cached)
2025-Mar-28 10:26:47 :: [aarch64] #1000 itk.git 5.4.3-alt1: build start
2025-Mar-28 10:26:48 :: [x86_64] #1100 libfido2.git 1.15.0-alt1: build OK (cached)
2025-Mar-28 10:26:48 :: [x86_64] #1200 slicer.git 5.8.0-alt1: build start
2025-Mar-28 10:27:01 :: [i586] #1200 slicer.git 5.8.0-alt1: build SKIPPED
2025-Mar-28 10:27:05 :: [x86_64] #1200 slicer.git 5.8.0-alt1: build OK (cached)
2025-Mar-28 10:27:17 :: [aarch64] #1000 itk.git 5.4.3-alt1: build OK (cached)
2025-Mar-28 10:27:17 :: [aarch64] #1100 libfido2.git 1.15.0-alt1: build start
2025-Mar-28 10:27:41 :: [aarch64] #1100 libfido2.git 1.15.0-alt1: build OK (cached)
2025-Mar-28 10:27:41 :: [aarch64] #1200 slicer.git 5.8.0-alt1: build start
2025-Mar-28 10:28:11 :: [aarch64] #1200 slicer.git 5.8.0-alt1: build OK (cached)
2025-Mar-28 10:28:23 :: #540: libcbor.git 0.12.0-alt1: build check OK
2025-Mar-28 10:28:57 :: #700: fwupd.git 2.0.7-alt1: build check OK
2025-Mar-28 10:29:36 :: #1000: itk.git 5.4.3-alt1: build check OK
2025-Mar-28 10:29:54 :: #1100: libfido2.git 1.15.0-alt1: build check OK
2025-Mar-28 10:30:13 :: #1200: slicer.git 5.8.0-alt1: build check OK
2025-Mar-28 10:30:14 :: build check OK
--- fwupd-2.0.7-alt1.x86_64.rpm.share 2025-03-28 10:30:20.226829415 +0000
+++ fwupd-2.0.7-alt1.i586.rpm.share 2025-03-28 10:30:20.431831682 +0000
@@ -23,3 +23,2 @@
/usr/share/fwupd/simple_client.py 100755 python3 script text executable
-/usr/share/fwupd/uefi-capsule-ux.tar.xz 100644 xz compressed data
/usr/share/icons/hicolor/128x128/apps/org.freedesktop.fwupd.png 100644 PNG image, non-interlaced
warning (#700): non-identical /usr/share part
--- fwupd-tests-2.0.7-alt1.x86_64.rpm.share 2025-03-28 10:30:22.843858357 +0000
+++ fwupd-tests-2.0.7-alt1.i586.rpm.share 2025-03-28 10:30:23.001860105 +0000
@@ -112,13 +112,2 @@
/usr/share/installed-tests/fwupd/device-tests/wistron-dock-40b7.json 100644 ASCII text
-/usr/share/installed-tests/fwupd/efi 40755 directory
-/usr/share/installed-tests/fwupd/efi/esrt 40755 directory
-/usr/share/installed-tests/fwupd/efi/esrt/entries 40755 directory
-/usr/share/installed-tests/fwupd/efi/esrt/entries/entry0 40755 directory
-/usr/share/installed-tests/fwupd/efi/esrt/entries/entry0/capsule_flags 100644 ASCII text
-/usr/share/installed-tests/fwupd/efi/esrt/entries/entry0/fw_class 100644 ASCII text
-/usr/share/installed-tests/fwupd/efi/esrt/entries/entry0/fw_type 100644 ASCII text
-/usr/share/installed-tests/fwupd/efi/esrt/entries/entry0/fw_version 100644 ASCII text
-/usr/share/installed-tests/fwupd/efi/esrt/entries/entry0/last_attempt_status 100644 ASCII text
-/usr/share/installed-tests/fwupd/efi/esrt/entries/entry0/last_attempt_version 100644 ASCII text
-/usr/share/installed-tests/fwupd/efi/esrt/entries/entry0/lowest_supported_fw_version 100644 ASCII text
/usr/share/installed-tests/fwupd/enumeration-data 40755 directory
warning (#700): non-identical /usr/share part
--- fwupd-tests-2.0.7-alt1.x86_64.rpm.share 2025-03-28 10:30:25.387886492 +0000
+++ fwupd-tests-2.0.7-alt1.aarch64.rpm.share 2025-03-28 10:30:25.523887996 +0000
@@ -14,3 +14,2 @@
/usr/share/installed-tests/fwupd/device-tests/amd-dgpu.json 100644 ASCII text
-/usr/share/installed-tests/fwupd/device-tests/amd-pmc.json 100644 ASCII text
/usr/share/installed-tests/fwupd/device-tests/analogix-anx7518.json 100644 ASCII text
@@ -22,3 +21,2 @@
/usr/share/installed-tests/fwupd/device-tests/caldigit-element.json 100644 ASCII text
-/usr/share/installed-tests/fwupd/device-tests/caldigit-ts4-tbt.json 100644 ASCII text
/usr/share/installed-tests/fwupd/device-tests/caldigit-ts4.json 100644 ASCII text
@@ -105,3 +103,2 @@
/usr/share/installed-tests/fwupd/device-tests/uefi-dbx.json 100644 ASCII text
-/usr/share/installed-tests/fwupd/device-tests/uefi-pk.json 100644 ASCII text
/usr/share/installed-tests/fwupd/device-tests/ugreen-cm260.json 100644 ASCII text
@@ -126,3 +123,2 @@
/usr/share/installed-tests/fwupd/enumeration-data/amd-dgpu-setup.json 100644 ASCII text
-/usr/share/installed-tests/fwupd/enumeration-data/amd-pmc-setup.json 100644 ASCII text
/usr/share/installed-tests/fwupd/enumeration-data/asus-hid-setup.json 100644 ASCII text
@@ -152,3 +148,2 @@
/usr/share/installed-tests/fwupd/enumeration-data/synaptics-panamera-setup.json 100644 ASCII text
-/usr/share/installed-tests/fwupd/enumeration-data/uefi-pk-setup.json 100644 ASCII text, with very long lines
/usr/share/installed-tests/fwupd/enumeration-data/wacom-movink-13-setup.json 100644 ASCII text, with very long lines
@@ -262,9 +257,2 @@
/usr/share/installed-tests/fwupd/tests/elf.builder.xml 100644 ASCII text
-/usr/share/installed-tests/fwupd/tests/empty_pcr 40755 directory
-/usr/share/installed-tests/fwupd/tests/empty_pcr/tpm0 40755 directory
-/usr/share/installed-tests/fwupd/tests/empty_pcr/tpm0/active 100644 ASCII text
-/usr/share/installed-tests/fwupd/tests/empty_pcr/tpm0/caps 100644 ASCII text
-/usr/share/installed-tests/fwupd/tests/empty_pcr/tpm0/enabled 100644 ASCII text
-/usr/share/installed-tests/fwupd/tests/empty_pcr/tpm0/owned 100644 ASCII text
-/usr/share/installed-tests/fwupd/tests/empty_pcr/tpm0/pcrs 100644 ASCII text
/usr/share/installed-tests/fwupd/tests/fdt.builder.xml 100644 ASCII text
@@ -311,8 +299,2 @@
/usr/share/installed-tests/fwupd/tests/sys_vendor 100644 ASCII text
-/usr/share/installed-tests/fwupd/tests/tpm0 40755 directory
-/usr/share/installed-tests/fwupd/tests/tpm0/active 100644 ASCII text
-/usr/share/installed-tests/fwupd/tests/tpm0/caps 100644 ASCII text
-/usr/share/installed-tests/fwupd/tests/tpm0/enabled 100644 ASCII text
-/usr/share/installed-tests/fwupd/tests/tpm0/owned 100644 ASCII text
-/usr/share/installed-tests/fwupd/tests/tpm0/pcrs 100644 ASCII text
/usr/share/installed-tests/fwupd/tests/uf2.builder.xml 100644 ASCII HTML document text
warning (#700): non-identical /usr/share part
--- fwupd-2.0.7-alt1.i586.rpm.share 2025-03-28 10:30:25.911892287 +0000
+++ fwupd-2.0.7-alt1.aarch64.rpm.share 2025-03-28 10:30:25.913892309 +0000
@@ -23,2 +23,3 @@
/usr/share/fwupd/simple_client.py 100755 python3 script text executable
+/usr/share/fwupd/uefi-capsule-ux.tar.xz 100644 xz compressed data
/usr/share/icons/hicolor/128x128/apps/org.freedesktop.fwupd.png 100644 PNG image, non-interlaced
warning (#700): non-identical /usr/share part
--- fwupd-tests-2.0.7-alt1.i586.rpm.share 2025-03-28 10:30:25.941892619 +0000
+++ fwupd-tests-2.0.7-alt1.aarch64.rpm.share 2025-03-28 10:30:25.943892641 +0000
@@ -14,3 +14,2 @@
/usr/share/installed-tests/fwupd/device-tests/amd-dgpu.json 100644 ASCII text
-/usr/share/installed-tests/fwupd/device-tests/amd-pmc.json 100644 ASCII text
/usr/share/installed-tests/fwupd/device-tests/analogix-anx7518.json 100644 ASCII text
@@ -22,3 +21,2 @@
/usr/share/installed-tests/fwupd/device-tests/caldigit-element.json 100644 ASCII text
-/usr/share/installed-tests/fwupd/device-tests/caldigit-ts4-tbt.json 100644 ASCII text
/usr/share/installed-tests/fwupd/device-tests/caldigit-ts4.json 100644 ASCII text
@@ -105,3 +103,2 @@
/usr/share/installed-tests/fwupd/device-tests/uefi-dbx.json 100644 ASCII text
-/usr/share/installed-tests/fwupd/device-tests/uefi-pk.json 100644 ASCII text
/usr/share/installed-tests/fwupd/device-tests/ugreen-cm260.json 100644 ASCII text
@@ -112,2 +109,13 @@
/usr/share/installed-tests/fwupd/device-tests/wistron-dock-40b7.json 100644 ASCII text
+/usr/share/installed-tests/fwupd/efi 40755 directory
+/usr/share/installed-tests/fwupd/efi/esrt 40755 directory
+/usr/share/installed-tests/fwupd/efi/esrt/entries 40755 directory
+/usr/share/installed-tests/fwupd/efi/esrt/entries/entry0 40755 directory
+/usr/share/installed-tests/fwupd/efi/esrt/entries/entry0/capsule_flags 100644 ASCII text
+/usr/share/installed-tests/fwupd/efi/esrt/entries/entry0/fw_class 100644 ASCII text
+/usr/share/installed-tests/fwupd/efi/esrt/entries/entry0/fw_type 100644 ASCII text
+/usr/share/installed-tests/fwupd/efi/esrt/entries/entry0/fw_version 100644 ASCII text
+/usr/share/installed-tests/fwupd/efi/esrt/entries/entry0/last_attempt_status 100644 ASCII text
+/usr/share/installed-tests/fwupd/efi/esrt/entries/entry0/last_attempt_version 100644 ASCII text
+/usr/share/installed-tests/fwupd/efi/esrt/entries/entry0/lowest_supported_fw_version 100644 ASCII text
/usr/share/installed-tests/fwupd/enumeration-data 40755 directory
@@ -115,3 +123,2 @@
/usr/share/installed-tests/fwupd/enumeration-data/amd-dgpu-setup.json 100644 ASCII text
-/usr/share/installed-tests/fwupd/enumeration-data/amd-pmc-setup.json 100644 ASCII text
/usr/share/installed-tests/fwupd/enumeration-data/asus-hid-setup.json 100644 ASCII text
@@ -141,3 +148,2 @@
/usr/share/installed-tests/fwupd/enumeration-data/synaptics-panamera-setup.json 100644 ASCII text
-/usr/share/installed-tests/fwupd/enumeration-data/uefi-pk-setup.json 100644 ASCII text, with very long lines
/usr/share/installed-tests/fwupd/enumeration-data/wacom-movink-13-setup.json 100644 ASCII text, with very long lines
@@ -251,9 +257,2 @@
/usr/share/installed-tests/fwupd/tests/elf.builder.xml 100644 ASCII text
-/usr/share/installed-tests/fwupd/tests/empty_pcr 40755 directory
-/usr/share/installed-tests/fwupd/tests/empty_pcr/tpm0 40755 directory
-/usr/share/installed-tests/fwupd/tests/empty_pcr/tpm0/active 100644 ASCII text
-/usr/share/installed-tests/fwupd/tests/empty_pcr/tpm0/caps 100644 ASCII text
-/usr/share/installed-tests/fwupd/tests/empty_pcr/tpm0/enabled 100644 ASCII text
-/usr/share/installed-tests/fwupd/tests/empty_pcr/tpm0/owned 100644 ASCII text
-/usr/share/installed-tests/fwupd/tests/empty_pcr/tpm0/pcrs 100644 ASCII text
/usr/share/installed-tests/fwupd/tests/fdt.builder.xml 100644 ASCII text
@@ -300,8 +299,2 @@
/usr/share/installed-tests/fwupd/tests/sys_vendor 100644 ASCII text
-/usr/share/installed-tests/fwupd/tests/tpm0 40755 directory
-/usr/share/installed-tests/fwupd/tests/tpm0/active 100644 ASCII text
-/usr/share/installed-tests/fwupd/tests/tpm0/caps 100644 ASCII text
-/usr/share/installed-tests/fwupd/tests/tpm0/enabled 100644 ASCII text
-/usr/share/installed-tests/fwupd/tests/tpm0/owned 100644 ASCII text
-/usr/share/installed-tests/fwupd/tests/tpm0/pcrs 100644 ASCII text
/usr/share/installed-tests/fwupd/tests/uf2.builder.xml 100644 ASCII HTML document text
warning (#700): non-identical /usr/share part
2025-Mar-28 10:32:15 :: noarch check OK
2025-Mar-28 10:32:17 :: plan: src +5 -5 =20032, aarch64 +31 -31 =34818, i586 +26 -26 =33689, noarch +2 -2 =21210, x86_64 +31 -31 =35624
#540 libcbor 0.11.0-alt1 -> 0.12.0-alt1
Fri Mar 28 2025 Anton Zhukharev <ancieg@altlinux> 0.12.0-alt1
- Updated to 0.12.0.
- Enabled check during building.
- Followed Shared Libs policy.
2025-Mar-28 10:32:57 :: patched apt indices
2025-Mar-28 10:33:06 :: created next repo
2025-Mar-28 10:33:16 :: duplicate provides check OK
2025-Mar-28 10:33:53 :: dependencies check OK
2025-Mar-28 10:34:23 :: [x86_64 i586 aarch64] ELF symbols check OK
i586: fwupd=2.0.7-alt1 post-install unowned files:
/usr/lib/systemd/system-shutdown
/usr/share/dbus-1
/usr/share/dbus-1/interfaces
/usr/share/dbus-1/system-services
/usr/share/dbus-1/system.d
/usr/share/fish
/usr/share/fish/vendor_completions.d
/usr/share/icons/hicolor/128x128
/usr/share/icons/hicolor/128x128/apps
/usr/share/icons/hicolor/64x64
/usr/share/icons/hicolor/64x64/apps
/usr/share/icons/hicolor/scalable
/usr/share/icons/hicolor/scalable/apps
/usr/share/metainfo
/usr/share/polkit-1
/usr/share/polkit-1/actions
/usr/share/polkit-1/rules.d
2025-Mar-28 10:34:36 :: [i586] #700 fwupd: install check OK (cached)
x86_64: fwupd=2.0.7-alt1 post-install unowned files:
/etc/grub.d
/usr/lib/systemd/system-shutdown
/usr/share/dbus-1
/usr/share/dbus-1/interfaces
/usr/share/dbus-1/system-services
/usr/share/dbus-1/system.d
/usr/share/fish
/usr/share/fish/vendor_completions.d
/usr/share/icons/hicolor/128x128
/usr/share/icons/hicolor/128x128/apps
/usr/share/icons/hicolor/64x64
/usr/share/icons/hicolor/64x64/apps
/usr/share/icons/hicolor/scalable
/usr/share/icons/hicolor/scalable/apps
/usr/share/metainfo
/usr/share/polkit-1
/usr/share/polkit-1/actions
/usr/share/polkit-1/rules.d
2025-Mar-28 10:34:36 :: [x86_64] #700 fwupd: install check OK (cached)
2025-Mar-28 10:34:40 :: [i586] #700 fwupd-debuginfo: install check OK (cached)
2025-Mar-28 10:34:41 :: [x86_64] #700 fwupd-debuginfo: install check OK (cached)
aarch64: fwupd=2.0.7-alt1 post-install unowned files:
/etc/grub.d
/usr/lib/systemd/system-shutdown
/usr/lib/sysusers.d
/usr/share/dbus-1
/usr/share/dbus-1/interfaces
/usr/share/dbus-1/system-services
/usr/share/dbus-1/system.d
/usr/share/fish
/usr/share/fish/vendor_completions.d
/usr/share/icons/hicolor/128x128
/usr/share/icons/hicolor/128x128/apps
/usr/share/icons/hicolor/64x64
/usr/share/icons/hicolor/64x64/apps
/usr/share/icons/hicolor/scalable
/usr/share/icons/hicolor/scalable/apps
/usr/share/metainfo
/usr/share/polkit-1
/usr/share/polkit-1/actions
/usr/share/polkit-1/rules.d
2025-Mar-28 10:34:44 :: [aarch64] #700 fwupd: install check OK (cached)
2025-Mar-28 10:34:45 :: [i586] #700 fwupd-plugin-modem-manager: install check OK (cached)
2025-Mar-28 10:34:46 :: [x86_64] #700 fwupd-plugin-modem-manager: install check OK (cached)
2025-Mar-28 10:34:50 :: [i586] #700 fwupd-plugin-modem-manager-debuginfo: install check OK (cached)
2025-Mar-28 10:34:51 :: [x86_64] #700 fwupd-plugin-modem-manager-debuginfo: install check OK (cached)
2025-Mar-28 10:34:53 :: [aarch64] #700 fwupd-debuginfo: install check OK (cached)
i586: fwupd-tests=2.0.7-alt1 post-install unowned files:
/usr/libexec/installed-tests
/usr/share/installed-tests
2025-Mar-28 10:34:54 :: [i586] #700 fwupd-tests: install check OK (cached)
x86_64: fwupd-tests=2.0.7-alt1 post-install unowned files:
/usr/libexec/installed-tests
/usr/share/installed-tests
2025-Mar-28 10:34:55 :: [x86_64] #700 fwupd-tests: install check OK (cached)
2025-Mar-28 10:34:59 :: [i586] #700 fwupd-tests-debuginfo: install check OK (cached)
2025-Mar-28 10:35:00 :: [x86_64] #700 fwupd-tests-debuginfo: install check OK (cached)
2025-Mar-28 10:35:01 :: [aarch64] #700 fwupd-plugin-modem-manager: install check OK (cached)
2025-Mar-28 10:35:03 :: [i586] #1000 itk-doc: install check OK (cached)
2025-Mar-28 10:35:04 :: [x86_64] #1000 itk-doc: install check OK (cached)
2025-Mar-28 10:35:07 :: [i586] #1000 itk-examples: install check OK (cached)
2025-Mar-28 10:35:09 :: [x86_64] #1000 itk-examples: install check OK (cached)
2025-Mar-28 10:35:09 :: [aarch64] #700 fwupd-plugin-modem-manager-debuginfo: install check OK (cached)
2025-Mar-28 10:35:12 :: [i586] #1000 itk-examples-debuginfo: install check OK (cached)
2025-Mar-28 10:35:15 :: [x86_64] #1000 itk-examples-debuginfo: install check OK (cached)
2025-Mar-28 10:35:17 :: [i586] #1000 itk-testdriver: install check OK (cached)
aarch64: fwupd-tests=2.0.7-alt1 post-install unowned files:
/usr/libexec/installed-tests
/usr/share/installed-tests
2025-Mar-28 10:35:17 :: [aarch64] #700 fwupd-tests: install check OK (cached)
2025-Mar-28 10:35:19 :: [x86_64] #1000 itk-testdriver: install check OK (cached)
2025-Mar-28 10:35:22 :: [i586] #1000 itk-testdriver-debuginfo: install check OK (cached)
2025-Mar-28 10:35:24 :: [x86_64] #1000 itk-testdriver-debuginfo: install check OK (cached)
2025-Mar-28 10:35:26 :: [aarch64] #700 fwupd-tests-debuginfo: install check OK (cached)
i586: libcbor-devel=0.12.0-alt1 post-install unowned files:
/usr/lib/cmake
2025-Mar-28 10:35:26 :: [i586] #540 libcbor-devel: install check OK (cached)
x86_64: libcbor-devel=0.12.0-alt1 post-install unowned files:
/usr/lib64/cmake
2025-Mar-28 10:35:29 :: [x86_64] #540 libcbor-devel: install check OK (cached)
2025-Mar-28 10:35:30 :: [i586] #540 libcbor0.12: install check OK (cached)
2025-Mar-28 10:35:33 :: [x86_64] #540 libcbor0.12: install check OK (cached)
2025-Mar-28 10:35:33 :: [aarch64] #1000 itk-doc: install check OK (cached)
2025-Mar-28 10:35:34 :: [i586] #540 libcbor0.12-debuginfo: install check OK (cached)
2025-Mar-28 10:35:37 :: [x86_64] #540 libcbor0.12-debuginfo: install check OK (cached)
2025-Mar-28 10:35:38 :: [i586] #1100 libfido2: install check OK (cached)
2025-Mar-28 10:35:41 :: [aarch64] #1000 itk-examples: install check OK (cached)
2025-Mar-28 10:35:41 :: [x86_64] #1100 libfido2: install check OK (cached)
2025-Mar-28 10:35:42 :: [i586] #1100 libfido2-debuginfo: install check OK (cached)
2025-Mar-28 10:35:46 :: [x86_64] #1100 libfido2-debuginfo: install check OK (cached)
2025-Mar-28 10:35:46 :: [i586] #1100 libfido2-devel: install check OK (cached)
2025-Mar-28 10:35:50 :: [x86_64] #1100 libfido2-devel: install check OK (cached)
2025-Mar-28 10:35:50 :: [i586] #1100 libfido2-tools: install check OK (cached)
2025-Mar-28 10:35:51 :: [aarch64] #1000 itk-examples-debuginfo: install check OK (cached)
2025-Mar-28 10:35:54 :: [x86_64] #1100 libfido2-tools: install check OK (cached)
2025-Mar-28 10:35:54 :: [i586] #1100 libfido2-tools-debuginfo: install check OK (cached)
2025-Mar-28 10:35:59 :: [i586] #700 libfwupd-devel: install check OK (cached)
2025-Mar-28 10:35:59 :: [x86_64] #1100 libfido2-tools-debuginfo: install check OK (cached)
2025-Mar-28 10:35:59 :: [aarch64] #1000 itk-testdriver: install check OK (cached)
2025-Mar-28 10:36:03 :: [i586] #700 libfwupd-devel-docs: install check OK (cached)
2025-Mar-28 10:36:03 :: [x86_64] #700 libfwupd-devel: install check OK (cached)
2025-Mar-28 10:36:07 :: [i586] #700 libfwupd3: install check OK (cached)
2025-Mar-28 10:36:07 :: [x86_64] #700 libfwupd-devel-docs: install check OK (cached)
2025-Mar-28 10:36:08 :: [aarch64] #1000 itk-testdriver-debuginfo: install check OK (cached)
2025-Mar-28 10:36:11 :: [i586] #700 libfwupd3-debuginfo: install check OK (cached)
2025-Mar-28 10:36:12 :: [x86_64] #700 libfwupd3: install check OK (cached)
aarch64: libcbor-devel=0.12.0-alt1 post-install unowned files:
/usr/lib64/cmake
2025-Mar-28 10:36:16 :: [aarch64] #540 libcbor-devel: install check OK (cached)
2025-Mar-28 10:36:16 :: [x86_64] #700 libfwupd3-debuginfo: install check OK (cached)
2025-Mar-28 10:36:18 :: [i586] #1000 libitk-devel: install check OK (cached)
2025-Mar-28 10:36:22 :: [i586] #1000 libitk5.4: install check OK (cached)
2025-Mar-28 10:36:23 :: [x86_64] #1000 libitk-devel: install check OK (cached)
2025-Mar-28 10:36:24 :: [aarch64] #540 libcbor0.12: install check OK (cached)
2025-Mar-28 10:36:27 :: [i586] #1000 libitk5.4-debuginfo: install check OK (cached)
2025-Mar-28 10:36:27 :: [x86_64] #1000 libitk5.4: install check OK (cached)
2025-Mar-28 10:36:32 :: [i586] #1000 libitk5.4-glue: install check OK (cached)
2025-Mar-28 10:36:33 :: [x86_64] #1000 libitk5.4-debuginfo: install check OK (cached)
2025-Mar-28 10:36:34 :: [aarch64] #540 libcbor0.12-debuginfo: install check OK (cached)
2025-Mar-28 10:36:37 :: [x86_64] #1000 libitk5.4-glue: install check OK (cached)
2025-Mar-28 10:36:38 :: [i586] #1000 libitk5.4-glue-debuginfo: install check OK (cached)
2025-Mar-28 10:36:43 :: [x86_64] #1000 libitk5.4-glue-debuginfo: install check OK (cached)
2025-Mar-28 10:36:44 :: [aarch64] #1100 libfido2: install check OK (cached)
2025-Mar-28 10:36:49 :: [x86_64] #1200 slicer: install check OK (cached)
2025-Mar-28 10:36:53 :: [aarch64] #1100 libfido2-debuginfo: install check OK (cached)
2025-Mar-28 10:37:00 :: [aarch64] #1100 libfido2-devel: install check OK (cached)
2025-Mar-28 10:37:01 :: [x86_64] #1200 slicer-debuginfo: install check OK (cached)
2025-Mar-28 10:37:07 :: [x86_64] #1200 slicer-devel: install check OK (cached)
2025-Mar-28 10:37:08 :: [aarch64] #1100 libfido2-tools: install check OK (cached)
x86_64: slicer-qt5-designer-plugin=5.8.0-alt1 post-install unowned files:
/usr/lib64/qt5/plugins/designer
2025-Mar-28 10:37:13 :: [x86_64] #1200 slicer-qt5-designer-plugin: install check OK (cached)
2025-Mar-28 10:37:16 :: [aarch64] #1100 libfido2-tools-debuginfo: install check OK (cached)
2025-Mar-28 10:37:24 :: [aarch64] #700 libfwupd-devel: install check OK (cached)
2025-Mar-28 10:37:24 :: [x86_64] #1200 slicer-qt5-designer-plugin-debuginfo: install check OK (cached)
2025-Mar-28 10:37:32 :: [aarch64] #700 libfwupd-devel-docs: install check OK (cached)
2025-Mar-28 10:37:40 :: [aarch64] #700 libfwupd3: install check OK (cached)
2025-Mar-28 10:37:48 :: [aarch64] #700 libfwupd3-debuginfo: install check OK (cached)
2025-Mar-28 10:38:00 :: [aarch64] #1000 libitk-devel: install check OK (cached)
2025-Mar-28 10:38:08 :: [aarch64] #1000 libitk5.4: install check OK (cached)
2025-Mar-28 10:38:17 :: [aarch64] #1000 libitk5.4-debuginfo: install check OK (cached)
2025-Mar-28 10:38:25 :: [aarch64] #1000 libitk5.4-glue: install check OK (cached)
2025-Mar-28 10:38:36 :: [aarch64] #1000 libitk5.4-glue-debuginfo: install check OK (cached)
2025-Mar-28 10:38:46 :: [aarch64] #1200 slicer: install check OK (cached)
2025-Mar-28 10:39:05 :: [aarch64] #1200 slicer-debuginfo: install check OK (cached)
2025-Mar-28 10:39:15 :: [aarch64] #1200 slicer-devel: install check OK (cached)
aarch64: slicer-qt5-designer-plugin=5.8.0-alt1 post-install unowned files:
/usr/lib64/qt5/plugins/designer
2025-Mar-28 10:39:27 :: [aarch64] #1200 slicer-qt5-designer-plugin: install check OK (cached)
2025-Mar-28 10:39:50 :: [aarch64] #1200 slicer-qt5-designer-plugin-debuginfo: install check OK (cached)
2025-Mar-28 10:39:52 :: [x86_64-i586] plan: #0 +11 -11 =11597
2025-Mar-28 10:40:09 :: [x86_64-i586] generated apt indices
2025-Mar-28 10:40:11 :: [x86_64-i586] created next repo
2025-Mar-28 10:40:23 :: [x86_64-i586] dependencies check OK
2025-Mar-28 10:40:25 :: gears inheritance check OK
2025-Mar-28 10:40:25 :: srpm inheritance check OK
girar-check-perms: access to libcbor ALLOWED for ancieg: project leader
check-subtask-perms: #540: libcbor: allowed for ancieg
girar-check-perms: access to fwupd ALLOWED for ancieg: rebuild is allowed by default
check-subtask-perms: #700: fwupd: allowed for ancieg
girar-check-perms: access to itk ALLOWED for ancieg: project leader welcomes random builders
check-subtask-perms: #1000: itk: allowed for ancieg
girar-check-perms: access to libfido2 ALLOWED for ancieg: project leader
check-subtask-perms: #1100: libfido2: allowed for ancieg
girar-check-perms: access to slicer ALLOWED for ancieg: project leader welcomes random builders
check-subtask-perms: #1200: slicer: allowed for ancieg
2025-Mar-28 10:40:26 :: acl check OK
2025-Mar-28 10:40:50 :: created contents_index files
2025-Mar-28 10:41:03 :: created hash files: aarch64 i586 noarch src x86_64-i586 x86_64
2025-Mar-28 10:41:07 :: task #378362 for sisyphus TESTED
2025-Mar-28 10:41:08 :: task is ready for commit
2025-Mar-28 10:41:14 :: repo clone OK
2025-Mar-28 10:41:16 :: packages update OK
2025-Mar-28 10:41:27 :: [x86_64 i586 aarch64 noarch] update OK
2025-Mar-28 10:41:28 :: [x86_64-i586] update OK
2025-Mar-28 10:41:28 :: repo update OK
2025-Mar-28 10:41:42 :: repo save OK
2025-Mar-28 10:41:43 :: src index update OK
2025-Mar-28 10:41:43 :: updated /gears/f/fwupd.git branch `sisyphus'
2025-Mar-28 10:41:43 :: updated /gears/i/itk.git branch `sisyphus'
2025-Mar-28 10:41:43 :: updated /gears/l/libcbor.git branch `sisyphus'
2025-Mar-28 10:41:43 :: updated /gears/l/libfido2.git branch `sisyphus'
2025-Mar-28 10:41:43 :: updated /gears/s/slicer.git branch `sisyphus'
2025-Mar-28 10:42:06 :: gears update OK
2025-Mar-28 10:42:06 :: task #378362 for sisyphus DONE
^ permalink raw reply [flat|nested] 4+ messages in thread
end of thread, other threads:[~2025-03-28 10:42 UTC | newest]
Thread overview: 4+ messages (download: mbox.gz / follow: Atom feed)
-- links below jump to the message on this page --
2025-03-18 7:45 [#378362] [test-only] FAILED libcbor.git=0.12.0-alt1 Girar awaiter (ancieg)
2025-03-18 8:01 ` [#378362] [test-only] FAILED (try 2) libcbor.git=0.12.0-alt1 fwupd.git=2.0.6-alt1 itk.git=5.4.2-alt1 Girar awaiter (ancieg)
2025-03-28 8:24 ` [#378362] TESTED (try 3) libcbor.git=0.12.0-alt1 fwupd.git=2.0.7-alt1 itk.git=5.4.3-alt1 Girar awaiter (ancieg)
2025-03-28 10:42 ` [#378362] DONE (try 4) " Girar pender (ancieg)
ALT Linux Girar Builder robot reports
This inbox may be cloned and mirrored by anyone:
git clone --mirror http://lore.altlinux.org/sisyphus-incominger/0 sisyphus-incominger/git/0.git
# If you have public-inbox 1.1+ installed, you may
# initialize and index your mirror using the following commands:
public-inbox-init -V2 sisyphus-incominger sisyphus-incominger/ http://lore.altlinux.org/sisyphus-incominger \
sisyphus-incominger@lists.altlinux.org sisyphus-incominger@lists.altlinux.ru sisyphus-incominger@lists.altlinux.com
public-inbox-index sisyphus-incominger
Example config snippet for mirrors.
Newsgroup available over NNTP:
nntp://lore.altlinux.org/org.altlinux.lists.sisyphus-incominger
AGPL code for this site: git clone https://public-inbox.org/public-inbox.git