From mboxrd@z Thu Jan  1 00:00:00 1970
Return-Path: <girar-builder@altlinux.org>
X-Spam-Checker-Version: SpamAssassin 3.4.1 (2015-04-28) on
 sa.local.altlinux.org
X-Spam-Level: 
X-Spam-Status: No, score=-3.3 required=5.0 tests=BAYES_00,RP_MATCHES_RCVD
 autolearn=unavailable autolearn_force=no version=3.4.1
Date: Tue, 18 Mar 2025 10:56:20 +0000
From: "Girar awaiter (ancieg)" <girar-builder@altlinux.org>
To: Anton Zhukharev <ancieg@altlinux.org>
Subject: [#377603] [test-only] p11 FAILED (try 9)
 srpm=python3-module-maturin-1.8.3-alt1.src.rpm ruff.git=0.11.0-alt1 ...
Message-ID: <girar.task.377603.9.1@gyle.mskdc.altlinux.org>
Mail-Followup-To: Girar awaiter robot <girar-builder@altlinux.org>
References: <girar.task.377603.8.1@gyle.mskdc.altlinux.org>
 <girar.task.377603.7.1@gyle.mskdc.altlinux.org>
 <girar.task.377603.6.1@gyle.mskdc.altlinux.org>
 <girar.task.377603.5.1@gyle.mskdc.altlinux.org>
 <girar.task.377603.4.1@gyle.mskdc.altlinux.org>
 <girar.task.377603.3.1@gyle.mskdc.altlinux.org>
 <girar.task.377603.2.1@gyle.mskdc.altlinux.org>
 <girar.task.377603.1.1@gyle.mskdc.altlinux.org>
MIME-Version: 1.0
Content-Type: text/plain; charset=us-ascii
Content-Disposition: inline
Content-Transfer-Encoding: quoted-printable
In-Reply-To: <girar.task.377603.1.1@gyle.mskdc.altlinux.org>
X-girar-task-id: 377603
X-girar-task-owner: ancieg
X-girar-task-repo: p11
X-girar-task-try: 9
X-girar-task-iter: 1
X-girar-task-status: FAILED
X-girar-task-URL: https://git.altlinux.org/tasks/377603/
X-girar-task-log: logs/events.9.1.log
X-girar-task-summary: [#377603] [test-only] p11 FAILED (try 9)
 srpm=python3-module-maturin-1.8.3-alt1.src.rpm ruff.git=0.11.0-alt1
 python3-module-black.git=25.1.0-alt1 python3-module-pytest.git=8.3.5-alt1
 python3-module-pytest-examples.git=0.0.15-alt1
 python3-module-xsdata.git=24.12-alt1 python3-module-avro.git=1.11.3-alt3
 python3-module-beartype.git=0.19.0-alt1 python3-module-cffi.git=1.17.1-alt1
 python3-module-dbus-next.git=0.2.3-alt4
 python3-module-djangorestframework.git=3.15.2-alt1
 python3-module-executing.git=2.2.0-alt1 del=python3-module-glob2
 python3-module-graphviz.git=0.20.3-alt2
 python3-module-inline-snapshot.git=0.17.1-alt1
 python3-module-ipywidgets.git=8.1.5-alt1 python3-module-parso.git=0.8.4-alt1
 python3-module-jedi.git=0.19.2-alt1 python3-module-tornado.git=6.4.2-alt1
 python3-module-jupyter_client.git=8.6.3-alt1
 python3-module-libcst.git=1.7.0-alt1
 python3-module-logilab-common.git=2.0.0-alt3
 python3-module-nibabel.git=5.2.1-alt2 python3-module-pyamg.git=5.2.1-alt1
 python3-module-pytest-rerunfailures.git=15.0-alt1
 python3-module-stestr.git=4.1.0-alt3
 python3-module-terminado.git=0.18.1-alt1
User-Agent: Mutt/1.10.1 (2018-07-13)
Cc: sisyphus-incominger@lists.altlinux.org, girar-builder-p11@altlinux.org,
 girar-builder-p11@lists.altlinux.org
X-BeenThere: sisyphus-incominger@lists.altlinux.org
X-Mailman-Version: 2.1.12
Precedence: list
Reply-To: ALT Devel discussion list <devel@lists.altlinux.org>
List-Id: ALT Linux Girar Builder robot reports
 <sisyphus-incominger.lists.altlinux.org>
List-Unsubscribe: <https://lists.altlinux.org/mailman/options/sisyphus-incominger>, 
 <mailto:sisyphus-incominger-request@lists.altlinux.org?subject=unsubscribe>
List-Archive: <http://lists.altlinux.org/pipermail/sisyphus-incominger>
List-Post: <mailto:sisyphus-incominger@lists.altlinux.org>
List-Help: <mailto:sisyphus-incominger-request@lists.altlinux.org?subject=help>
List-Subscribe: <https://lists.altlinux.org/mailman/listinfo/sisyphus-incominger>, 
 <mailto:sisyphus-incominger-request@lists.altlinux.org?subject=subscribe>
X-List-Received-Date: Tue, 18 Mar 2025 10:56:25 -0000
Archived-At: <http://lore.altlinux.org/sisyphus-incominger/girar.task.377603.9.1@gyle.mskdc.altlinux.org/>
List-Archive: <http://lore.altlinux.org/sisyphus-incominger/>

https://git.altlinux.org/tasks/377603/logs/events.9.1.log
https://packages.altlinux.org/tasks/377603

subtask  name                                 aarch64  i586  x86_64
  #1700  python3-module-ipywidgets               1:25    57      53
  #1740  python3-module-parso                      58    32      31
  #2000  python3-module-jedi                     2:55  1:36    1:33
  #2040  python3-module-tornado                  1:11    48      46
  #2100  python3-module-jupyter_client           6:55  6:24    6:21
  #2200  python3-module-libcst                   6:44  4:15    3:36
  #2300  python3-module-logilab-common             43    27      27
  #2400  python3-module-nibabel                  4:13  2:19    2:04
  #2500  python3-module-pyamg                    2:49  1:43    1:39
  #2600  python3-module-pytest-rerunfailures       51    30      30
  #2700  python3-module-stestr                   1:24    51      48
  #3000  python3-module-terminado              failed  1:06    1:06

2025-Mar-18 10:24:37 :: test-only swift task #377603 for p11 resumed by anc=
ieg:
2025-Mar-18 10:24:37 :: message: Update ruff for P11
#40 build python3-module-maturin-1.8.3-alt1.src.rpm from sisyphus
#100 removed
#140 build 0.11.0-alt1 from /gears/r/ruff.git fetched at 2025-Mar-18 09:33:=
11 from sisyphus
#200 removed
#240 build 25.1.0-alt1 from /gears/p/python3-module-black.git fetched at 20=
25-Mar-12 13:59:20 from sisyphus
#260 build 8.3.5-alt1 from /gears/p/python3-module-pytest.git fetched at 20=
25-Mar-12 14:05:02 from sisyphus
#300 build 0.0.15-alt1 from /gears/p/python3-module-pytest-examples.git fet=
ched at 2025-Mar-12 13:56:27 from sisyphus
#400 build 24.12-alt1 from /gears/p/python3-module-xsdata.git fetched at 20=
25-Mar-12 13:56:31 from sisyphus
#500 build 1.11.3-alt3 from /gears/p/python3-module-avro.git fetched at 202=
5-Mar-17 14:17:31 from sisyphus
#600 build 0.19.0-alt1 from /gears/p/python3-module-beartype.git fetched at=
 2025-Mar-17 14:18:26 from sisyphus
#700 build 1.17.1-alt1 from /gears/p/python3-module-cffi.git fetched at 202=
5-Mar-17 14:19:19 from sisyphus
#740 build 0.2.3-alt4 from /gears/p/python3-module-dbus-next.git fetched at=
 2025-Mar-18 09:45:12 from sisyphus
#1000 removed
#1100 build 3.15.2-alt1 from /gears/p/python3-module-djangorestframework.gi=
t fetched at 2025-Mar-17 14:20:05 from sisyphus
#1200 build 2.2.0-alt1 from /gears/p/python3-module-executing.git fetched a=
t 2025-Mar-17 14:20:26 from sisyphus
#1300 delete python3-module-glob2
#1400 removed
#1500 build 0.20.3-alt2 from /gears/p/python3-module-graphviz.git fetched a=
t 2025-Mar-17 14:21:25 from sisyphus
#1600 build 0.17.1-alt1 from /gears/p/python3-module-inline-snapshot.git fe=
tched at 2025-Mar-17 14:21:58 from sisyphus
#1700 build 8.1.5-alt1 from /gears/p/python3-module-ipywidgets.git fetched =
at 2025-Mar-17 14:22:22 from sisyphus
#1740 build 0.8.4-alt1 from /gears/p/python3-module-parso.git fetched at 20=
25-Mar-18 10:13:14 from sisyphus
#2000 build 0.19.2-alt1 from /gears/p/python3-module-jedi.git fetched at 20=
25-Mar-17 14:22:36 from sisyphus
#2040 build 6.4.2-alt1 from /gears/p/python3-module-tornado.git fetched at =
2025-Mar-18 10:24:32 from sisyphus
#2100 build 8.6.3-alt1 from /gears/p/python3-module-jupyter_client.git fetc=
hed at 2025-Mar-17 14:22:52 from sisyphus
#2200 build 1.7.0-alt1 from /gears/p/python3-module-libcst.git fetched at 2=
025-Mar-17 14:23:13 from sisyphus
#2300 build 2.0.0-alt3 from /gears/p/python3-module-logilab-common.git fetc=
hed at 2025-Mar-17 14:23:27 from sisyphus
#2400 build 5.2.1-alt2 from /gears/p/python3-module-nibabel.git fetched at =
2025-Mar-17 14:23:53 from sisyphus
#2500 build 5.2.1-alt1 from /gears/p/python3-module-pyamg.git fetched at 20=
25-Mar-17 14:24:12 from sisyphus
#2600 build 15.0-alt1 from /gears/p/python3-module-pytest-rerunfailures.git=
 fetched at 2025-Mar-17 14:24:33 from sisyphus
#2700 build 4.1.0-alt3 from /gears/p/python3-module-stestr.git fetched at 2=
025-Mar-17 14:24:56 from sisyphus
#3000 build 0.18.1-alt1 from /gears/p/python3-module-terminado.git fetched =
at 2025-Mar-17 14:25:22 from sisyphus
2025-Mar-18 10:24:37 :: created build repo
2025-Mar-18 10:24:38 :: #1700: force rebuild
2025-Mar-18 10:24:38 :: #1740: force rebuild
2025-Mar-18 10:24:38 :: #2000: force rebuild
2025-Mar-18 10:24:38 :: [aarch64] #40 python3-module-maturin-1.8.3-alt1.src=
=2Erpm: build start
2025-Mar-18 10:24:38 :: [i586] #40 python3-module-maturin-1.8.3-alt1.src.rp=
m: build start
2025-Mar-18 10:24:38 :: [x86_64] #40 python3-module-maturin-1.8.3-alt1.src.=
rpm: build start
2025-Mar-18 10:24:39 :: [i586] #40 python3-module-maturin-1.8.3-alt1.src.rp=
m: build swiftly SKIPPED
2025-Mar-18 10:24:39 :: [x86_64] #40 python3-module-maturin-1.8.3-alt1.src.=
rpm: build swiftly SKIPPED
2025-Mar-18 10:24:39 :: [i586] #140 ruff.git 0.11.0-alt1: build start
2025-Mar-18 10:24:39 :: [aarch64] #40 python3-module-maturin-1.8.3-alt1.src=
=2Erpm: build swiftly SKIPPED
2025-Mar-18 10:24:39 :: [x86_64] #140 ruff.git 0.11.0-alt1: build start
2025-Mar-18 10:24:39 :: [aarch64] #140 ruff.git 0.11.0-alt1: build start
2025-Mar-18 10:24:39 :: [i586] #140 ruff.git 0.11.0-alt1: build swiftly SKI=
PPED
2025-Mar-18 10:24:39 :: [x86_64] #140 ruff.git 0.11.0-alt1: build swiftly S=
KIPPED
2025-Mar-18 10:24:40 :: [i586] #240 python3-module-black.git 25.1.0-alt1: b=
uild start
2025-Mar-18 10:24:40 :: [x86_64] #240 python3-module-black.git 25.1.0-alt1:=
 build start
2025-Mar-18 10:24:40 :: [i586] #240 python3-module-black.git 25.1.0-alt1: b=
uild swiftly SKIPPED
2025-Mar-18 10:24:40 :: [x86_64] #240 python3-module-black.git 25.1.0-alt1:=
 build swiftly SKIPPED
2025-Mar-18 10:24:40 :: [aarch64] #140 ruff.git 0.11.0-alt1: build swiftly =
SKIPPED
2025-Mar-18 10:24:40 :: [i586] #260 python3-module-pytest.git 8.3.5-alt1: b=
uild start
2025-Mar-18 10:24:40 :: [x86_64] #260 python3-module-pytest.git 8.3.5-alt1:=
 build start
2025-Mar-18 10:24:41 :: [x86_64] #260 python3-module-pytest.git 8.3.5-alt1:=
 build swiftly SKIPPED
2025-Mar-18 10:24:41 :: [i586] #260 python3-module-pytest.git 8.3.5-alt1: b=
uild swiftly SKIPPED
2025-Mar-18 10:24:41 :: [i586] #300 python3-module-pytest-examples.git 0.0.=
15-alt1: build start
2025-Mar-18 10:24:41 :: [x86_64] #300 python3-module-pytest-examples.git 0.=
0.15-alt1: build start
2025-Mar-18 10:24:41 :: [x86_64] #300 python3-module-pytest-examples.git 0.=
0.15-alt1: build swiftly SKIPPED
2025-Mar-18 10:24:41 :: [i586] #300 python3-module-pytest-examples.git 0.0.=
15-alt1: build swiftly SKIPPED
2025-Mar-18 10:24:41 :: [aarch64] #240 python3-module-black.git 25.1.0-alt1=
: build start
2025-Mar-18 10:24:42 :: [i586] #400 python3-module-xsdata.git 24.12-alt1: b=
uild start
2025-Mar-18 10:24:42 :: [x86_64] #400 python3-module-xsdata.git 24.12-alt1:=
 build start
2025-Mar-18 10:24:42 :: [aarch64] #240 python3-module-black.git 25.1.0-alt1=
: build swiftly SKIPPED
2025-Mar-18 10:24:42 :: [i586] #400 python3-module-xsdata.git 24.12-alt1: b=
uild swiftly SKIPPED
2025-Mar-18 10:24:42 :: [x86_64] #400 python3-module-xsdata.git 24.12-alt1:=
 build swiftly SKIPPED
2025-Mar-18 10:24:42 :: [aarch64] #260 python3-module-pytest.git 8.3.5-alt1=
: build start
2025-Mar-18 10:24:42 :: [aarch64] #260 python3-module-pytest.git 8.3.5-alt1=
: build swiftly SKIPPED
2025-Mar-18 10:24:42 :: [x86_64] #500 python3-module-avro.git 1.11.3-alt3: =
build start
2025-Mar-18 10:24:42 :: [i586] #500 python3-module-avro.git 1.11.3-alt3: bu=
ild start
2025-Mar-18 10:24:42 :: [x86_64] #500 python3-module-avro.git 1.11.3-alt3: =
build swiftly SKIPPED
2025-Mar-18 10:24:42 :: [i586] #500 python3-module-avro.git 1.11.3-alt3: bu=
ild swiftly SKIPPED
2025-Mar-18 10:24:42 :: [aarch64] #300 python3-module-pytest-examples.git 0=
=2E0.15-alt1: build start
2025-Mar-18 10:24:43 :: [aarch64] #300 python3-module-pytest-examples.git 0=
=2E0.15-alt1: build swiftly SKIPPED
2025-Mar-18 10:24:43 :: [x86_64] #600 python3-module-beartype.git 0.19.0-al=
t1: build start
2025-Mar-18 10:24:43 :: [i586] #600 python3-module-beartype.git 0.19.0-alt1=
: build start
2025-Mar-18 10:24:43 :: [aarch64] #400 python3-module-xsdata.git 24.12-alt1=
: build start
2025-Mar-18 10:24:43 :: [x86_64] #600 python3-module-beartype.git 0.19.0-al=
t1: build swiftly SKIPPED
2025-Mar-18 10:24:43 :: [i586] #600 python3-module-beartype.git 0.19.0-alt1=
: build swiftly SKIPPED
2025-Mar-18 10:24:43 :: [aarch64] #400 python3-module-xsdata.git 24.12-alt1=
: build swiftly SKIPPED
2025-Mar-18 10:24:43 :: [i586] #700 python3-module-cffi.git 1.17.1-alt1: bu=
ild start
2025-Mar-18 10:24:43 :: [x86_64] #700 python3-module-cffi.git 1.17.1-alt1: =
build start
2025-Mar-18 10:24:43 :: [i586] #700 python3-module-cffi.git 1.17.1-alt1: bu=
ild swiftly SKIPPED
2025-Mar-18 10:24:43 :: [x86_64] #700 python3-module-cffi.git 1.17.1-alt1: =
build swiftly SKIPPED
2025-Mar-18 10:24:44 :: [aarch64] #500 python3-module-avro.git 1.11.3-alt3:=
 build start
2025-Mar-18 10:24:44 :: [i586] #740 python3-module-dbus-next.git 0.2.3-alt4=
: build start
2025-Mar-18 10:24:44 :: [aarch64] #500 python3-module-avro.git 1.11.3-alt3:=
 build swiftly SKIPPED
2025-Mar-18 10:24:44 :: [i586] #740 python3-module-dbus-next.git 0.2.3-alt4=
: build swiftly SKIPPED
2025-Mar-18 10:24:44 :: [aarch64] #600 python3-module-beartype.git 0.19.0-a=
lt1: build start
2025-Mar-18 10:24:44 :: [i586] #1100 python3-module-djangorestframework.git=
 3.15.2-alt1: build start
2025-Mar-18 10:24:44 :: [aarch64] #600 python3-module-beartype.git 0.19.0-a=
lt1: build swiftly SKIPPED
2025-Mar-18 10:24:44 :: [i586] #1100 python3-module-djangorestframework.git=
 3.15.2-alt1: build swiftly SKIPPED
2025-Mar-18 10:24:45 :: [aarch64] #700 python3-module-cffi.git 1.17.1-alt1:=
 build start
2025-Mar-18 10:24:45 :: [i586] #1200 python3-module-executing.git 2.2.0-alt=
1: build start
2025-Mar-18 10:24:45 :: [aarch64] #700 python3-module-cffi.git 1.17.1-alt1:=
 build swiftly SKIPPED
2025-Mar-18 10:24:45 :: [x86_64] #740 python3-module-dbus-next.git 0.2.3-al=
t4: build start
2025-Mar-18 10:24:45 :: [i586] #1200 python3-module-executing.git 2.2.0-alt=
1: build swiftly SKIPPED
2025-Mar-18 10:24:45 :: [x86_64] #740 python3-module-dbus-next.git 0.2.3-al=
t4: build swiftly SKIPPED
2025-Mar-18 10:24:45 :: [aarch64] #740 python3-module-dbus-next.git 0.2.3-a=
lt4: build start
2025-Mar-18 10:24:45 :: [aarch64] #740 python3-module-dbus-next.git 0.2.3-a=
lt4: build swiftly SKIPPED
2025-Mar-18 10:24:45 :: [i586] #1500 python3-module-graphviz.git 0.20.3-alt=
2: build start
2025-Mar-18 10:24:45 :: [x86_64] #1100 python3-module-djangorestframework.g=
it 3.15.2-alt1: build start
2025-Mar-18 10:24:45 :: [i586] #1500 python3-module-graphviz.git 0.20.3-alt=
2: build swiftly SKIPPED
2025-Mar-18 10:24:45 :: [x86_64] #1100 python3-module-djangorestframework.g=
it 3.15.2-alt1: build swiftly SKIPPED
2025-Mar-18 10:24:45 :: [aarch64] #1100 python3-module-djangorestframework.=
git 3.15.2-alt1: build start
2025-Mar-18 10:24:46 :: [i586] #1600 python3-module-inline-snapshot.git 0.1=
7.1-alt1: build start
2025-Mar-18 10:24:46 :: [x86_64] #1200 python3-module-executing.git 2.2.0-a=
lt1: build start
2025-Mar-18 10:24:46 :: [aarch64] #1100 python3-module-djangorestframework.=
git 3.15.2-alt1: build swiftly SKIPPED
2025-Mar-18 10:24:46 :: [i586] #1600 python3-module-inline-snapshot.git 0.1=
7.1-alt1: build swiftly SKIPPED
2025-Mar-18 10:24:46 :: [x86_64] #1200 python3-module-executing.git 2.2.0-a=
lt1: build swiftly SKIPPED
2025-Mar-18 10:24:46 :: [aarch64] #1200 python3-module-executing.git 2.2.0-=
alt1: build start
2025-Mar-18 10:24:46 :: [i586] #1700 python3-module-ipywidgets.git 8.1.5-al=
t1: build start
2025-Mar-18 10:24:46 :: [x86_64] #1500 python3-module-graphviz.git 0.20.3-a=
lt2: build start
2025-Mar-18 10:24:46 :: [aarch64] #1200 python3-module-executing.git 2.2.0-=
alt1: build swiftly SKIPPED
2025-Mar-18 10:24:46 :: [x86_64] #1500 python3-module-graphviz.git 0.20.3-a=
lt2: build swiftly SKIPPED
2025-Mar-18 10:24:47 :: [aarch64] #1500 python3-module-graphviz.git 0.20.3-=
alt2: build start
2025-Mar-18 10:24:47 :: [x86_64] #1600 python3-module-inline-snapshot.git 0=
=2E17.1-alt1: build start
2025-Mar-18 10:24:47 :: [aarch64] #1500 python3-module-graphviz.git 0.20.3-=
alt2: build swiftly SKIPPED
2025-Mar-18 10:24:47 :: [x86_64] #1600 python3-module-inline-snapshot.git 0=
=2E17.1-alt1: build swiftly SKIPPED
2025-Mar-18 10:24:47 :: [aarch64] #1600 python3-module-inline-snapshot.git =
0.17.1-alt1: build start
2025-Mar-18 10:24:47 :: [x86_64] #1700 python3-module-ipywidgets.git 8.1.5-=
alt1: build start
2025-Mar-18 10:24:47 :: [aarch64] #1600 python3-module-inline-snapshot.git =
0.17.1-alt1: build swiftly SKIPPED
2025-Mar-18 10:24:47 :: [aarch64] #1700 python3-module-ipywidgets.git 8.1.5=
-alt1: build start
2025-Mar-18 10:25:40 :: [x86_64] #1700 python3-module-ipywidgets.git 8.1.5-=
alt1: build OK
2025-Mar-18 10:25:41 :: [x86_64] #1740 python3-module-parso.git 0.8.4-alt1:=
 build start
2025-Mar-18 10:25:43 :: [i586] #1700 python3-module-ipywidgets.git 8.1.5-al=
t1: build OK
2025-Mar-18 10:25:43 :: [i586] #1740 python3-module-parso.git 0.8.4-alt1: b=
uild start
2025-Mar-18 10:26:12 :: [aarch64] #1700 python3-module-ipywidgets.git 8.1.5=
-alt1: build OK
2025-Mar-18 10:26:12 :: [x86_64] #1740 python3-module-parso.git 0.8.4-alt1:=
 build OK
2025-Mar-18 10:26:12 :: [aarch64] #1740 python3-module-parso.git 0.8.4-alt1=
: build start
2025-Mar-18 10:26:13 :: [x86_64] #2000 python3-module-jedi.git 0.19.2-alt1:=
 build start
2025-Mar-18 10:26:15 :: [i586] #1740 python3-module-parso.git 0.8.4-alt1: b=
uild OK
2025-Mar-18 10:26:16 :: [i586] #2000 python3-module-jedi.git 0.19.2-alt1: b=
uild start
2025-Mar-18 10:27:10 :: [aarch64] #1740 python3-module-parso.git 0.8.4-alt1=
: build OK
2025-Mar-18 10:27:10 :: [aarch64] #2000 python3-module-jedi.git 0.19.2-alt1=
: build start
2025-Mar-18 10:27:46 :: [x86_64] #2000 python3-module-jedi.git 0.19.2-alt1:=
 build OK
2025-Mar-18 10:27:46 :: [x86_64] #2040 python3-module-tornado.git 6.4.2-alt=
1: build start
2025-Mar-18 10:27:52 :: [i586] #2000 python3-module-jedi.git 0.19.2-alt1: b=
uild OK
2025-Mar-18 10:27:53 :: [i586] #2040 python3-module-tornado.git 6.4.2-alt1:=
 build start
2025-Mar-18 10:28:32 :: [x86_64] #2040 python3-module-tornado.git 6.4.2-alt=
1: build OK
2025-Mar-18 10:28:33 :: [x86_64] #2100 python3-module-jupyter_client.git 8.=
6.3-alt1: build start
2025-Mar-18 10:28:41 :: [i586] #2040 python3-module-tornado.git 6.4.2-alt1:=
 build OK
2025-Mar-18 10:28:41 :: [i586] #2100 python3-module-jupyter_client.git 8.6.=
3-alt1: build start
2025-Mar-18 10:30:05 :: [aarch64] #2000 python3-module-jedi.git 0.19.2-alt1=
: build OK
2025-Mar-18 10:30:05 :: [aarch64] #2040 python3-module-tornado.git 6.4.2-al=
t1: build start
2025-Mar-18 10:31:16 :: [aarch64] #2040 python3-module-tornado.git 6.4.2-al=
t1: build OK
2025-Mar-18 10:31:16 :: [aarch64] #2100 python3-module-jupyter_client.git 8=
=2E6.3-alt1: build start
2025-Mar-18 10:34:54 :: [x86_64] #2100 python3-module-jupyter_client.git 8.=
6.3-alt1: build OK
2025-Mar-18 10:34:55 :: [x86_64] #2200 python3-module-libcst.git 1.7.0-alt1=
: build start
2025-Mar-18 10:35:05 :: [i586] #2100 python3-module-jupyter_client.git 8.6.=
3-alt1: build OK
2025-Mar-18 10:35:05 :: [i586] #2200 python3-module-libcst.git 1.7.0-alt1: =
build start
2025-Mar-18 10:38:11 :: [aarch64] #2100 python3-module-jupyter_client.git 8=
=2E6.3-alt1: build OK
2025-Mar-18 10:38:11 :: [aarch64] #2200 python3-module-libcst.git 1.7.0-alt=
1: build start
2025-Mar-18 10:38:31 :: [x86_64] #2200 python3-module-libcst.git 1.7.0-alt1=
: build OK
2025-Mar-18 10:38:31 :: [x86_64] #2300 python3-module-logilab-common.git 2.=
0.0-alt3: build start
2025-Mar-18 10:38:58 :: [x86_64] #2300 python3-module-logilab-common.git 2.=
0.0-alt3: build OK
2025-Mar-18 10:38:58 :: [x86_64] #2400 python3-module-nibabel.git 5.2.1-alt=
2: build start
2025-Mar-18 10:39:20 :: [i586] #2200 python3-module-libcst.git 1.7.0-alt1: =
build OK
2025-Mar-18 10:39:20 :: [i586] #2300 python3-module-logilab-common.git 2.0.=
0-alt3: build start
2025-Mar-18 10:39:47 :: [i586] #2300 python3-module-logilab-common.git 2.0.=
0-alt3: build OK
2025-Mar-18 10:39:47 :: [i586] #2400 python3-module-nibabel.git 5.2.1-alt2:=
 build start
2025-Mar-18 10:41:02 :: [x86_64] #2400 python3-module-nibabel.git 5.2.1-alt=
2: build OK
2025-Mar-18 10:41:03 :: [x86_64] #2500 python3-module-pyamg.git 5.2.1-alt1:=
 build start
2025-Mar-18 10:42:06 :: [i586] #2400 python3-module-nibabel.git 5.2.1-alt2:=
 build OK
2025-Mar-18 10:42:06 :: [i586] #2500 python3-module-pyamg.git 5.2.1-alt1: b=
uild start
2025-Mar-18 10:42:42 :: [x86_64] #2500 python3-module-pyamg.git 5.2.1-alt1:=
 build OK
2025-Mar-18 10:42:42 :: [x86_64] #2600 python3-module-pytest-rerunfailures.=
git 15.0-alt1: build start
2025-Mar-18 10:43:12 :: [x86_64] #2600 python3-module-pytest-rerunfailures.=
git 15.0-alt1: build OK
2025-Mar-18 10:43:12 :: [x86_64] #2700 python3-module-stestr.git 4.1.0-alt3=
: build start
2025-Mar-18 10:43:49 :: [i586] #2500 python3-module-pyamg.git 5.2.1-alt1: b=
uild OK
2025-Mar-18 10:43:50 :: [i586] #2600 python3-module-pytest-rerunfailures.gi=
t 15.0-alt1: build start
2025-Mar-18 10:44:00 :: [x86_64] #2700 python3-module-stestr.git 4.1.0-alt3=
: build OK
2025-Mar-18 10:44:00 :: [x86_64] #3000 python3-module-terminado.git 0.18.1-=
alt1: build start
2025-Mar-18 10:44:20 :: [i586] #2600 python3-module-pytest-rerunfailures.gi=
t 15.0-alt1: build OK
2025-Mar-18 10:44:20 :: [i586] #2700 python3-module-stestr.git 4.1.0-alt3: =
build start
2025-Mar-18 10:44:55 :: [aarch64] #2200 python3-module-libcst.git 1.7.0-alt=
1: build OK
2025-Mar-18 10:44:56 :: [aarch64] #2300 python3-module-logilab-common.git 2=
=2E0.0-alt3: build start
2025-Mar-18 10:45:06 :: [x86_64] #3000 python3-module-terminado.git 0.18.1-=
alt1: build OK
2025-Mar-18 10:45:11 :: [i586] #2700 python3-module-stestr.git 4.1.0-alt3: =
build OK
2025-Mar-18 10:45:11 :: [i586] #3000 python3-module-terminado.git 0.18.1-al=
t1: build start
2025-Mar-18 10:45:39 :: [aarch64] #2300 python3-module-logilab-common.git 2=
=2E0.0-alt3: build OK
2025-Mar-18 10:45:39 :: [aarch64] #2400 python3-module-nibabel.git 5.2.1-al=
t2: build start
2025-Mar-18 10:46:17 :: [i586] #3000 python3-module-terminado.git 0.18.1-al=
t1: build OK
2025-Mar-18 10:49:52 :: [aarch64] #2400 python3-module-nibabel.git 5.2.1-al=
t2: build OK
2025-Mar-18 10:49:52 :: [aarch64] #2500 python3-module-pyamg.git 5.2.1-alt1=
: build start
2025-Mar-18 10:52:41 :: [aarch64] #2500 python3-module-pyamg.git 5.2.1-alt1=
: build OK
2025-Mar-18 10:52:41 :: [aarch64] #2600 python3-module-pytest-rerunfailures=
=2Egit 15.0-alt1: build start
2025-Mar-18 10:53:32 :: [aarch64] #2600 python3-module-pytest-rerunfailures=
=2Egit 15.0-alt1: build OK
2025-Mar-18 10:53:32 :: [aarch64] #2700 python3-module-stestr.git 4.1.0-alt=
3: build start
2025-Mar-18 10:54:56 :: [aarch64] #2700 python3-module-stestr.git 4.1.0-alt=
3: build OK
2025-Mar-18 10:54:56 :: [aarch64] #3000 python3-module-terminado.git 0.18.1=
-alt1: build start
[aarch64] tests/basic_test.py::UniqueTermTests::test_max_terminals =1B[32mP=
ASSED=1B[0m=1B[32m          [ 88%]=1B[0m
[aarch64] tests/basic_test.py::UniqueTermTests::test_unique_processes =1B[3=
1mFAILED=1B[0m=1B[31m       [100%]=1B[0m
[aarch64] =3D=3D=3D=3D=3D=3D=3D=3D=3D=3D=3D=3D=3D=3D=3D=3D=3D=3D=3D=3D=3D=
=3D=3D=3D=3D=3D=3D=3D=3D=3D=3D=3D=3D=3D=3D FAILURES =3D=3D=3D=3D=3D=3D=3D=
=3D=3D=3D=3D=3D=3D=3D=3D=3D=3D=3D=3D=3D=3D=3D=3D=3D=3D=3D=3D=3D=3D=3D=3D=3D=
=3D=3D=3D
[aarch64] --
[aarch64] =1B[1m=1B[31mE                       raise KeyError("{!r} is not =
registered".format(fileobj)) from None=1B[0m
[aarch64] =1B[1m=1B[31mE                   KeyError: '15 is not registered'=
=1B[0m
[aarch64] =1B[1m=1B[31mE                   =1B[0m
[aarch64] --
[aarch64] =1B[36m=1B[1m=3D=3D=3D=3D=3D=3D=3D=3D=3D=3D=3D=3D=3D=3D=3D=3D=3D=
=3D=3D=3D=3D=3D=3D=3D=3D=3D=3D short test summary info =3D=3D=3D=3D=3D=3D=
=3D=3D=3D=3D=3D=3D=3D=3D=3D=3D=3D=3D=3D=3D=3D=3D=3D=3D=3D=3D=3D=3D=1B[0m
[aarch64] =1B[31mFAILED=1B[0m tests/basic_test.py::=1B[1mUniqueTermTests::t=
est_unique_processes=1B[0m - pytest.PytestUnraisableExceptionWarning: Excep=
tion ignored in: <function We...
[aarch64] =1B[31m=3D=3D=3D=3D=3D=3D=3D=3D=3D=3D=3D=3D=3D=3D=3D=3D=3D=3D=3D=
=3D=3D=3D=3D=3D=3D =1B[31m=1B[1m1 failed=1B[0m, =1B[32m8 passed=1B[0m=1B[31=
m in 38.82s=1B[0m=1B[31m =3D=3D=3D=3D=3D=3D=3D=3D=3D=3D=3D=3D=3D=3D=3D=3D=
=3D=3D=3D=3D=3D=3D=3D=3D=3D=1B[0m
[aarch64] INFO     : Command's result: FAILURE
[aarch64] INFO     : Command's error: Command '['python3', '-m', 'pytest', =
'-vra']' returned non-zero exit status 1.
2025-Mar-18 10:56:19 :: [aarch64] python3-module-terminado.git 0.18.1-alt1:=
 remote: build failed
2025-Mar-18 10:56:19 :: [aarch64] #3000 python3-module-terminado.git 0.18.1=
-alt1: build FAILED
2025-Mar-18 10:56:20 :: [aarch64] requesting cancellation of task processing
2025-Mar-18 10:56:20 :: [aarch64] build FAILED
2025-Mar-18 10:56:20 :: task #377603 for p11 FAILED