ALT Linux Girar Builder robot reports
 help / color / mirror / Atom feed
* [#376366] [test-only] p10 FAILED python3-module-rpds-py.git=0.23.1-alt1
@ 2025-02-28 10:08 Girar awaiter (toni)
  0 siblings, 0 replies; only message in thread
From: Girar awaiter (toni) @ 2025-02-28 10:08 UTC (permalink / raw)
  To: Anton Vyatkin; +Cc: girar-builder-p10, sisyphus-incominger, girar-builder-p10

https://git.altlinux.org/tasks/376366/logs/events.1.1.log
https://packages.altlinux.org/tasks/376366

subtask  name                    aarch64    armh    i586  x86_64
   #100  python3-module-rpds-py   failed  failed  failed  failed

2025-Feb-28 10:07:05 :: test-only task #376366 for p10 started by toni:
#100 build 0.23.1-alt1 from /gears/p/python3-module-rpds-py.git fetched at 2025-Feb-28 10:06:57 from sisyphus
2025-Feb-28 10:07:07 :: [aarch64] #100 python3-module-rpds-py.git 0.23.1-alt1: build start
2025-Feb-28 10:07:07 :: [x86_64] #100 python3-module-rpds-py.git 0.23.1-alt1: build start
2025-Feb-28 10:07:07 :: [armh] #100 python3-module-rpds-py.git 0.23.1-alt1: build start
2025-Feb-28 10:07:07 :: [i586] #100 python3-module-rpds-py.git 0.23.1-alt1: build start
[x86_64]   Caused by: pyproject.toml is not PEP 517 compliant: invalid type: string "MIT", expected a table with 'file' or 'text' key
[x86_64] Error: command ['maturin', 'pep517', 'build-wheel', '-i', '/usr/bin/python3', '--compatibility', 'off'] returned non-zero exit status 1
[x86_64] Traceback (most recent call last):
[x86_64] --
[x86_64]     raise RuntimeError(err_msg) from None
[x86_64] RuntimeError: build_wheel failed
2025-Feb-28 10:07:35 :: [x86_64] python3-module-rpds-py.git 0.23.1-alt1: remote: build failed
2025-Feb-28 10:07:35 :: [x86_64] #100 python3-module-rpds-py.git 0.23.1-alt1: build FAILED
2025-Feb-28 10:07:35 :: [x86_64] requesting cancellation of task processing
[i586]   Caused by: pyproject.toml is not PEP 517 compliant: invalid type: string "MIT", expected a table with 'file' or 'text' key
[i586] Error: command ['maturin', 'pep517', 'build-wheel', '-i', '/usr/bin/python3', '--compatibility', 'off'] returned non-zero exit status 1
[i586] Traceback (most recent call last):
[i586] --
[i586]     raise RuntimeError(err_msg) from None
[i586] RuntimeError: build_wheel failed
2025-Feb-28 10:07:37 :: [i586] python3-module-rpds-py.git 0.23.1-alt1: remote: build failed
2025-Feb-28 10:07:37 :: [i586] #100 python3-module-rpds-py.git 0.23.1-alt1: build FAILED
[aarch64]   Caused by: pyproject.toml is not PEP 517 compliant: invalid type: string "MIT", expected a table with 'file' or 'text' key
[aarch64] Error: command ['maturin', 'pep517', 'build-wheel', '-i', '/usr/bin/python3', '--compatibility', 'off'] returned non-zero exit status 1
[aarch64] Traceback (most recent call last):
[aarch64] --
[aarch64]     raise RuntimeError(err_msg) from None
[aarch64] RuntimeError: build_wheel failed
2025-Feb-28 10:07:49 :: [aarch64] python3-module-rpds-py.git 0.23.1-alt1: remote: build failed
2025-Feb-28 10:07:49 :: [aarch64] #100 python3-module-rpds-py.git 0.23.1-alt1: build FAILED
[armh]   Caused by: pyproject.toml is not PEP 517 compliant: invalid type: string "MIT", expected a table with 'file' or 'text' key
[armh] Error: command ['maturin', 'pep517', 'build-wheel', '-i', '/usr/bin/python3', '--compatibility', 'off'] returned non-zero exit status 1
[armh] Traceback (most recent call last):
[armh] --
[armh]     raise RuntimeError(err_msg) from None
[armh] RuntimeError: build_wheel failed
2025-Feb-28 10:08:05 :: [armh] python3-module-rpds-py.git 0.23.1-alt1: remote: build failed
2025-Feb-28 10:08:05 :: [armh] #100 python3-module-rpds-py.git 0.23.1-alt1: build FAILED
2025-Feb-28 10:07:35 :: [x86_64] build FAILED
2025-Feb-28 10:07:37 :: [i586] build FAILED
2025-Feb-28 10:07:49 :: [aarch64] build FAILED
2025-Feb-28 10:08:05 :: [armh] build FAILED
2025-Feb-28 10:08:05 :: task #376366 for p10 FAILED


^ permalink raw reply	[flat|nested] only message in thread

only message in thread, other threads:[~2025-02-28 10:08 UTC | newest]

Thread overview: (only message) (download: mbox.gz / follow: Atom feed)
-- links below jump to the message on this page --
2025-02-28 10:08 [#376366] [test-only] p10 FAILED python3-module-rpds-py.git=0.23.1-alt1 Girar awaiter (toni)

ALT Linux Girar Builder robot reports

This inbox may be cloned and mirrored by anyone:

	git clone --mirror http://lore.altlinux.org/sisyphus-incominger/0 sisyphus-incominger/git/0.git

	# If you have public-inbox 1.1+ installed, you may
	# initialize and index your mirror using the following commands:
	public-inbox-init -V2 sisyphus-incominger sisyphus-incominger/ http://lore.altlinux.org/sisyphus-incominger \
		sisyphus-incominger@lists.altlinux.org sisyphus-incominger@lists.altlinux.ru sisyphus-incominger@lists.altlinux.com
	public-inbox-index sisyphus-incominger

Example config snippet for mirrors.
Newsgroup available over NNTP:
	nntp://lore.altlinux.org/org.altlinux.lists.sisyphus-incominger


AGPL code for this site: git clone https://public-inbox.org/public-inbox.git