* [#376330] [test-only] FAILED armorpaint.git=0.9.1-alt1
@ 2025-02-27 22:37 Girar awaiter (lav)
2025-02-27 22:53 ` [#376330] TESTED (try 2) armorpaint.git=0.9.1-alt1 Girar awaiter (lav)
2025-02-28 0:14 ` [#376330] DONE (try 3) armorpaint.git=0.9.1-alt1 Girar pender (lav)
0 siblings, 2 replies; 3+ messages in thread
From: Girar awaiter (lav) @ 2025-02-27 22:37 UTC (permalink / raw)
To: Vitaly Lipatov; +Cc: sisyphus-incominger, girar-builder-sisyphus
https://git.altlinux.org/tasks/376330/logs/events.1.1.log
https://packages.altlinux.org/tasks/376330
subtask name aarch64 i586 ppc64le x86_64
#100 armorpaint - - - failed
2025-Feb-27 22:36:49 :: test-only task #376330 for sisyphus started by lav:
#100 build 0.9.1-alt1 from /people/lav/packages/armorpaint.git fetched at 2025-Feb-27 22:36:47
2025-Feb-27 22:36:51 :: [x86_64] #100 armorpaint.git 0.9.1-alt1: build start
2025-Feb-27 22:36:51 :: [ppc64le] #100 armorpaint.git 0.9.1-alt1: build start
2025-Feb-27 22:36:51 :: [aarch64] #100 armorpaint.git 0.9.1-alt1: build start
2025-Feb-27 22:36:51 :: [i586] #100 armorpaint.git 0.9.1-alt1: build start
2025-Feb-27 22:37:01 :: [i586] #100 armorpaint.git 0.9.1-alt1: build SKIPPED
2025-Feb-27 22:37:09 :: [ppc64le] #100 armorpaint.git 0.9.1-alt1: build SKIPPED
2025-Feb-27 22:37:11 :: [aarch64] #100 armorpaint.git 0.9.1-alt1: build SKIPPED
[x86_64] + subst 's/-static-libgcc -static-libstdc++//' armorpaint/base/tools/make.js
[x86_64] subst: sed: couldn't readlink armorpaint/base/tools/make.js: No such file or directory
2025-Feb-27 22:37:43 :: [x86_64] armorpaint.git 0.9.1-alt1: remote: build failed
2025-Feb-27 22:37:43 :: [x86_64] #100 armorpaint.git 0.9.1-alt1: build FAILED
2025-Feb-27 22:37:43 :: [x86_64] requesting cancellation of task processing
2025-Feb-27 22:37:43 :: [x86_64] build FAILED
2025-Feb-27 22:37:43 :: task #376330 for sisyphus FAILED
^ permalink raw reply [flat|nested] 3+ messages in thread
* [#376330] TESTED (try 2) armorpaint.git=0.9.1-alt1
2025-02-27 22:37 [#376330] [test-only] FAILED armorpaint.git=0.9.1-alt1 Girar awaiter (lav)
@ 2025-02-27 22:53 ` Girar awaiter (lav)
2025-02-28 0:14 ` [#376330] DONE (try 3) armorpaint.git=0.9.1-alt1 Girar pender (lav)
1 sibling, 0 replies; 3+ messages in thread
From: Girar awaiter (lav) @ 2025-02-27 22:53 UTC (permalink / raw)
To: Vitaly Lipatov; +Cc: sisyphus-incominger, girar-builder-sisyphus
https://git.altlinux.org/tasks/376330/logs/events.2.1.log
https://packages.altlinux.org/tasks/376330
subtask name aarch64 i586 ppc64le x86_64
#40 armorpaint - - - 1:46
2025-Feb-27 22:47:30 :: test-only task #376330 for sisyphus resumed by lav:
#40 build 0.9.1-alt1 from /people/lav/packages/armorpaint.git fetched at 2025-Feb-27 22:47:27
#100 removed
2025-Feb-27 22:47:31 :: [aarch64] #40 armorpaint.git 0.9.1-alt1: build start
2025-Feb-27 22:47:31 :: [x86_64] #40 armorpaint.git 0.9.1-alt1: build start
2025-Feb-27 22:47:31 :: [ppc64le] #40 armorpaint.git 0.9.1-alt1: build start
2025-Feb-27 22:47:31 :: [i586] #40 armorpaint.git 0.9.1-alt1: build start
2025-Feb-27 22:47:41 :: [i586] #40 armorpaint.git 0.9.1-alt1: build SKIPPED
2025-Feb-27 22:47:49 :: [ppc64le] #40 armorpaint.git 0.9.1-alt1: build SKIPPED
2025-Feb-27 22:47:52 :: [aarch64] #40 armorpaint.git 0.9.1-alt1: build SKIPPED
2025-Feb-27 22:49:17 :: [x86_64] #40 armorpaint.git 0.9.1-alt1: build OK
x86_64/srpm/armorpaint-0.9.1-alt1.src.rpm: license not found in '/usr/share/license' directory: zlib
x86_64/rpms/armorpaint-debuginfo-0.9.1-alt1.x86_64.rpm: license not found in '/usr/share/license' directory: zlib
x86_64/rpms/armorpaint-0.9.1-alt1.x86_64.rpm: license not found in '/usr/share/license' directory: zlib
2025-Feb-27 22:49:24 :: #40: armorpaint.git 0.9.1-alt1: build check OK
2025-Feb-27 22:49:26 :: build check OK
2025-Feb-27 22:49:26 :: noarch check OK
2025-Feb-27 22:49:28 :: plan: src +1 -0 =19877, x86_64 +2 -0 =35331
2025-Feb-27 22:50:07 :: patched apt indices
2025-Feb-27 22:50:19 :: created next repo
2025-Feb-27 22:50:30 :: duplicate provides check OK
2025-Feb-27 22:51:09 :: dependencies check OK
2025-Feb-27 22:51:40 :: [x86_64] ELF symbols check OK
2025-Feb-27 22:51:59 :: [x86_64] #40 armorpaint: install check OK
2025-Feb-27 22:52:17 :: [x86_64] #40 armorpaint-debuginfo: install check OK
2025-Feb-27 22:52:37 :: [x86_64-i586] generated apt indices
2025-Feb-27 22:52:37 :: [x86_64-i586] created next repo
2025-Feb-27 22:52:51 :: [x86_64-i586] dependencies check OK
2025-Feb-27 22:52:52 :: gears inheritance check OK
2025-Feb-27 22:52:52 :: srpm inheritance check OK
girar-check-perms: access to armorpaint ALLOWED for lav: project `armorpaint' is not listed in the acl file for repository `sisyphus', and the policy for such projects in `sisyphus' is to allow
check-subtask-perms: #40: armorpaint: allowed for lav
2025-Feb-27 22:52:52 :: acl check OK
2025-Feb-27 22:53:04 :: created contents_index files
2025-Feb-27 22:53:13 :: created hash files: src x86_64
2025-Feb-27 22:53:15 :: task #376330 for sisyphus TESTED
^ permalink raw reply [flat|nested] 3+ messages in thread
* [#376330] DONE (try 3) armorpaint.git=0.9.1-alt1
2025-02-27 22:37 [#376330] [test-only] FAILED armorpaint.git=0.9.1-alt1 Girar awaiter (lav)
2025-02-27 22:53 ` [#376330] TESTED (try 2) armorpaint.git=0.9.1-alt1 Girar awaiter (lav)
@ 2025-02-28 0:14 ` Girar pender (lav)
1 sibling, 0 replies; 3+ messages in thread
From: Girar pender (lav) @ 2025-02-28 0:14 UTC (permalink / raw)
To: Vitaly Lipatov; +Cc: sisyphus-incominger, girar-builder-sisyphus
https://git.altlinux.org/tasks/archive/done/_367/376330/logs/events.3.2.log
https://packages.altlinux.org/tasks/376330
2025-Feb-28 00:09:16 :: task #376330 for sisyphus resumed by lav:
#40 build 0.9.1-alt1 from /people/lav/packages/armorpaint.git fetched at 2025-Feb-27 22:47:27
#100 removed
2025-Feb-28 00:09:18 :: [aarch64] #40 armorpaint.git 0.9.1-alt1: build start
2025-Feb-28 00:09:18 :: [ppc64le] #40 armorpaint.git 0.9.1-alt1: build start
2025-Feb-28 00:09:18 :: [x86_64] #40 armorpaint.git 0.9.1-alt1: build start
2025-Feb-28 00:09:18 :: [i586] #40 armorpaint.git 0.9.1-alt1: build start
2025-Feb-28 00:09:32 :: [i586] #40 armorpaint.git 0.9.1-alt1: build SKIPPED
2025-Feb-28 00:09:32 :: [x86_64] #40 armorpaint.git 0.9.1-alt1: build OK (cached)
2025-Feb-28 00:09:36 :: [aarch64] #40 armorpaint.git 0.9.1-alt1: build SKIPPED
2025-Feb-28 00:09:39 :: [ppc64le] #40 armorpaint.git 0.9.1-alt1: build SKIPPED
x86_64/srpm/armorpaint-0.9.1-alt1.src.rpm: license not found in '/usr/share/license' directory: zlib
x86_64/rpms/armorpaint-debuginfo-0.9.1-alt1.x86_64.rpm: license not found in '/usr/share/license' directory: zlib
x86_64/rpms/armorpaint-0.9.1-alt1.x86_64.rpm: license not found in '/usr/share/license' directory: zlib
2025-Feb-28 00:09:46 :: #40: armorpaint.git 0.9.1-alt1: build check OK
2025-Feb-28 00:09:47 :: build check OK
2025-Feb-28 00:09:48 :: noarch check OK
2025-Feb-28 00:09:50 :: plan: src +1 -0 =19877, x86_64 +2 -0 =35331
2025-Feb-28 00:10:47 :: patched apt indices
2025-Feb-28 00:11:01 :: created next repo
2025-Feb-28 00:11:13 :: duplicate provides check OK
2025-Feb-28 00:12:05 :: dependencies check OK
2025-Feb-28 00:12:42 :: [x86_64] ELF symbols check OK
2025-Feb-28 00:12:54 :: [x86_64] #40 armorpaint: install check OK (cached)
2025-Feb-28 00:12:59 :: [x86_64] #40 armorpaint-debuginfo: install check OK (cached)
2025-Feb-28 00:13:18 :: [x86_64-i586] generated apt indices
2025-Feb-28 00:13:18 :: [x86_64-i586] created next repo
2025-Feb-28 00:13:31 :: [x86_64-i586] dependencies check OK
2025-Feb-28 00:13:32 :: gears inheritance check OK
2025-Feb-28 00:13:32 :: srpm inheritance check OK
girar-check-perms: access to armorpaint ALLOWED for lav: project `armorpaint' is not listed in the acl file for repository `sisyphus', and the policy for such projects in `sisyphus' is to allow
check-subtask-perms: #40: armorpaint: allowed for lav
2025-Feb-28 00:13:32 :: acl check OK
2025-Feb-28 00:13:49 :: created contents_index files
2025-Feb-28 00:14:00 :: created hash files: src x86_64
2025-Feb-28 00:14:03 :: task #376330 for sisyphus TESTED
2025-Feb-28 00:14:04 :: task is ready for commit
2025-Feb-28 00:14:11 :: repo clone OK
2025-Feb-28 00:14:11 :: packages update OK
2025-Feb-28 00:14:14 :: [x86_64] update OK
2025-Feb-28 00:14:14 :: repo update OK
2025-Feb-28 00:14:26 :: repo save OK
2025-Feb-28 00:14:26 :: src index update OK
2025-Feb-28 00:14:29 :: created /gears/a/armorpaint.git branch `sisyphus'
2025-Feb-28 00:14:35 :: gears update OK
2025-Feb-28 00:14:36 :: ACL for new project `armorpaint' assigned to user `lav'
2025-Feb-28 00:14:36 :: task #376330 for sisyphus DONE
^ permalink raw reply [flat|nested] 3+ messages in thread
end of thread, other threads:[~2025-02-28 0:14 UTC | newest]
Thread overview: 3+ messages (download: mbox.gz / follow: Atom feed)
-- links below jump to the message on this page --
2025-02-27 22:37 [#376330] [test-only] FAILED armorpaint.git=0.9.1-alt1 Girar awaiter (lav)
2025-02-27 22:53 ` [#376330] TESTED (try 2) armorpaint.git=0.9.1-alt1 Girar awaiter (lav)
2025-02-28 0:14 ` [#376330] DONE (try 3) armorpaint.git=0.9.1-alt1 Girar pender (lav)
ALT Linux Girar Builder robot reports
This inbox may be cloned and mirrored by anyone:
git clone --mirror http://lore.altlinux.org/sisyphus-incominger/0 sisyphus-incominger/git/0.git
# If you have public-inbox 1.1+ installed, you may
# initialize and index your mirror using the following commands:
public-inbox-init -V2 sisyphus-incominger sisyphus-incominger/ http://lore.altlinux.org/sisyphus-incominger \
sisyphus-incominger@lists.altlinux.org sisyphus-incominger@lists.altlinux.ru sisyphus-incominger@lists.altlinux.com
public-inbox-index sisyphus-incominger
Example config snippet for mirrors.
Newsgroup available over NNTP:
nntp://lore.altlinux.org/org.altlinux.lists.sisyphus-incominger
AGPL code for this site: git clone https://public-inbox.org/public-inbox.git