* [#376312] [test-only] p11 FAILED rustdesk.git=1.3.8-alt1
@ 2025-02-27 15:37 Girar awaiter (srebrov)
2025-03-29 16:32 ` [#376312] [test-only] p11 FAILED (try 2) vcpkg.git=2025.02.11-alt1 rustdesk.git=1.3.8-alt1 Girar awaiter (srebrov)
` (3 more replies)
0 siblings, 4 replies; 5+ messages in thread
From: Girar awaiter (srebrov) @ 2025-02-27 15:37 UTC (permalink / raw)
To: Anton Kurachenko
Cc: sisyphus-incominger, girar-builder-p11, girar-builder-p11
https://git.altlinux.org/tasks/376312/logs/events.1.1.log
https://packages.altlinux.org/tasks/376312
subtask name aarch64 i586 x86_64
#100 rustdesk failed - failed
2025-Feb-27 15:33:45 :: test-only task #376312 for p11 started by srebrov:
#100 build 1.3.8-alt1 from /people/srebrov/packages/rustdesk.git fetched at 2025-Feb-27 15:33:28
2025-Feb-27 15:33:47 :: [i586] #100 rustdesk.git 1.3.8-alt1: build start
2025-Feb-27 15:33:47 :: [x86_64] #100 rustdesk.git 1.3.8-alt1: build start
2025-Feb-27 15:33:47 :: [aarch64] #100 rustdesk.git 1.3.8-alt1: build start
2025-Feb-27 15:33:59 :: [i586] #100 rustdesk.git 1.3.8-alt1: build SKIPPED
[x86_64] Computing installation plan...
[x86_64] read_contents("/usr/src/vcpkg-env/scripts/vcpkgTools.xml"): No such file or directory
2025-Feb-27 15:35:10 :: [x86_64] rustdesk.git 1.3.8-alt1: remote: build failed
2025-Feb-27 15:35:10 :: [x86_64] #100 rustdesk.git 1.3.8-alt1: build FAILED
2025-Feb-27 15:35:10 :: [x86_64] requesting cancellation of task processing
[aarch64] Computing installation plan...
[aarch64] read_contents("/usr/src/vcpkg-env/scripts/vcpkgTools.xml"): No such file or directory
2025-Feb-27 15:37:17 :: [aarch64] rustdesk.git 1.3.8-alt1: remote: build failed
2025-Feb-27 15:37:18 :: [aarch64] #100 rustdesk.git 1.3.8-alt1: build FAILED
2025-Feb-27 15:35:10 :: [x86_64] build FAILED
2025-Feb-27 15:37:18 :: [aarch64] build FAILED
2025-Feb-27 15:37:18 :: task #376312 for p11 FAILED
^ permalink raw reply [flat|nested] 5+ messages in thread
* [#376312] [test-only] p11 FAILED (try 2) vcpkg.git=2025.02.11-alt1 rustdesk.git=1.3.8-alt1
2025-02-27 15:37 [#376312] [test-only] p11 FAILED rustdesk.git=1.3.8-alt1 Girar awaiter (srebrov)
@ 2025-03-29 16:32 ` Girar awaiter (srebrov)
2025-04-02 20:12 ` [#376312] [test-only] p11 FAILED (try 3) rustdesk.git=1.3.9-alt0.p11.1 Girar awaiter (srebrov)
` (2 subsequent siblings)
3 siblings, 0 replies; 5+ messages in thread
From: Girar awaiter (srebrov) @ 2025-03-29 16:32 UTC (permalink / raw)
To: Anton Kurachenko
Cc: sisyphus-incominger, girar-builder-p11, girar-builder-p11
https://git.altlinux.org/tasks/376312/logs/events.2.1.log
https://packages.altlinux.org/tasks/376312
subtask name aarch64 i586 x86_64
#200 vcpkg failed failed failed
2025-Mar-29 16:31:55 :: test-only task #376312 for p11 resumed by srebrov:
#100 removed
#200 build 2025.02.11-alt1 from /gears/v/vcpkg.git fetched at 2025-Mar-29 16:28:46 from sisyphus
#300 build 1.3.8-alt1 from /people/srebrov/packages/rustdesk.git fetched at 2025-Mar-29 16:31:28
2025-Mar-29 16:31:55 :: created build repo
2025-Mar-29 16:31:56 :: [x86_64] #200 vcpkg.git 2025.02.11-alt1: build start
2025-Mar-29 16:31:56 :: [aarch64] #200 vcpkg.git 2025.02.11-alt1: build start
2025-Mar-29 16:31:56 :: [i586] #200 vcpkg.git 2025.02.11-alt1: build start
[x86_64] 33 | VCPKG_FORMAT_WITH_TO_STRING(vcpkg::BundleSettings);
[x86_64] /usr/src/RPM/BUILD/vcpkg-2025.02.11/include/vcpkg/base/fwd/fmt.h:28:45: error: qualified name does not name a class before ':' token
[x86_64] 28 | struct fmt::formatter<Type, Char, void> : fmt::formatter<std::string, Char, void> \
[x86_64] --
[x86_64] 33 | VCPKG_FORMAT_WITH_TO_STRING(vcpkg::BundleSettings);
[x86_64] /usr/src/RPM/BUILD/vcpkg-2025.02.11/include/vcpkg/base/fwd/fmt.h:28:45: error: expected '{' before ':' token
[x86_64] 28 | struct fmt::formatter<Type, Char, void> : fmt::formatter<std::string, Char, void> \
[x86_64] --
[x86_64] 33 | VCPKG_FORMAT_WITH_TO_STRING(vcpkg::BundleSettings);
[x86_64] /usr/src/RPM/BUILD/vcpkg-2025.02.11/include/vcpkg/base/fwd/fmt.h:17:17: error: 'formatter' is not a class template
[x86_64] 17 | struct fmt::formatter<Type, Char, void> : fmt::formatter<Base, Char, void> \
[x86_64] --
[x86_64] 47 | VCPKG_FORMAT_AS(vcpkg::Triplet, vcpkg::StringView);
[x86_64] /usr/src/RPM/BUILD/vcpkg-2025.02.11/include/vcpkg/base/fwd/fmt.h:17:45: error: qualified name does not name a class before ':' token
[x86_64] 17 | struct fmt::formatter<Type, Char, void> : fmt::formatter<Base, Char, void> \
[x86_64] --
[x86_64] 47 | VCPKG_FORMAT_AS(vcpkg::Triplet, vcpkg::StringView);
[x86_64] /usr/src/RPM/BUILD/vcpkg-2025.02.11/include/vcpkg/base/fwd/fmt.h:17:45: error: expected '{' before ':' token
[x86_64] 17 | struct fmt::formatter<Type, Char, void> : fmt::formatter<Base, Char, void> \
[x86_64] --
[x86_64] 47 | VCPKG_FORMAT_AS(vcpkg::Triplet, vcpkg::StringView);
[x86_64] /usr/src/RPM/BUILD/vcpkg-2025.02.11/include/vcpkg/base/fwd/fmt.h:28:17: error: 'formatter' is not a class template
[x86_64] 28 | struct fmt::formatter<Type, Char, void> : fmt::formatter<std::string, Char, void> \
[x86_64] --
[x86_64] 187 | VCPKG_FORMAT_WITH_TO_STRING(vcpkg::PackageSpec);
[x86_64] /usr/src/RPM/BUILD/vcpkg-2025.02.11/include/vcpkg/base/fwd/fmt.h:28:45: error: qualified name does not name a class before ':' token
[x86_64] 28 | struct fmt::formatter<Type, Char, void> : fmt::formatter<std::string, Char, void> \
[x86_64] --
[x86_64] 187 | VCPKG_FORMAT_WITH_TO_STRING(vcpkg::PackageSpec);
[x86_64] /usr/src/RPM/BUILD/vcpkg-2025.02.11/include/vcpkg/base/fwd/fmt.h:28:45: error: expected '{' before ':' token
[x86_64] 28 | struct fmt::formatter<Type, Char, void> : fmt::formatter<std::string, Char, void> \
[x86_64] --
[x86_64] 187 | VCPKG_FORMAT_WITH_TO_STRING(vcpkg::PackageSpec);
[x86_64] /usr/src/RPM/BUILD/vcpkg-2025.02.11/include/vcpkg/base/fwd/fmt.h:28:17: error: 'formatter' is not a class template
[x86_64] 28 | struct fmt::formatter<Type, Char, void> : fmt::formatter<std::string, Char, void> \
[x86_64] --
[x86_64] 188 | VCPKG_FORMAT_WITH_TO_STRING(vcpkg::FeatureSpec);
[x86_64] /usr/src/RPM/BUILD/vcpkg-2025.02.11/include/vcpkg/base/fwd/fmt.h:28:45: error: qualified name does not name a class before ':' token
[x86_64] 28 | struct fmt::formatter<Type, Char, void> : fmt::formatter<std::string, Char, void> \
2025-Mar-29 16:32:27 :: [x86_64] vcpkg.git 2025.02.11-alt1: remote: build failed
2025-Mar-29 16:32:27 :: [x86_64] #200 vcpkg.git 2025.02.11-alt1: build FAILED
2025-Mar-29 16:32:27 :: [x86_64] requesting cancellation of task processing
[i586] 33 | VCPKG_FORMAT_WITH_TO_STRING(vcpkg::BundleSettings);
[i586] /usr/src/RPM/BUILD/vcpkg-2025.02.11/include/vcpkg/base/fwd/fmt.h:28:45: error: qualified name does not name a class before ':' token
[i586] 28 | struct fmt::formatter<Type, Char, void> : fmt::formatter<std::string, Char, void> \
[i586] --
[i586] 33 | VCPKG_FORMAT_WITH_TO_STRING(vcpkg::BundleSettings);
[i586] /usr/src/RPM/BUILD/vcpkg-2025.02.11/include/vcpkg/base/fwd/fmt.h:28:45: error: expected '{' before ':' token
[i586] 28 | struct fmt::formatter<Type, Char, void> : fmt::formatter<std::string, Char, void> \
[i586] --
[i586] 33 | VCPKG_FORMAT_WITH_TO_STRING(vcpkg::BundleSettings);
[i586] /usr/src/RPM/BUILD/vcpkg-2025.02.11/include/vcpkg/base/fwd/fmt.h:17:17: error: 'formatter' is not a class template
[i586] 17 | struct fmt::formatter<Type, Char, void> : fmt::formatter<Base, Char, void> \
[i586] --
[i586] 47 | VCPKG_FORMAT_AS(vcpkg::Triplet, vcpkg::StringView);
[i586] /usr/src/RPM/BUILD/vcpkg-2025.02.11/include/vcpkg/base/fwd/fmt.h:17:45: error: qualified name does not name a class before ':' token
[i586] 17 | struct fmt::formatter<Type, Char, void> : fmt::formatter<Base, Char, void> \
[i586] --
[i586] 47 | VCPKG_FORMAT_AS(vcpkg::Triplet, vcpkg::StringView);
[i586] /usr/src/RPM/BUILD/vcpkg-2025.02.11/include/vcpkg/base/fwd/fmt.h:17:45: error: expected '{' before ':' token
[i586] 17 | struct fmt::formatter<Type, Char, void> : fmt::formatter<Base, Char, void> \
[i586] --
[i586] 47 | VCPKG_FORMAT_AS(vcpkg::Triplet, vcpkg::StringView);
[i586] /usr/src/RPM/BUILD/vcpkg-2025.02.11/include/vcpkg/base/fwd/fmt.h:28:17: error: 'formatter' is not a class template
[i586] 28 | struct fmt::formatter<Type, Char, void> : fmt::formatter<std::string, Char, void> \
[i586] --
[i586] 187 | VCPKG_FORMAT_WITH_TO_STRING(vcpkg::PackageSpec);
[i586] /usr/src/RPM/BUILD/vcpkg-2025.02.11/include/vcpkg/base/fwd/fmt.h:28:45: error: qualified name does not name a class before ':' token
[i586] 28 | struct fmt::formatter<Type, Char, void> : fmt::formatter<std::string, Char, void> \
[i586] --
[i586] 187 | VCPKG_FORMAT_WITH_TO_STRING(vcpkg::PackageSpec);
[i586] /usr/src/RPM/BUILD/vcpkg-2025.02.11/include/vcpkg/base/fwd/fmt.h:28:45: error: expected '{' before ':' token
[i586] 28 | struct fmt::formatter<Type, Char, void> : fmt::formatter<std::string, Char, void> \
[i586] --
[i586] 187 | VCPKG_FORMAT_WITH_TO_STRING(vcpkg::PackageSpec);
[i586] /usr/src/RPM/BUILD/vcpkg-2025.02.11/include/vcpkg/base/fwd/fmt.h:28:17: error: 'formatter' is not a class template
[i586] 28 | struct fmt::formatter<Type, Char, void> : fmt::formatter<std::string, Char, void> \
[i586] --
[i586] 188 | VCPKG_FORMAT_WITH_TO_STRING(vcpkg::FeatureSpec);
[i586] /usr/src/RPM/BUILD/vcpkg-2025.02.11/include/vcpkg/base/fwd/fmt.h:28:45: error: qualified name does not name a class before ':' token
[i586] 28 | struct fmt::formatter<Type, Char, void> : fmt::formatter<std::string, Char, void> \
2025-Mar-29 16:32:28 :: [i586] vcpkg.git 2025.02.11-alt1: remote: build failed
2025-Mar-29 16:32:28 :: [i586] #200 vcpkg.git 2025.02.11-alt1: build FAILED
[aarch64] 33 | VCPKG_FORMAT_WITH_TO_STRING(vcpkg::BundleSettings);
[aarch64] /usr/src/RPM/BUILD/vcpkg-2025.02.11/include/vcpkg/base/fwd/fmt.h:28:45: error: qualified name does not name a class before ':' token
[aarch64] 28 | struct fmt::formatter<Type, Char, void> : fmt::formatter<std::string, Char, void> \
[aarch64] --
[aarch64] 33 | VCPKG_FORMAT_WITH_TO_STRING(vcpkg::BundleSettings);
[aarch64] /usr/src/RPM/BUILD/vcpkg-2025.02.11/include/vcpkg/base/fwd/fmt.h:28:45: error: expected '{' before ':' token
[aarch64] 28 | struct fmt::formatter<Type, Char, void> : fmt::formatter<std::string, Char, void> \
[aarch64] --
[aarch64] 33 | VCPKG_FORMAT_WITH_TO_STRING(vcpkg::BundleSettings);
[aarch64] /usr/src/RPM/BUILD/vcpkg-2025.02.11/include/vcpkg/base/fwd/fmt.h:17:17: error: 'formatter' is not a class template
[aarch64] 17 | struct fmt::formatter<Type, Char, void> : fmt::formatter<Base, Char, void> \
[aarch64] --
[aarch64] 47 | VCPKG_FORMAT_AS(vcpkg::Triplet, vcpkg::StringView);
[aarch64] /usr/src/RPM/BUILD/vcpkg-2025.02.11/include/vcpkg/base/fwd/fmt.h:17:45: error: qualified name does not name a class before ':' token
[aarch64] 17 | struct fmt::formatter<Type, Char, void> : fmt::formatter<Base, Char, void> \
[aarch64] --
[aarch64] 47 | VCPKG_FORMAT_AS(vcpkg::Triplet, vcpkg::StringView);
[aarch64] /usr/src/RPM/BUILD/vcpkg-2025.02.11/include/vcpkg/base/fwd/fmt.h:17:45: error: expected '{' before ':' token
[aarch64] 17 | struct fmt::formatter<Type, Char, void> : fmt::formatter<Base, Char, void> \
[aarch64] --
[aarch64] 47 | VCPKG_FORMAT_AS(vcpkg::Triplet, vcpkg::StringView);
[aarch64] /usr/src/RPM/BUILD/vcpkg-2025.02.11/include/vcpkg/base/fwd/fmt.h:28:17: error: 'formatter' is not a class template
[aarch64] 28 | struct fmt::formatter<Type, Char, void> : fmt::formatter<std::string, Char, void> \
[aarch64] --
[aarch64] 187 | VCPKG_FORMAT_WITH_TO_STRING(vcpkg::PackageSpec);
[aarch64] /usr/src/RPM/BUILD/vcpkg-2025.02.11/include/vcpkg/base/fwd/fmt.h:28:45: error: qualified name does not name a class before ':' token
[aarch64] 28 | struct fmt::formatter<Type, Char, void> : fmt::formatter<std::string, Char, void> \
[aarch64] --
[aarch64] 187 | VCPKG_FORMAT_WITH_TO_STRING(vcpkg::PackageSpec);
[aarch64] /usr/src/RPM/BUILD/vcpkg-2025.02.11/include/vcpkg/base/fwd/fmt.h:28:45: error: expected '{' before ':' token
[aarch64] 28 | struct fmt::formatter<Type, Char, void> : fmt::formatter<std::string, Char, void> \
[aarch64] --
[aarch64] 187 | VCPKG_FORMAT_WITH_TO_STRING(vcpkg::PackageSpec);
[aarch64] /usr/src/RPM/BUILD/vcpkg-2025.02.11/include/vcpkg/base/fwd/fmt.h:28:17: error: 'formatter' is not a class template
[aarch64] 28 | struct fmt::formatter<Type, Char, void> : fmt::formatter<std::string, Char, void> \
[aarch64] --
[aarch64] 188 | VCPKG_FORMAT_WITH_TO_STRING(vcpkg::FeatureSpec);
[aarch64] /usr/src/RPM/BUILD/vcpkg-2025.02.11/include/vcpkg/base/fwd/fmt.h:28:45: error: qualified name does not name a class before ':' token
[aarch64] 28 | struct fmt::formatter<Type, Char, void> : fmt::formatter<std::string, Char, void> \
2025-Mar-29 16:32:53 :: [aarch64] vcpkg.git 2025.02.11-alt1: remote: build failed
2025-Mar-29 16:32:53 :: [aarch64] #200 vcpkg.git 2025.02.11-alt1: build FAILED
2025-Mar-29 16:32:27 :: [x86_64] build FAILED
2025-Mar-29 16:32:28 :: [i586] build FAILED
2025-Mar-29 16:32:53 :: [aarch64] build FAILED
2025-Mar-29 16:32:53 :: task #376312 for p11 FAILED
^ permalink raw reply [flat|nested] 5+ messages in thread
* [#376312] [test-only] p11 FAILED (try 3) rustdesk.git=1.3.9-alt0.p11.1
2025-02-27 15:37 [#376312] [test-only] p11 FAILED rustdesk.git=1.3.8-alt1 Girar awaiter (srebrov)
2025-03-29 16:32 ` [#376312] [test-only] p11 FAILED (try 2) vcpkg.git=2025.02.11-alt1 rustdesk.git=1.3.8-alt1 Girar awaiter (srebrov)
@ 2025-04-02 20:12 ` Girar awaiter (srebrov)
2025-04-04 13:04 ` [#376312] p11 TESTED (try 4) rustdesk.git=1.3.9-alt0.p11.1 Girar awaiter (srebrov)
2025-04-04 13:13 ` [#376312] p11 EPERM (try 5) rustdesk.git=1.3.9-alt0.p11.1 Girar awaiter (srebrov)
3 siblings, 0 replies; 5+ messages in thread
From: Girar awaiter (srebrov) @ 2025-04-02 20:12 UTC (permalink / raw)
To: Anton Kurachenko
Cc: sisyphus-incominger, girar-builder-p11, girar-builder-p11
https://git.altlinux.org/tasks/376312/logs/events.3.1.log
https://packages.altlinux.org/tasks/376312
subtask name aarch64 i586 x86_64
#400 rustdesk 19:18 - 10:46
2025-Apr-02 19:48:37 :: test-only task #376312 for p11 resumed by srebrov:
#100 removed
#200 removed
#300 removed
#400 build 1.3.9-alt0.p11.1 from /people/srebrov/packages/rustdesk.git fetched at 2025-Apr-02 19:48:12
2025-Apr-02 19:48:39 :: [x86_64] #400 rustdesk.git 1.3.9-alt0.p11.1: build start
2025-Apr-02 19:48:39 :: [i586] #400 rustdesk.git 1.3.9-alt0.p11.1: build start
2025-Apr-02 19:48:39 :: [aarch64] #400 rustdesk.git 1.3.9-alt0.p11.1: build start
2025-Apr-02 19:48:52 :: [i586] #400 rustdesk.git 1.3.9-alt0.p11.1: build SKIPPED
2025-Apr-02 19:59:25 :: [x86_64] #400 rustdesk.git 1.3.9-alt0.p11.1: build OK
2025-Apr-02 20:07:57 :: [aarch64] #400 rustdesk.git 1.3.9-alt0.p11.1: build OK
2025-Apr-02 20:08:07 :: #400: rustdesk.git 1.3.9-alt0.p11.1: build check OK
2025-Apr-02 20:08:08 :: build check OK
2025-Apr-02 20:08:11 :: noarch check OK
2025-Apr-02 20:08:12 :: plan: src +1 -1 =19603, aarch64 +2 -2 =34012, x86_64 +2 -2 =34778
#400 rustdesk 1.3.7-alt1 -> 1.3.9-alt0.p11.1
Wed Apr 02 2025 Anton Kurachenko <srebrov@altlinux> 1.3.9-alt0.p11.1
- Backport new version to p11 branch.
Wed Apr 02 2025 Anton Kurachenko <srebrov@altlinux> 1.3.9-alt1
- New version 1.3.9.
Sun Feb 23 2025 Anton Kurachenko <srebrov@altlinux> 1.3.8-alt1
- New version 1.3.8.
- Disabled notification of the availability updates.
- Enabled unix-file-copy-paste feature.
Tue Feb 11 2025 Anton Kurachenko <srebrov@altlinux> 1.3.7-alt3
- Added info about the option to use epm play to install libsciter-gtk.
[...]
2025-Apr-02 20:08:57 :: patched apt indices
2025-Apr-02 20:09:08 :: created next repo
2025-Apr-02 20:09:19 :: duplicate provides check OK
2025-Apr-02 20:09:59 :: dependencies check OK
2025-Apr-02 20:10:34 :: [x86_64 aarch64] ELF symbols check OK
2025-Apr-02 20:11:04 :: [x86_64] #400 rustdesk: install check OK
2025-Apr-02 20:11:19 :: [aarch64] #400 rustdesk: install check OK
2025-Apr-02 20:11:35 :: [x86_64] #400 rustdesk-debuginfo: install check OK
2025-Apr-02 20:12:07 :: [aarch64] #400 rustdesk-debuginfo: install check OK
2025-Apr-02 20:12:25 :: [x86_64-i586] generated apt indices
2025-Apr-02 20:12:25 :: [x86_64-i586] created next repo
2025-Apr-02 20:12:36 :: [x86_64-i586] dependencies check OK
2025-Apr-02 20:12:37 :: gears inheritance check OK
2025-Apr-02 20:12:37 :: srpm inheritance check OK
2025-Apr-02 20:12:38 :: #400: src package `rustdesk' version `1.3.9-alt0.p11.1' is greater than its version `1.3.8-alt1' in `sisyphus'
2025-Apr-02 20:12:38 :: neighbour version check FAILED
2025-Apr-02 20:12:38 :: task #376312 for p11 FAILED
^ permalink raw reply [flat|nested] 5+ messages in thread
* [#376312] p11 TESTED (try 4) rustdesk.git=1.3.9-alt0.p11.1
2025-02-27 15:37 [#376312] [test-only] p11 FAILED rustdesk.git=1.3.8-alt1 Girar awaiter (srebrov)
2025-03-29 16:32 ` [#376312] [test-only] p11 FAILED (try 2) vcpkg.git=2025.02.11-alt1 rustdesk.git=1.3.8-alt1 Girar awaiter (srebrov)
2025-04-02 20:12 ` [#376312] [test-only] p11 FAILED (try 3) rustdesk.git=1.3.9-alt0.p11.1 Girar awaiter (srebrov)
@ 2025-04-04 13:04 ` Girar awaiter (srebrov)
2025-04-04 13:13 ` [#376312] p11 EPERM (try 5) rustdesk.git=1.3.9-alt0.p11.1 Girar awaiter (srebrov)
3 siblings, 0 replies; 5+ messages in thread
From: Girar awaiter (srebrov) @ 2025-04-04 13:04 UTC (permalink / raw)
To: Anton Kurachenko
Cc: sisyphus-incominger, girar-builder-p11, girar-builder-p11
https://git.altlinux.org/tasks/376312/logs/events.4.1.log
https://packages.altlinux.org/tasks/376312
subtask name aarch64 i586 x86_64
#500 rustdesk 21:55 - 10:53
2025-Apr-04 12:37:33 :: test-only task #376312 for p11 resumed by srebrov:
#100 removed
#200 removed
#300 removed
#400 removed
#500 build 1.3.9-alt0.p11.1 from /people/srebrov/packages/rustdesk.git fetched at 2025-Apr-04 12:37:07
2025-Apr-04 12:37:35 :: [i586] #500 rustdesk.git 1.3.9-alt0.p11.1: build start
2025-Apr-04 12:37:35 :: [aarch64] #500 rustdesk.git 1.3.9-alt0.p11.1: build start
2025-Apr-04 12:37:35 :: [x86_64] #500 rustdesk.git 1.3.9-alt0.p11.1: build start
2025-Apr-04 12:37:48 :: [i586] #500 rustdesk.git 1.3.9-alt0.p11.1: build SKIPPED
2025-Apr-04 12:48:28 :: [x86_64] #500 rustdesk.git 1.3.9-alt0.p11.1: build OK
2025-Apr-04 12:59:30 :: [aarch64] #500 rustdesk.git 1.3.9-alt0.p11.1: build OK
2025-Apr-04 12:59:40 :: #500: rustdesk.git 1.3.9-alt0.p11.1: build check OK
2025-Apr-04 12:59:41 :: build check OK
2025-Apr-04 12:59:43 :: noarch check OK
2025-Apr-04 12:59:45 :: plan: src +1 -1 =19603, aarch64 +2 -2 =34012, x86_64 +2 -2 =34777
#500 rustdesk 1.3.7-alt1 -> 1.3.9-alt0.p11.1
Fri Apr 04 2025 Anton Kurachenko <srebrov@altlinux> 1.3.9-alt0.p11.1
- Backport new version to p11 branch.
Wed Apr 02 2025 Anton Kurachenko <srebrov@altlinux> 1.3.9-alt1
- New version 1.3.9.
Sun Feb 23 2025 Anton Kurachenko <srebrov@altlinux> 1.3.8-alt1
- New version 1.3.8.
- Disabled notification of the availability updates.
- Enabled unix-file-copy-paste feature.
Tue Feb 11 2025 Anton Kurachenko <srebrov@altlinux> 1.3.7-alt3
- Added info about the option to use epm play to install libsciter-gtk.
[...]
2025-Apr-04 13:00:23 :: patched apt indices
2025-Apr-04 13:00:32 :: created next repo
2025-Apr-04 13:00:42 :: duplicate provides check OK
2025-Apr-04 13:01:23 :: dependencies check OK
2025-Apr-04 13:02:02 :: [x86_64 aarch64] ELF symbols check OK
2025-Apr-04 13:02:32 :: [x86_64] #500 rustdesk: install check OK
2025-Apr-04 13:02:48 :: [aarch64] #500 rustdesk: install check OK
2025-Apr-04 13:03:04 :: [x86_64] #500 rustdesk-debuginfo: install check OK
2025-Apr-04 13:03:38 :: [aarch64] #500 rustdesk-debuginfo: install check OK
2025-Apr-04 13:03:56 :: [x86_64-i586] generated apt indices
2025-Apr-04 13:03:56 :: [x86_64-i586] created next repo
2025-Apr-04 13:04:08 :: [x86_64-i586] dependencies check OK
2025-Apr-04 13:04:09 :: gears inheritance check OK
2025-Apr-04 13:04:09 :: srpm inheritance check OK
girar-check-perms: access to rustdesk DENIED for srebrov: project `rustdesk' is not listed in the acl file for repository `p11', and the policy for such projects in `p11' is to deny
check-subtask-perms: #500: rustdesk: needs approvals from members of @maint and @tester groups
2025-Apr-04 13:04:10 :: acl check IGNORED
2025-Apr-04 13:04:23 :: created contents_index files
2025-Apr-04 13:04:33 :: created hash files: aarch64 src x86_64
2025-Apr-04 13:04:37 :: task #376312 for p11 TESTED
^ permalink raw reply [flat|nested] 5+ messages in thread
* [#376312] p11 EPERM (try 5) rustdesk.git=1.3.9-alt0.p11.1
2025-02-27 15:37 [#376312] [test-only] p11 FAILED rustdesk.git=1.3.8-alt1 Girar awaiter (srebrov)
` (2 preceding siblings ...)
2025-04-04 13:04 ` [#376312] p11 TESTED (try 4) rustdesk.git=1.3.9-alt0.p11.1 Girar awaiter (srebrov)
@ 2025-04-04 13:13 ` Girar awaiter (srebrov)
3 siblings, 0 replies; 5+ messages in thread
From: Girar awaiter (srebrov) @ 2025-04-04 13:13 UTC (permalink / raw)
To: Anton Kurachenko
Cc: sisyphus-incominger, girar-builder-p11, girar-builder-p11
https://git.altlinux.org/tasks/376312/logs/events.5.1.log
https://packages.altlinux.org/tasks/376312
2025-Apr-04 13:10:10 :: task #376312 for p11 resumed by srebrov:
2025-Apr-04 13:10:10 :: message: new_version
#100 removed
#200 removed
#300 removed
#400 removed
#500 build 1.3.9-alt0.p11.1 from /people/srebrov/packages/rustdesk.git fetched at 2025-Apr-04 12:37:07
2025-Apr-04 13:10:12 :: [i586] #500 rustdesk.git 1.3.9-alt0.p11.1: build start
2025-Apr-04 13:10:12 :: [x86_64] #500 rustdesk.git 1.3.9-alt0.p11.1: build start
2025-Apr-04 13:10:12 :: [aarch64] #500 rustdesk.git 1.3.9-alt0.p11.1: build start
2025-Apr-04 13:10:24 :: [x86_64] #500 rustdesk.git 1.3.9-alt0.p11.1: build OK (cached)
2025-Apr-04 13:10:24 :: [i586] #500 rustdesk.git 1.3.9-alt0.p11.1: build SKIPPED
2025-Apr-04 13:10:33 :: [aarch64] #500 rustdesk.git 1.3.9-alt0.p11.1: build OK (cached)
2025-Apr-04 13:10:43 :: #500: rustdesk.git 1.3.9-alt0.p11.1: build check OK
2025-Apr-04 13:10:44 :: build check OK
2025-Apr-04 13:10:46 :: noarch check OK
2025-Apr-04 13:10:48 :: plan: src +1 -1 =19603, aarch64 +2 -2 =34012, x86_64 +2 -2 =34777
#500 rustdesk 1.3.7-alt1 -> 1.3.9-alt0.p11.1
Fri Apr 04 2025 Anton Kurachenko <srebrov@altlinux> 1.3.9-alt0.p11.1
- Backport new version to p11 branch.
Wed Apr 02 2025 Anton Kurachenko <srebrov@altlinux> 1.3.9-alt1
- New version 1.3.9.
Sun Feb 23 2025 Anton Kurachenko <srebrov@altlinux> 1.3.8-alt1
- New version 1.3.8.
- Disabled notification of the availability updates.
- Enabled unix-file-copy-paste feature.
Tue Feb 11 2025 Anton Kurachenko <srebrov@altlinux> 1.3.7-alt3
- Added info about the option to use epm play to install libsciter-gtk.
[...]
2025-Apr-04 13:11:29 :: patched apt indices
2025-Apr-04 13:11:40 :: created next repo
2025-Apr-04 13:11:51 :: duplicate provides check OK
2025-Apr-04 13:12:29 :: dependencies check OK
2025-Apr-04 13:12:30 :: [x86_64 aarch64] no need to repeat ELF symbols check
2025-Apr-04 13:12:30 :: [x86_64 aarch64] ELF symbols check OK
2025-Apr-04 13:12:42 :: [x86_64] #500 rustdesk: install check OK (cached)
2025-Apr-04 13:12:47 :: [x86_64] #500 rustdesk-debuginfo: install check OK (cached)
2025-Apr-04 13:12:51 :: [aarch64] #500 rustdesk: install check OK (cached)
2025-Apr-04 13:13:01 :: [aarch64] #500 rustdesk-debuginfo: install check OK (cached)
2025-Apr-04 13:13:20 :: [x86_64-i586] generated apt indices
2025-Apr-04 13:13:20 :: [x86_64-i586] created next repo
2025-Apr-04 13:13:32 :: [x86_64-i586] dependencies check OK
2025-Apr-04 13:13:33 :: gears inheritance check OK
2025-Apr-04 13:13:33 :: srpm inheritance check OK
girar-check-perms: access to rustdesk DENIED for srebrov: project `rustdesk' is not listed in the acl file for repository `p11', and the policy for such projects in `p11' is to deny
check-subtask-perms: #500: rustdesk: needs approvals from members of @maint and @tester groups
2025-Apr-04 13:13:34 :: acl check FAILED
2025-Apr-04 13:13:46 :: created contents_index files
2025-Apr-04 13:13:54 :: created hash files: aarch64 src x86_64
2025-Apr-04 13:13:56 :: task #376312 for p11 EPERM
^ permalink raw reply [flat|nested] 5+ messages in thread
end of thread, other threads:[~2025-04-04 13:13 UTC | newest]
Thread overview: 5+ messages (download: mbox.gz / follow: Atom feed)
-- links below jump to the message on this page --
2025-02-27 15:37 [#376312] [test-only] p11 FAILED rustdesk.git=1.3.8-alt1 Girar awaiter (srebrov)
2025-03-29 16:32 ` [#376312] [test-only] p11 FAILED (try 2) vcpkg.git=2025.02.11-alt1 rustdesk.git=1.3.8-alt1 Girar awaiter (srebrov)
2025-04-02 20:12 ` [#376312] [test-only] p11 FAILED (try 3) rustdesk.git=1.3.9-alt0.p11.1 Girar awaiter (srebrov)
2025-04-04 13:04 ` [#376312] p11 TESTED (try 4) rustdesk.git=1.3.9-alt0.p11.1 Girar awaiter (srebrov)
2025-04-04 13:13 ` [#376312] p11 EPERM (try 5) rustdesk.git=1.3.9-alt0.p11.1 Girar awaiter (srebrov)
ALT Linux Girar Builder robot reports
This inbox may be cloned and mirrored by anyone:
git clone --mirror http://lore.altlinux.org/sisyphus-incominger/0 sisyphus-incominger/git/0.git
# If you have public-inbox 1.1+ installed, you may
# initialize and index your mirror using the following commands:
public-inbox-init -V2 sisyphus-incominger sisyphus-incominger/ http://lore.altlinux.org/sisyphus-incominger \
sisyphus-incominger@lists.altlinux.org sisyphus-incominger@lists.altlinux.ru sisyphus-incominger@lists.altlinux.com
public-inbox-index sisyphus-incominger
Example config snippet for mirrors.
Newsgroup available over NNTP:
nntp://lore.altlinux.org/org.altlinux.lists.sisyphus-incominger
AGPL code for this site: git clone https://public-inbox.org/public-inbox.git