ALT Linux Girar Builder robot reports
 help / color / mirror / Atom feed
From: "Girar awaiter (alton)" <girar-builder@altlinux.org>
To: Anton Meleshnikov <alton@altlinux.org>
Cc: girar-builder-p10@altlinux.org,
	sisyphus-incominger@lists.altlinux.org,
	girar-builder-p10@lists.altlinux.org
Subject: [#376208] [test-only] p10 FAILED (try 10) libfmt.git=10.2.1-alt1 cmrc.git=2.0.1-alt1 vcpkg.git=2023.09.15-alt1 ...
Date: Fri, 28 Feb 2025 08:20:31 +0000
Message-ID: <girar.task.376208.10.1@gyle.mskdc.altlinux.org> (raw)
In-Reply-To: <girar.task.376208.1.1@gyle.mskdc.altlinux.org>

https://git.altlinux.org/tasks/376208/logs/events.10.1.log
https://packages.altlinux.org/tasks/376208

subtask  name                            aarch64  armh    i586  x86_64
   #517  python3-module-setuptools_rust        ?     ?      26      25
   #520  python3-module-maturin                ?     ?  failed  failed

2025-Feb-28 08:18:13 :: test-only task #376208 for p10 resumed by alton:
2025-Feb-28 08:18:13 :: message: new_package
#100 build 10.2.1-alt1 from /gears/l/libfmt.git fetched at 2025-Feb-26 14:51:33 from p11
#200 build 2.0.1-alt1 from /gears/c/cmrc.git fetched at 2025-Feb-26 14:52:19 from p11
#300 build 2023.09.15-alt1 from /gears/v/vcpkg.git fetched at 2025-Feb-26 14:53:01 from p11
#400 build 2021.13.0-alt1.1 from /gears/t/tbb.git fetched at 2025-Feb-26 14:53:29 from p11
#500 build 2.31.0-alt1 from /gears/m/mold.git fetched at 2025-Feb-26 14:53:55 from p11
#504 removed
#510 removed
#514 removed
#516 removed
#517 build 1.6.0-alt1 from /gears/p/python3-module-setuptools_rust.git fetched at 2025-Feb-28 08:11:54
#520 build python3-module-maturin-1.5.1-alt1.src.rpm from p11
#530 build python3-module-watchfiles-0.21.0-alt2.src.rpm from p11
#540 build 0.4.6-alt1 from /gears/p/python3-module-colorama.git fetched at 2025-Feb-27 07:38:15 from p11
#560 build 2024.4.16-alt1 from /gears/p/python3-module-sphinx-autobuild.git fetched at 2025-Feb-27 07:39:13 from p11
#600 build 0.8.0-alt1 from /gears/p/python3-module-pyproject-metadata.git fetched at 2025-Feb-26 14:54:24 from p11
#700 removed
#1000 build 1.8.0-alt1 from /gears/p/python3-module-nodeenv.git fetched at 2025-Feb-26 14:55:52 from p11
#1040 build 0.2.0b2-alt1 from /gears/p/python3-module-sphinx-theme-builder.git fetched at 2025-Feb-27 07:17:23 from p11
#1100 build 2024.01.29-alt1 from /gears/p/python3-module-furo.git fetched at 2025-Feb-26 14:56:45 from p11
#1200 build 18.1.8-alt0.2 from /gears/l/llvm18.1.git fetched at 2025-Feb-26 14:57:55 from p11
#1300 build 1.3.7-alt1 from /gears/r/rustdesk.git fetched at 2025-Feb-26 14:59:03 from p11
2025-Feb-28 08:18:14 :: created build repo
2025-Feb-28 08:18:14 :: #540: force rebuild
2025-Feb-28 08:18:14 :: #600: force rebuild
2025-Feb-28 08:18:14 :: #1000: force rebuild
2025-Feb-28 08:18:15 :: [aarch64] #100 libfmt.git 10.2.1-alt1: build start
2025-Feb-28 08:18:15 :: [armh] #100 libfmt.git 10.2.1-alt1: build start
2025-Feb-28 08:18:15 :: [x86_64] #100 libfmt.git 10.2.1-alt1: build start
2025-Feb-28 08:18:15 :: [i586] #100 libfmt.git 10.2.1-alt1: build start
2025-Feb-28 08:18:30 :: [i586] #100 libfmt.git 10.2.1-alt1: build OK (cached)
2025-Feb-28 08:18:30 :: [i586] #200 cmrc.git 2.0.1-alt1: build start
2025-Feb-28 08:18:30 :: [x86_64] #100 libfmt.git 10.2.1-alt1: build OK (cached)
2025-Feb-28 08:18:31 :: [x86_64] #200 cmrc.git 2.0.1-alt1: build start
2025-Feb-28 08:18:41 :: [i586] #200 cmrc.git 2.0.1-alt1: build OK (cached)
2025-Feb-28 08:18:41 :: [i586] #300 vcpkg.git 2023.09.15-alt1: build start
2025-Feb-28 08:18:42 :: [x86_64] #200 cmrc.git 2.0.1-alt1: build OK (cached)
2025-Feb-28 08:18:42 :: [x86_64] #300 vcpkg.git 2023.09.15-alt1: build start
2025-Feb-28 08:18:53 :: [i586] #300 vcpkg.git 2023.09.15-alt1: build OK (cached)
2025-Feb-28 08:18:53 :: [i586] #400 tbb.git 2021.13.0-alt1.1: build start
2025-Feb-28 08:18:53 :: [aarch64] #100 libfmt.git 10.2.1-alt1: build OK (cached)
2025-Feb-28 08:18:53 :: [armh] #100 libfmt.git 10.2.1-alt1: build OK (cached)
2025-Feb-28 08:18:53 :: [x86_64] #300 vcpkg.git 2023.09.15-alt1: build OK (cached)
2025-Feb-28 08:18:53 :: [aarch64] #200 cmrc.git 2.0.1-alt1: build start
2025-Feb-28 08:18:54 :: [armh] #200 cmrc.git 2.0.1-alt1: build start
2025-Feb-28 08:18:54 :: [x86_64] #400 tbb.git 2021.13.0-alt1.1: build start
2025-Feb-28 08:19:04 :: [i586] #400 tbb.git 2021.13.0-alt1.1: build OK (cached)
2025-Feb-28 08:19:04 :: [i586] #500 mold.git 2.31.0-alt1: build start
2025-Feb-28 08:19:05 :: [x86_64] #400 tbb.git 2021.13.0-alt1.1: build OK (cached)
2025-Feb-28 08:19:06 :: [x86_64] #500 mold.git 2.31.0-alt1: build start
2025-Feb-28 08:19:16 :: [i586] #500 mold.git 2.31.0-alt1: build OK (cached)
2025-Feb-28 08:19:16 :: [i586] #517 python3-module-setuptools_rust.git 1.6.0-alt1: build start
2025-Feb-28 08:19:17 :: [x86_64] #500 mold.git 2.31.0-alt1: build OK (cached)
2025-Feb-28 08:19:18 :: [x86_64] #517 python3-module-setuptools_rust.git 1.6.0-alt1: build start
2025-Feb-28 08:19:22 :: [armh] #200 cmrc.git 2.0.1-alt1: build OK (cached)
2025-Feb-28 08:19:22 :: [armh] #300 vcpkg.git 2023.09.15-alt1: build start
2025-Feb-28 08:19:25 :: [aarch64] #200 cmrc.git 2.0.1-alt1: build OK (cached)
2025-Feb-28 08:19:25 :: [aarch64] #300 vcpkg.git 2023.09.15-alt1: build start
2025-Feb-28 08:19:42 :: [i586] #517 python3-module-setuptools_rust.git 1.6.0-alt1: build OK
2025-Feb-28 08:19:42 :: [i586] #520 python3-module-maturin-1.5.1-alt1.src.rpm: build start
2025-Feb-28 08:19:43 :: [x86_64] #517 python3-module-setuptools_rust.git 1.6.0-alt1: build OK
2025-Feb-28 08:19:43 :: [x86_64] #520 python3-module-maturin-1.5.1-alt1.src.rpm: build start
2025-Feb-28 08:19:51 :: [armh] #300 vcpkg.git 2023.09.15-alt1: build OK (cached)
2025-Feb-28 08:19:52 :: [armh] #400 tbb.git 2021.13.0-alt1.1: build start
2025-Feb-28 08:19:57 :: [aarch64] #300 vcpkg.git 2023.09.15-alt1: build OK (cached)
2025-Feb-28 08:19:57 :: [aarch64] #400 tbb.git 2021.13.0-alt1.1: build start
[i586] <13>Feb 28 08:19:56 rpmi: libgdbm-1.8.3-alt10 sisyphus+278100.1600.1.1 1626059138 installed
[i586] <13>Feb 28 08:19:56 rpmi: libexpat-2.5.0-alt1 p10+324220.100.1.1 1688465139 installed
[i586] <13>Feb 28 08:19:56 rpmi: libp11-kit-0.24.1-alt1 p10+305061.100.3.1 1660573407 installed
[i586] <13>Feb 28 08:19:56 rpmi: libtasn1-4.20.0-alt1 p10+374934.100.1.1 1739780096 installed
[i586] <13>Feb 28 08:19:56 rpmi: rpm-macros-alternatives-0.5.2-alt1 p10+309129.100.2.1 1668066636 installed
[i586] <13>Feb 28 08:19:56 rpmi: alternatives-0.5.2-alt1 p10+309129.100.2.1 1668066636 installed
[i586] <13>Feb 28 08:19:56 rpmi: ca-certificates-2024.12.10-alt1 p10+372243.20.2.1 1738332466 installed
[i586] <13>Feb 28 08:19:56 rpmi: ca-trust-0.1.6-alt1 p10+344774.100.1.1 1712685728 installed
[i586] <13>Feb 28 08:19:56 rpmi: p11-kit-trust-0.24.1-alt1 p10+305061.100.3.1 1660573407 installed
[i586] <13>Feb 28 08:19:56 rpmi: libcrypto1.1-1.1.1w-alt0.p10.2 p10+364728.100.2.1 1734595176 installed
[i586] <13>Feb 28 08:19:56 rpmi: libssl1.1-1.1.1w-alt0.p10.2 p10+364728.100.2.1 1734595176 installed
[i586] <13>Feb 28 08:19:56 rpmi: python3-3.9.20-alt1 p10+357900.100.1.1 1726758534 installed
[i586] <13>Feb 28 08:19:57 rpmi: python3-base-3.9.20-alt1 p10+357900.100.1.1 1726758534 installed
[i586] <13>Feb 28 08:19:57 rpmi: python3-module-pyproject-installer-0.5.2-alt1 p10+325520.300.7.1 1691156288 installed
[i586] <13>Feb 28 08:19:57 rpmi: rpm-macros-pyproject-0.0.4-alt1 p10+325520.400.7.1 1691156303 installed
[i586] <13>Feb 28 08:19:57 rpmi: tests-for-installed-python3-pkgs-0.1.22-alt1 p10+325520.200.7.1 1691156214 installed
[i586] <13>Feb 28 08:19:57 rpmi: rpm-build-python3-0.1.22-alt1 p10+325520.200.7.1 1691156214 installed
[i586] <13>Feb 28 08:19:57 rpmi: rpm-build-pyproject-0.0.4-alt1 p10+325520.400.7.1 1691156303 installed
[i586] Reading Package Lists...
[i586] Building Dependency Tree...
[i586] MI2a: marked for install (shallow): rust-cargo
[i586] MI2a:  satisfying Depends: libcurl.so.4 >= set:kfYXmqZlFgJ4IJYBZ6pyZgfWb4RiPZkeS62BeP5r4vGGy8sViS0Ezc
[i586] MI2a:   maybe install (a providing target): libcurl 8.12.0-alt1:p10+374306.100.2.1@1739647033
[i586] MI2a:  target SELECTED: libcurl 8.12.0-alt1:p10+374306.100.2.1@1739647033
[i586] MI2a:  requesting to install libcurl (unspec'd ver; inspect with Debug::pkgMark-shallow)
[i586] MI2a:    marked for install (shallow): libcurl
[i586] MI2a:     satisfying Depends: libbrotlidec.so.1 >= set:heroOawuYbTK8
[i586] MI2a:      maybe install (a providing target): libbrotlidec 1.0.9-alt2:sisyphus+278430.100.1.2@1626213212
[i586] MI2a:     target SELECTED: libbrotlidec 1.0.9-alt2:sisyphus+278430.100.1.2@1626213212
[i586] MI2a:     requesting to install libbrotlidec (unspec'd ver; inspect with Debug::pkgMark-shallow)
[i586] MI2a:       marked for install (shallow): libbrotlidec
[i586] MI2a:        satisfying Depends: libbrotlicommon = 1.0.9-alt2:sisyphus+278430.100.1.2
[i586] MI2a:         maybe install (a direct target): libbrotlicommon 1.0.9-alt2:sisyphus+278430.100.1.2@1626213212
[i586] MI2a:        target SELECTED: libbrotlicommon 1.0.9-alt2:sisyphus+278430.100.1.2@1626213212
[i586] MI2a:        requesting to install libbrotlicommon (unspec'd ver; inspect with Debug::pkgMark-shallow)
[i586] MI2a:          marked for install (shallow): libbrotlicommon
[i586] MI2a:     satisfying Depends: libgsasl.so.7 >= set:jfNMMjxjlLiKUyEAZvcPMCX3
[i586] MI2a:      maybe install (a providing target): libgsasl 1.8.0-alt3:sisyphus+275307.100.1.2@1624478553
[i586] MI2a:     target SELECTED: libgsasl 1.8.0-alt3:sisyphus+275307.100.1.2@1624478553
[i586] MI2a:     requesting to install libgsasl (unspec'd ver; inspect with Debug::pkgMark-shallow)
[i586] MI2a:       marked for install (shallow): libgsasl
[i586] MI2a:        satisfying Depends: libgssapi_krb5.so.2 >= set:lgUI5pnpbNsJUr9F0ECN6LIbSVz7j3UNHAXVG0YYmbjijMyN
[i586] MI2a:         maybe install (a providing target): libkrb5 1.19.4-alt4:p10+351854.100.3.1@1733168066
[i586] MI2a:        target SELECTED: libkrb5 1.19.4-alt4:p10+351854.100.3.1@1733168066
[i586] MI2a:        requesting to install libkrb5 (unspec'd ver; inspect with Debug::pkgMark-shallow)
[i586] MI2a:          marked for install (shallow): libkrb5
[i586] MI2a:           satisfying Depends: libcom_err.so.2 >= set:ifPl8xIvqFmQe8JQo3
[i586] MI2a:            maybe install (a providing target): libcom_err 1.46.2.0.16.f114-alt1:sisyphus+278100.1000.1.1@1626056819
[i586] MI2a:           target SELECTED: libcom_err 1.46.2.0.16.f114-alt1:sisyphus+278100.1000.1.1@1626056819
[i586] MI2a:           requesting to install libcom_err (unspec'd ver; inspect with Debug::pkgMark-shallow)
[i586] MI2a:             marked for install (shallow): libcom_err
[i586] MI2a:           satisfying Depends: libkeyutils.so.1 >= set:jfWn12U6KThBXgruPLZ68yYZt2
[i586] MI2a:            maybe install (a providing target): libkeyutils 1.6.3-alt1:sisyphus+266061.100.1.1@1612919567
[i586] MI2a:           target SELECTED: libkeyutils 1.6.3-alt1:sisyphus+266061.100.1.1@1612919567
[i586] MI2a:           requesting to install libkeyutils (unspec'd ver; inspect with Debug::pkgMark-shallow)
[i586] MI2a:             marked for install (shallow): libkeyutils
[i586] MI2a:           satisfying Depends: liblmdb.so.0 >= set:kfalKd4xYAkaAG2MqeH0wB2F4kTaBEo1iv0KFpxVmqzFIV6HJ0
[i586] MI2a:            maybe install (a providing target): liblmdb 0.9.23-alt1:sisyphus+275369.100.1.2@1624493869
[i586] MI2a:           target SELECTED: liblmdb 0.9.23-alt1:sisyphus+275369.100.1.2@1624493869
[i586] MI2a:           requesting to install liblmdb (unspec'd ver; inspect with Debug::pkgMark-shallow)
[i586] MI2a:             marked for install (shallow): liblmdb
[i586] MI2a:           satisfying Depends: libverto.so.1 >= set:jfI5MRvI6tmNn0zwQdb68Gk0
[i586] MI2a:            maybe install (a providing target): libverto 0.3.2-alt1_1:sisyphus+279289.100.1.3@1626493872
[i586] MI2a:           target SELECTED: libverto 0.3.2-alt1_1:sisyphus+279289.100.1.3@1626493872
[i586] MI2a:           requesting to install libverto (unspec'd ver; inspect with Debug::pkgMark-shallow)
[i586] MI2a:             marked for install (shallow): libverto
[i586] MI2a:        satisfying Depends: libidn.so.12 >= set:kiBXars6
[i586] MI2a:         maybe install (a providing target): libidn 1.37-alt1:sisyphus+278604.100.1.1@1626095110
[i586] MI2a:        target SELECTED: libidn 1.37-alt1:sisyphus+278604.100.1.1@1626095110
[i586] MI2a:        requesting to install libidn (unspec'd ver; inspect with Debug::pkgMark-shallow)
[i586] MI2a:          marked for install (shallow): libidn
[i586] MI2a:        satisfying Depends: libntlm.so.0 >= set:hfknJM1
[i586] MI2a:         maybe install (a providing target): libntlm 1.5-alt1:sisyphus+278100.3300.1.1@1626059663
[i586] MI2a:        target SELECTED: libntlm 1.5-alt1:sisyphus+278100.3300.1.1@1626059663
[i586] MI2a:        requesting to install libntlm (unspec'd ver; inspect with Debug::pkgMark-shallow)
[i586] MI2a:          marked for install (shallow): libntlm
[i586] MI2a:     satisfying Depends: libidn2.so.0 >= set:ifA2ZHZ1X9N2
[i586] MI2a:      maybe install (a providing target): libidn2 2.3.2-alt1:p10+281239.100.3.1@1627673262
[i586] MI2a:     target SELECTED: libidn2 2.3.2-alt1:p10+281239.100.3.1@1627673262
[i586] MI2a:     requesting to install libidn2 (unspec'd ver; inspect with Debug::pkgMark-shallow)
[i586] MI2a:       marked for install (shallow): libidn2
[i586] MI2a:     satisfying Depends: liblber-2.4.so.2 >= set:liRJP9c9FzZ8q5FR
[i586] MI2a:      maybe install (a providing target): libldap 2.4.59-alt1.p10.3:p10+374530.200.4.1@1739797036
[i586] MI2a:     target SELECTED: libldap 2.4.59-alt1.p10.3:p10+374530.200.4.1@1739797036
[i586] MI2a:     requesting to install libldap (unspec'd ver; inspect with Debug::pkgMark-shallow)
[i586] MI2a:       marked for install (shallow): libldap
[i586] MI2a:        satisfying Depends: libsasl2.so.3 >= set:lhKAh7QjCM36Vnr6MdFxFf8LIcZsS1kl0wH7Iyp
[i586] MI2a:         maybe install (a providing target): libsasl2-3 2.1.28-alt2:p10+350745.100.3.1@1719827023
[i586] MI2a:        target SELECTED: libsasl2-3 2.1.28-alt2:p10+350745.100.3.1@1719827023
[i586] MI2a:        requesting to install libsasl2-3 (unspec'd ver; inspect with Debug::pkgMark-shallow)
[i586] MI2a:          marked for install (shallow): libsasl2-3
[i586] MI2a:        satisfying Depends: openldap-common = 2.4.59-alt1.p10.3:p10+374530.200.4.1
[i586] MI2a:         maybe install (a direct target): openldap-common 2.4.59-alt1.p10.3:p10+374530.200.4.1@1739797003
[i586] MI2a:        target SELECTED: openldap-common 2.4.59-alt1.p10.3:p10+374530.200.4.1@1739797003
[i586] MI2a:        requesting to install openldap-common (unspec'd ver; inspect with Debug::pkgMark-shallow)
[i586] MI2a:          marked for install (shallow): openldap-common
[i586] MI2a:     satisfying Depends: libnghttp2.so.14 >= set:lfKRgJ8UKsv8mdZbLF8UZpCjqzxjS4uXpINNNC9lNPxPEJZqw9IfpEB51C0QFeHEVpGv95xGtf4CksgxNiZbJO6CvE4RCQxaKbdf6IG29SZkOus
[i586] MI2a:      maybe install (a providing target): libnghttp2 1.61.0-alt1:p10+344447.40.1.1@1712304240
[i586] MI2a:     target SELECTED: libnghttp2 1.61.0-alt1:p10+344447.40.1.1@1712304240
[i586] MI2a:     requesting to install libnghttp2 (unspec'd ver; inspect with Debug::pkgMark-shallow)
[i586] MI2a:       marked for install (shallow): libnghttp2
[i586] MI2a:     satisfying Depends: libpsl.so.5 >= set:ifo8sG4NYozTZj0
[i586] MI2a:      maybe install (a providing target): libpsl 0.21.5-alt1:p10+345385.100.1.1@1713430420
[i586] MI2a:     target SELECTED: libpsl 0.21.5-alt1:p10+345385.100.1.1@1713430420
[i586] MI2a:     requesting to install libpsl (unspec'd ver; inspect with Debug::pkgMark-shallow)
[i586] MI2a:       marked for install (shallow): libpsl
[i586] MI2a:        satisfying Depends: publicsuffix-list-dafsa  (NULL)
[i586] MI2a:         maybe install (a direct target): publicsuffix-list-dafsa 20250131-alt1:p10+373300.100.2.1@1739435494
[i586] MI2a:        target SELECTED: publicsuffix-list-dafsa 20250131-alt1:p10+373300.100.2.1@1739435494
[i586] MI2a:        requesting to install publicsuffix-list-dafsa (unspec'd ver; inspect with Debug::pkgMark-shallow)
[i586] MI2a:          marked for install (shallow): publicsuffix-list-dafsa
[i586] MI2a:     satisfying Depends: libssh2.so.1 >= set:lfFi2ZJdCZnNQqC7FxZHyYYVCMxI4j1759y3AVs98cSjdm6BZrMSTPA4BKYeWR49vSI0JGO8E3yldZ5j77X8z3joPyGVoiqovNAwPc5RvPDTKNRR6pS6H80qi1nxAdsxOdZERlIwndLqIyuVb
[i586] MI2a:      maybe install (a providing target): libssh2 1.11.0-alt2:p10+339351.200.2.1@1706598965
[i586] MI2a:     target SELECTED: libssh2 1.11.0-alt2:p10+339351.200.2.1@1706598965
[i586] MI2a:     requesting to install libssh2 (unspec'd ver; inspect with Debug::pkgMark-shallow)
[i586] MI2a:       marked for install (shallow): libssh2
[i586] MI2a:  satisfying Depends: rust = 1:1.80.0-alt0.p10.2:p10+367423.100.1.1
[i586] MI2a:   maybe install (a direct target): rust 1:1.80.0-alt0.p10.2:p10+367423.100.1.1@1735507044
[i586] MI2a:  target SELECTED: rust 1:1.80.0-alt0.p10.2:p10+367423.100.1.1@1735507044
[i586] MI2a:  requesting to install rust (unspec'd ver; inspect with Debug::pkgMark-shallow)
[i586] MI2a:    marked for install (shallow): rust
[i586] MI2a:     satisfying Depends: libLLVM-17.so >= set:tjEiA2ri0wG0cM801QvIVHzxoP6DP0aMhyFdCCDI7bQJ4VFB5FPq0nKvwW8Ab1TTFLjt4wGDyszLIYSXgFT0tXliodZh7L5nWiNfxNzDwd1ZwSZihJab5z4nC5mszAB5hnHGbwiPI6gghJ5lgJ3ySsMU2O4dzZdChhHmGZ7Zf9QEwPS9OJUcCO5H8uMBNUhTDkKGhjGfXZnI4AfDxDYvI9KAgaBE8DA5yraMwpOX060q3lZwoaZtDxgK0a6xhdxJG4VuGEF1en3Rx4Ifp1TwxZsgVX1H6nE0odNG0WWnYZ6x9spZi16d6XA51BGA8B4PF9lNk70rIEYLQqkCGkhRgUdE5CElZx7ALqn39b9hzR9sEbCaJDtbboqIzmwPblBiV8eg8dADkcGBXwunsbfBDM2Zqoqf4U9ssBATSxtLFJd2iS3HDjZDDPZ5MPZiZ3VIecxNcc4xjozHNQ9YswZmgQiHdnTmiS2ZwsHWsqeMhewFPg5jd2ohWxLJm2MKZ4zsTbZhETX3KEn1OY7xTehAi61AhI0RADc08ltDtZb2ZD1cte1IakkgRTcEQvpaKr81VvA4lPpgYLhTLsGcNRgGMqd4r2v0bKLUSDo5lLXKo28FuUVZcSKKZ5he5BpETGIsiK2UUJECtKMADL506WZLXVuGZqTzF3TZmWpIZpwIi46VFmnKTT92Hki3xbh8ZpTQBFhOcIkLSDPeNqecm0NiQSbpoFFYcxcLi0woZGJT3mk8SLg8EC483r6YZ9NUnxw06nL02YoBmkpdNxi1FqQWVCm2rFJrgENjlWFj32EvyxXxiyYCx8vNtK8CmRjl7LkP7xGkLzFeuLe7CM6H37dxQmQzncZoPOW1FMWabCvgsd8svrCdfZHy1t1twIHyeJTg0K9beg5Rnir9ueJ1EZzZwOE7AkZ1kvj2dPLvDM2U9mGaSOlkdOYHASJGe5Wm34XlfoUDNjd0KyjTb97gLtHQcbNZ7JE87nMUWDXVO0sYZ7Ms7GmRyeKjDyz17XZ1aUaCdpFuguGi06xI7w4ZflZmR9gSn0jFAvIl4N8XfizcVZ7Tc6kLkyExNiJTdpz3jPJ0gQlMZEC4KViNAbu8rr6Cn8I1odgnkfoxgRdZKZF74wfZgdBlg2nPKX89FQZtMI2a:      maybe install (a providing target): llvm17.0-libs 17.0.6-alt2.p10.1:p10+351536.400.5.1@1719905359
[i586] MI2a:     target SELECTED: llvm17.0-libs 17.0.6-alt2.p10.1:p10+351536.400.5.1@1719905359
[i586] MI2a:     requesting to install llvm17.0-libs (unspec'd ver; inspect with Debug::pkgMark-shallow)
[i586] MI2a:       marked for install (shallow): llvm17.0-libs
[i586] MI2a:        satisfying Depends: libedit.so.3 >= set:lhWGuYsENcm3e5dP3PTKehhHZ5VJpv13
[i586] MI2a:         maybe install (a providing target): libedit3 3.1.20191231-alt1:sisyphus+278505.100.1.1@1626106372
[i586] MI2a:        target SELECTED: libedit3 3.1.20191231-alt1:sisyphus+278505.100.1.1@1626106372
[i586] MI2a:        requesting to install libedit3 (unspec'd ver; inspect with Debug::pkgMark-shallow)
[i586] MI2a:          marked for install (shallow): libedit3
[i586] MI2a:        satisfying Depends: llvm17.0-gold = 17.0.6-alt2.p10.1:p10+351536.400.5.1
[i586] MI2a:         maybe install (a direct target): llvm17.0-gold 17.0.6-alt2.p10.1:p10+351536.400.5.1@1719905359
[i586] MI2a:        target SELECTED: llvm17.0-gold 17.0.6-alt2.p10.1:p10+351536.400.5.1@1719905359
[i586] MI2a:        requesting to install llvm17.0-gold (unspec'd ver; inspect with Debug::pkgMark-shallow)
[i586] MI2a:          marked for install (shallow): llvm17.0-gold
[i586] MI2a:        satisfying Depends: llvm17.0-polly = 17.0.6-alt2.p10.1:p10+351536.400.5.1
[i586] MI2a:         maybe install (a direct target): llvm17.0-polly 17.0.6-alt2.p10.1:p10+351536.400.5.1@1719905359
[i586] MI2a:        target SELECTED: llvm17.0-polly 17.0.6-alt2.p10.1:p10+351536.400.5.1@1719905359
[i586] MI2a:        requesting to install llvm17.0-polly (unspec'd ver; inspect with Debug::pkgMark-shallow)
[i586] MI2a:          marked for install (shallow): llvm17.0-polly
[i586] MI2a:           satisfying Depends: llvm17.0-filesystem = 17.0.6-alt2.p10.1:p10+351536.400.5.1
[i586] MI2a:            maybe install (a direct target): llvm17.0-filesystem 17.0.6-alt2.p10.1:p10+351536.400.5.1@1719905359
[i586] MI2a:           target SELECTED: llvm17.0-filesystem 17.0.6-alt2.p10.1:p10+351536.400.5.1@1719905359
[i586] MI2a:           requesting to install llvm17.0-filesystem (unspec'd ver; inspect with Debug::pkgMark-shallow)
[i586] MI2a:             marked for install (shallow): llvm17.0-filesystem
[i586] MI2a: marked for install (shallow): python3-module-setuptools
[i586] MI2a:  satisfying Depends: python3-dev  (NULL)
[i586] MI2a:   maybe install (a direct target): python3-dev 3.9.20-alt1:p10+357900.100.1.1@1726758534
[i586] MI2a:  target SELECTED: python3-dev 3.9.20-alt1:p10+357900.100.1.1@1726758534
[i586] MI2a:  requesting to install python3-dev (unspec'd ver; inspect with Debug::pkgMark-shallow)
[i586] MI2a:    marked for install (shallow): python3-dev
[i586] MI2a:     satisfying Depends: libncurses-devel  (NULL)
[i586] MI2a:      maybe install (a direct target): libncurses-devel 6.3.20220618-alt1:p10+319472.100.4.1@1685092698
[i586] MI2a:     target SELECTED: libncurses-devel 6.3.20220618-alt1:p10+319472.100.4.1@1685092698
[i586] MI2a:     requesting to install libncurses-devel (unspec'd ver; inspect with Debug::pkgMark-shallow)
[i586] MI2a:       marked for install (shallow): libncurses-devel
[i586] MI2a:        satisfying Depends: libtinfo-devel = 6.3.20220618-alt1:p10+319472.100.4.1
[i586] MI2a:         maybe install (a direct target): libtinfo-devel 6.3.20220618-alt1:p10+319472.100.4.1@1685092698
[i586] MI2a:        target SELECTED: libtinfo-devel 6.3.20220618-alt1:p10+319472.100.4.1@1685092698
[i586] MI2a:        requesting to install libtinfo-devel (unspec'd ver; inspect with Debug::pkgMark-shallow)
[i586] MI2a:          marked for install (shallow): libtinfo-devel
[i586] MI2a:        satisfying Depends: libncurses = 6.3.20220618-alt1:p10+319472.100.4.1
[i586] MI2a:         maybe install (a direct target): libncurses 6.3.20220618-alt1:p10+319472.100.4.1@1685092698
[i586] MI2a:        target SELECTED: libncurses 6.3.20220618-alt1:p10+319472.100.4.1@1685092698
[i586] MI2a:        requesting to install libncurses (unspec'd ver; inspect with Debug::pkgMark-shallow)
[i586] MI2a:          marked for install (shallow): libncurses
[i586] MI2a:     satisfying Depends: libpython3 = 3.9.20-alt1:p10+357900.100.1.1
[i586] MI2a:      maybe install (a direct target): libpython3 3.9.20-alt1:p10+357900.100.1.1@1726758534
[i586] MI2a:     target SELECTED: libpython3 3.9.20-alt1:p10+357900.100.1.1@1726758534
[i586] MI2a:     requesting to install libpython3 (unspec'd ver; inspect with Debug::pkgMark-shallow)
[i586] MI2a:       marked for install (shallow): libpython3
[i586] MI2a:  satisfying Depends: python3-module-pkg_resources = 1:57.4.0-alt1.p10.1:p10+362900.200.1.1
[i586] MI2a:   maybe install (a direct target): python3-module-pkg_resources 1:57.4.0-alt1.p10.1:p10+362900.200.1.1@1732008744
[i586] MI2a:  target SELECTED: python3-module-pkg_resources 1:57.4.0-alt1.p10.1:p10+362900.200.1.1@1732008744
[i586] MI2a:  requesting to install python3-module-pkg_resources (unspec'd ver; inspect with Debug::pkgMark-shallow)
[i586] MI2a:    marked for install (shallow): python3-module-pkg_resources
[i586] MI2a: marked for install (shallow): python3-module-setuptools_rust
[i586] MI2a:  satisfying Depends: python3(semantic_version) < 0
[i586] MI2a:   maybe install (a providing target): python3-module-semantic_version 2.8.5-alt4:sisyphus+278950.100.1.1@1626298359
[i586] MI2a:  target SELECTED: python3-module-semantic_version 2.8.5-alt4:sisyphus+278950.100.1.1@1626298359
[i586] MI2a:  requesting to install python3-module-semantic_version (unspec'd ver; inspect with Debug::pkgMark-shallow)
[i586] MI2a:    marked for install (shallow): python3-module-semantic_version
[i586] MI2a:     satisfying Depends: python3(django.db) < 0
[i586] MI2a:      maybe install (a providing target): python3-module-django 3.2.25-alt1:p10+348531.100.1.1@1716220083
[i586] MI2a:     target SELECTED: python3-module-django 3.2.25-alt1:p10+348531.100.1.1@1716220083
[i586] MI2a:     requesting to install python3-module-django (unspec'd ver; inspect with Debug::pkgMark-shallow)
[i586] MI2a:       marked for install (shallow): python3-module-django
[i586] MI2a:        satisfying Depends: python3(asgiref.local) < 0
[i586] MI2a:         maybe install (a providing target): python3-module-asgiref 3.4.1-alt1:p10+283535.100.4.1@1631192500
[i586] MI2a:        target SELECTED: python3-module-asgiref 3.4.1-alt1:p10+283535.100.4.1@1631192500
[i586] MI2a:        requesting to install python3-module-asgiref (unspec'd ver; inspect with Debug::pkgMark-shallow)
[i586] MI2a:          marked for install (shallow): python3-module-asgiref
[i586] MI2a:        satisfying Depends: python3(geoip2.database) < 0
[i586] MI2a:         maybe install (a providing target): python3-module-GeoIP2 4.2.0-alt1:sisyphus+277971.100.1.1@1625928820
[i586] MI2a:        target SELECTED: python3-module-GeoIP2 4.2.0-alt1:sisyphus+277971.100.1.1@1625928820
[i586] MI2a:        requesting to install python3-module-GeoIP2 (unspec'd ver; inspect with Debug::pkgMark-shallow)
[i586] MI2a:          marked for install (shallow): python3-module-GeoIP2
[i586] MI2a:           satisfying Depends: python3(aiohttp) < 0
[i586] MI2a:            maybe install (a providing target): python3-module-aiohttp 3.9.5-alt1:p10+364068.100.3.1@1734099632
[i586] MI2a:           target SELECTED: python3-module-aiohttp 3.9.5-alt1:p10+364068.100.3.1@1734099632
[i586] MI2a:           requesting to install python3-module-aiohttp (unspec'd ver; inspect with Debug::pkgMark-shallow)
[i586] MI2a:             marked for install (shallow): python3-module-aiohttp
[i586] MI2a:              satisfying Depends: python3(async_timeout)  (NULL)
[i586] MI2a:               maybe install (a providing target): python3-module-async-timeout 4.0.3-alt1:p10+341764.5600.16.1@1711109524
[i586] MI2a:              target SELECTED: python3-module-async-timeout 4.0.3-alt1:p10+341764.5600.16.1@1711109524
[i586] MI2a:              requesting to install python3-module-async-timeout (unspec'd ver; inspect with Debug::pkgMark-shallow)
[i586] MI2a:                marked for install (shallow): python3-module-async-timeout
[i586] MI2a:              satisfying Depends: python3(aiosignal) < 0
[i586] MI2a:               maybe install (a providing target): python3-module-aiosignal 1.3.1-alt1:p10+341764.4400.10.1@1710342246
[i586] MI2a:              target SELECTED: python3-module-aiosignal 1.3.1-alt1:p10+341764.4400.10.1@1710342246
[i586] MI2a:              requesting to install python3-module-aiosignal (unspec'd ver; inspect with Debug::pkgMark-shallow)
[i586] MI2a:                marked for install (shallow): python3-module-aiosignal
[i586] MI2a:                 satisfying Depends: python3(frozenlist) < 0
[i586] MI2a:                  maybe install (a providing target): python3-module-frozenlist 1.3.3-alt1:p10+341764.4600.10.1@1710342305
[i586] MI2a:                 target SELECTED: python3-module-frozenlist 1.3.3-alt1:p10+341764.4600.10.1@1710342305
[i586] MI2a:                 requesting to install python3-module-frozenlist (unspec'd ver; inspect with Debug::pkgMark-shallow)
[i586] MI2a:                   marked for install (shallow): python3-module-frozenlist
[i586] MI2a:              satisfying Depends: python3(attr) < 0
[i586] MI2a:               maybe install (a providing target): python3-module-attrs 22.1.0-alt1:p10+307737.2052.28.1@1666775429
[i586] MI2a:              target SELECTED: python3-module-attrs 22.1.0-alt1:p10+307737.2052.28.1@1666775429
[i586] MI2a:              requesting to install python3-module-attrs (unspec'd ver; inspect with Debug::pkgMark-shallow)
[i586] MI2a:                marked for install (shallow): python3-module-attrs
[i586] MI2a:              satisfying Depends: python3(gunicorn.config) < 0
[i586] MI2a:               maybe install (a providing target): python3-module-gunicorn 23.0.0-alt0.p10.1:p10+362975.100.1.1@1732088685
[i586] MI2a:              target SELECTED: python3-module-gunicorn 23.0.0-alt0.p10.1:p10+362975.100.1.1@1732088685
[i586] MI2a:              requesting to install python3-module-gunicorn (unspec'd ver; inspect with Debug::pkgMark-shallow)
[i586] MI2a:                marked for install (shallow): python3-module-gunicorn
[i586] MI2a:                 satisfying Depends: python3(eventlet) < 0
[i586] MI2a:                  maybe install (a providing target): python3-module-eventlet 0.33.3-alt2.p10:p10+336214.1240.7.1@1702970652
[i586] MI2a:                 target SELECTED: python3-module-eventlet 0.33.3-alt2.p10:p10+336214.1240.7.1@1702970652
[i586] MI2a:                 requesting to install python3-module-eventlet (unspec'd ver; inspect with Debug::pkgMark-shallow)
[i586] MI2a:                   marked for install (shallow): python3-module-eventlet
[i586] MI2a:                    satisfying Depends: python3-module-dns >= 1.15.0
[i586] MI2a:                     maybe install (a direct target): python3-module-dns 1:2.2.0-alt2:p10+338224.100.3.1@1708886560
[i586] MI2a:                    target SELECTED: python3-module-dns 1:2.2.0-alt2:p10+338224.100.3.1@1708886560
[i586] MI2a:                    requesting to install python3-module-dns (unspec'd ver; inspect with Debug::pkgMark-shallow)
[i586] MI2a:                      marked for install (shallow): python3-module-dns
[i586] MI2a:                       satisfying Depends: python3(trio) < 0
[i586] MI2a:                        maybe install (a providing target): python3-module-trio 0.16.0-alt0.p10.1:p10+345373.3440.23.1@1713528050
[i586] MI2a:                       target SELECTED: python3-module-trio 0.16.0-alt0.p10.1:p10+345373.3440.23.1@1713528050
[i586] MI2a:                       requesting to install python3-module-trio (unspec'd ver; inspect with Debug::pkgMark-shallow)
[i586] MI2a:                         marked for install (shallow): python3-module-trio
[i586] MI2a:                          satisfying Depends: python3-module-async-generator  (NULL)
[i586] MI2a:                           maybe install (a providing target): python3-module-async_generator 1.10-alt3:p10+345373.3060.23.1@1713527957
[i586] MI2a:                          target SELECTED: python3-module-async_generator 1.10-alt3:p10+345373.3060.23.1@1713527957
[i586] MI2a:                          requesting to install python3-module-async_generator (unspec'd ver; inspect with Debug::pkgMark-shallow)
[i586] MI2a:                            marked for install (shallow): python3-module-async_generator
[i586] MI2a:                          satisfying Depends: python3-module-idna  (NULL)
[i586] MI2a:                           maybe install (a direct target): python3-module-idna 3.7-alt1:p10+358498.100.2.1@1728398204
[i586] MI2a:                          target SELECTED: python3-module-idna 3.7-alt1:p10+358498.100.2.1@1728398204
[i586] MI2a:                          requesting to install python3-module-idna (unspec'd ver; inspect with Debug::pkgMark-shallow)
[i586] MI2a:                            marked for install (shallow): python3-module-idna
[i586] MI2a:                          satisfying Depends: python3-module-outcome  (NULL)
[i586] MI2a:                           maybe install (a direct target): python3-module-outcome 1.0.0-alt1:sisyphus+275966.100.1.1@1624808278
[i586] MI2a:                          target SELECTED: python3-module-outcome 1.0.0-alt1:sisyphus+275966.100.1.1@1624808278
[i586] MI2a:                          requesting to install python3-module-outcome (unspec'd ver; inspect with Debug::pkgMark-shallow)
[i586] MI2a:                            marked for install (shallow): python3-module-outcome
[i586] MI2a:                          satisfying Depends: python3-module-sniffio  (NULL)
[i586] MI2a:                           maybe install (a direct target): python3-module-sniffio 1.0.0-alt2:sisyphus+276000.100.1.1@1624811306
[i586] MI2a:                          target SELECTED: python3-module-sniffio 1.0.0-alt2:sisyphus+276000.100.1.1@1624811306
[i586] MI2a:                          requesting to install python3-module-sniffio (unspec'd ver; inspect with Debug::pkgMark-shallow)
[i586] MI2a:                            marked for install (shallow): python3-module-sniffio
[i586] MI2a:                          satisfying Depends: python3-module-sortedcontainers  (NULL)
[i586] MI2a:                           maybe install (a direct target): python3-module-sortedcontainers 2.4.0-alt1:sisyphus+272042.100.1.1@1621262424
[i586] MI2a:                          target SELECTED: python3-module-sortedcontainers 2.4.0-alt1:sisyphus+272042.100.1.1@1621262424
[i586] MI2a:                          requesting to install python3-module-sortedcontainers (unspec'd ver; inspect with Debug::pkgMark-shallow)
[i586] MI2a:                            marked for install (shallow): python3-module-sortedcontainers
[i586] MI2a:                          satisfying Depends: python3(astor) < 0
[i586] MI2a:                           maybe install (a providing target): python3-module-astor 0.8.1-alt1.1:p10+345373.3100.23.1@1713527982
[i586] MI2a:                          target SELECTED: python3-module-astor 0.8.1-alt1.1:p10+345373.3100.23.1@1713527982
[i586] MI2a:                          requesting to install python3-module-astor (unspec'd ver; inspect with Debug::pkgMark-shallow)
[i586] MI2a:                            marked for install (shallow): python3-module-astor
[i586] MI2a:                          satisfying Depends: python3(cffi) < 0
[i586] MI2a:                           maybe install (a providing target): python3-module-cffi 1.14.5-alt2:sisyphus+279395.100.1.2@1626532823
[i586] MI2a:                          target SELECTED: python3-module-cffi 1.14.5-alt2:sisyphus+279395.100.1.2@1626532823
[i586] MI2a:                          requesting to install python3-module-cffi (unspec'd ver; inspect with Debug::pkgMark-shallow)
[i586] MI2a:                            marked for install (shallow): python3-module-cffi
[i586] MI2a:                             satisfying Depends: python3(pycparser) < 0
[i586] MI2a:                              maybe install (a providing target): python3-module-pycparser 2.20-alt2:sisyphus+278697.200.1.1@1626167452
[i586] MI2a:                             target SELECTED: python3-module-pycparser 2.20-alt2:sisyphus+278697.200.1.1@1626167452
[i586] MI2a:                             requesting to install python3-module-pycparser (unspec'd ver; inspect with Debug::pkgMark-shallow)
[i586] MI2a:                               marked for install (shallow): python3-module-pycparser
[i586] MI2a:                    satisfying Depends: python3-module-greenlet >= 0.3
[i586] MI2a:                     maybe install (a direct target): python3-module-greenlet 3.0.1-alt1:p10+348710.40.4.1@1717603449
[i586] MI2a:                    target SELECTED: python3-module-greenlet 3.0.1-alt1:p10+348710.40.4.1@1717603449
[i586] MI2a:                    requesting to install python3-module-greenlet (unspec'd ver; inspect with Debug::pkgMark-shallow)
[i586] MI2a:                      marked for install (shallow): python3-module-greenlet
[i586] MI2a:                    satisfying Depends: python3-module-six >= 1.10.0
[i586] MI2a:                     maybe install (a direct target): python3-module-six 1.16.0-alt1.p10:p10+340092.560.10.1@1707922977
[i586] MI2a:                    target SELECTED: python3-module-six 1.16.0-alt1.p10:p10+340092.560.10.1@1707922977
[i586] MI2a:                    requesting to install python3-module-six (unspec'd ver; inspect with Debug::pkgMark-shallow)
[i586] MI2a:                      marked for install (shallow): python3-module-six
[i586] MI2a:                    satisfying Depends: python3(OpenSSL) < 0
[i586] MI2a:                     maybe install (a providing target): python3-module-openssl 23.2.0-alt2:p10+340922.540.5.1@1708214779
[i586] MI2a:                    target SELECTED: python3-module-openssl 23.2.0-alt2:p10+340922.540.5.1@1708214779
[i586] MI2a:                    requesting to install python3-module-openssl (unspec'd ver; inspect with Debug::pkgMark-shallow)
[i586] MI2a:                      marked for install (shallow): python3-module-openssl
[i586] MI2a:                       satisfying Depends: python3-module-cryptography < 42
[i586] MI2a:                        maybe install (a direct target): python3-module-cryptography 41.0.7-alt0.p10.1:p10+336509.100.11.1@1706333947
[i586] MI2a:                       target SELECTED: python3-module-cryptography 41.0.7-alt0.p10.1:p10+336509.100.11.1@1706333947
[i586] MI2a:                       requesting to install python3-module-cryptography (unspec'd ver; inspect with Debug::pkgMark-shallow)
[i586] MI2a:                         marked for install (shallow): python3-module-cryptography
[i586] MI2a:                    satisfying Depends: python3(packaging.version) < 0
[i586] MI2a:                     maybe install (a providing target): python3-module-packaging 23.0-alt1:p10+325520.240.7.1@1691156260
[i586] MI2a:                    target SELECTED: python3-module-packaging 23.0-alt1:p10+325520.240.7.1@1691156260
[i586] MI2a:                    requesting to install python3-module-packaging (unspec'd ver; inspect with Debug::pkgMark-shallow)
[i586] MI2a:                      marked for install (shallow): python3-module-packaging
[i586] MI2a:                    satisfying Depends: python3(psycopg2) < 0
[i586] MI2a:                     maybe install (a providing target): python3-module-psycopg2 2.9.1-alt1:sisyphus+279721.1200.1.2@1626668974
[i586] MI2a:                    target SELECTED: python3-module-psycopg2 2.9.1-alt1:sisyphus+279721.1200.1.2@1626668974
[i586] MI2a:                    requesting to install python3-module-psycopg2 (unspec'd ver; inspect with Debug::pkgMark-shallow)
[i586] MI2a:                      marked for install (shallow): python3-module-psycopg2
[i586] MI2a:                       satisfying Depends: libpq.so.5 >= set:le0TVGKd0aLPs2Nto7Z1f8FxU3t37565zOwtmwlUaqXXOK7GBJfWweelDqOjusm7LJHI69oPyonkICCi7Hi78n4deWgL0M4UUqqo39mMeelHELjE5yi3qLNMnCZ060roZ0PZcpSmWdyMwKwETwhIPQUDbMdEicljufQaexcjaai71ZcKRhi1LXSb1
[i586] MI2a:                        maybe install (a providing target): libpq5 17.2-alt0.p10.1:p10+364671.100.4.2@1735384105
[i586] MI2a:                       target SELECTED: libpq5 17.2-alt0.p10.1:p10+364671.100.4.2@1735384105
[i586] MI2a:                       requesting to install libpq5 (unspec'd ver; inspect with Debug::pkgMark-shallow)
[i586] MI2a:                         marked for install (shallow): libpq5
[i586] MI2a:                 satisfying Depends: python3(gevent) < 0
[i586] MI2a:                  maybe install (a providing target): python3-module-gevent 23.9.1-alt1:p10+348710.100.4.1@1717603542
[i586] MI2a:                 target SELECTED: python3-module-gevent 23.9.1-alt1:p10+348710.100.4.1@1717603542
[i586] MI2a:                 requesting to install python3-module-gevent (unspec'd ver; inspect with Debug::pkgMark-shallow)
[i586] MI2a:                   marked for install (shallow): python3-module-gevent
[i586] MI2a:                    satisfying Depends: libcares.so.2 >= set:miZcqpIMz6qNacolQqvWHLweBKrWcLuhJfbHqi1
[i586] MI2a:                     maybe install (a providing target): libcares 1.26.0-alt1:p10+341112.100.1.1@1708403996
[i586] MI2a:                    target SELECTED: libcares 1.26.0-alt1:p10+341112.100.1.1@1708403996
[i586] MI2a:                    requesting to install libcares (unspec'd ver; inspect with Debug::pkgMark-shallow)
[i586] MI2a:                      marked for install (shallow): libcares
[i586] MI2a:                    satisfying Depends: libev.so.4 >= set:kePKyiZkErgk4oJyZD1pYiw8QUPkSlSo2oVWB4hEjYIlbFFasBbJvt9OeoFp4LMJ78Kc9UNyZkOb2wesW3ydCD7c9Y8WeSX5nuqixAjAvDr7Kfi0
[i586] MI2a:                     maybe install (a providing target): libev4 4.33-alt1:sisyphus+279015.100.1.1@1626353388
[i586] MI2a:                    target SELECTED: libev4 4.33-alt1:sisyphus+279015.100.1.1@1626353388
[i586] MI2a:                    requesting to install libev4 (unspec'd ver; inspect with Debug::pkgMark-shallow)
[i586] MI2a:                      marked for install (shallow): libev4
[i586] MI2a:                    satisfying Depends: libuv.so.1 >= set:mgRq8px87t4QhqZzhBUt9vZwZr1vmZnmzCV5IbCLaaZLWFkE9gdw6ZprPC1KJnsOvDMmsgo2Z9Ok94PMM6TDqSIad7nY65Cd1B98abNW7RWLiTl0xdTh57Mc6j9h1bEVXhWT93buejCqXts2
[i586] MI2a:                     maybe install (a providing target): libuv 1.49.2-alt0.p10.1:p10+371077.100.1.1@1737712685
[i586] MI2a:                    target SELECTED: libuv 1.49.2-alt0.p10.1:p10+371077.100.1.1@1737712685
[i586] MI2a:                    requesting to install libuv (unspec'd ver; inspect with Debug::pkgMark-shallow)
[i586] MI2a:                      marked for install (shallow): libuv
[i586] MI2a:                    satisfying Depends: python3(zope.event) < 0
[i586] MI2a:                     maybe install (a providing target): python3-module-zope.event 4.4-alt1:sisyphus+275885.100.1.1@1624802661
[i586] MI2a:                    target SELECTED: python3-module-zope.event 4.4-alt1:sisyphus+275885.100.1.1@1624802661
[i586] MI2a:                    requesting to install python3-module-zope.event (unspec'd ver; inspect with Debug::pkgMark-shallow)
[i586] MI2a:                      marked for install (shallow): python3-module-zope.event
[i586] MI2a:                       satisfying Depends: python3(zope) < 0
[i586] MI2a:                        maybe install (a providing target): python3-module-zope 3.3.0-alt8.5:sisyphus+275884.100.2.1@1624872816
[i586] MI2a:                       target SELECTED: python3-module-zope 3.3.0-alt8.5:sisyphus+275884.100.2.1@1624872816
[i586] MI2a:                       requesting to install python3-module-zope (unspec'd ver; inspect with Debug::pkgMark-shallow)
[i586] MI2a:                         marked for install (shallow): python3-module-zope
[i586] MI2a:                          satisfying Depends: python3-module-zope.interface  (NULL)
[i586] MI2a:                           maybe install (a direct target): python3-module-zope.interface 5.4.0-alt1:sisyphus+270674.200.1.1@1619413827
[i586] MI2a:                          target SELECTED: python3-module-zope.interface 5.4.0-alt1:sisyphus+270674.200.1.1@1619413827
[i586] MI2a:                          requesting to install python3-module-zope.interface (unspec'd ver; inspect with Debug::pkgMark-shallow)
[i586] MI2a:                            marked for install (shallow): python3-module-zope.interface
[i586] MI2a:                          satisfying Depends: python3-module-zc  (NULL)
[i586] MI2a:                           maybe install (a direct target): python3-module-zc 1.0.0-alt6.2:sisyphus+275883.100.2.1@1624872759
[i586] MI2a:                          target SELECTED: python3-module-zc 1.0.0-alt6.2:sisyphus+275883.100.2.1@1624872759
[i586] MI2a:                          requesting to install python3-module-zc (unspec'd ver; inspect with Debug::pkgMark-shallow)
[i586] MI2a:                            marked for install (shallow): python3-module-zc
[i586] MI2a:                             satisfying Depends: python3-module-z3c  (NULL)
[i586] MI2a:                              maybe install (a direct target): python3-module-z3c 3.0.0-alt3:sisyphus+275882.100.1.1@1624802400
[i586] MI2a:                             target SELECTED: python3-module-z3c 3.0.0-alt3:sisyphus+275882.100.1.1@1624802400
[i586] MI2a:                             requesting to install python3-module-z3c (unspec'd ver; inspect with Debug::pkgMark-shallow)
[i586] MI2a:                               marked for install (shallow): python3-module-z3c
[i586] MI2a:                 satisfying Depends: python3(paste.deploy) < 0
[i586] MI2a:                  maybe install (a providing target): python3-module-PasteDeploy 1:3.0.1-alt1:p10+341944.200.5.1@1710442255
[i586] MI2a:                 target SELECTED: python3-module-PasteDeploy 1:3.0.1-alt1:p10+341944.200.5.1@1710442255
[i586] MI2a:                 requesting to install python3-module-PasteDeploy (unspec'd ver; inspect with Debug::pkgMark-shallow)
[i586] MI2a:                   marked for install (shallow): python3-module-PasteDeploy
[i586] MI2a:                    satisfying Depends: python3(Paste) < 0
[i586] MI2a:                     maybe install (a providing target): python3-module-paste 3.5.0-alt1:sisyphus+278050.10.9.1@1625992949
[i586] MI2a:                    target SELECTED: python3-module-paste 3.5.0-alt1:sisyphus+278050.10.9.1@1625992949
[i586] MI2a:                    requesting to install python3-module-paste (unspec'd ver; inspect with Debug::pkgMark-shallow)
[i586] MI2a:                      marked for install (shallow): python3-module-paste
[i586] MI2a:                       satisfying Depends: python3(openid.consumer) < 0
[i586] MI2a:                        maybe install (a providing target): python3-module-openid 3.2.0-alt1:sisyphus+278049.100.2.1@1625998936
[i586] MI2a:                       target SELECTED: python3-module-openid 3.2.0-alt1:sisyphus+278049.100.2.1@1625998936
[i586] MI2a:                       requesting to install python3-module-openid (unspec'd ver; inspect with Debug::pkgMark-shallow)
[i586] MI2a:                         marked for install (shallow): python3-module-openid
[i586] MI2a:                    satisfying Depends: python3(paste.script.templates) < 0
[i586] MI2a:                     maybe install (a providing target): python3-module-PasteScript 1:2.0.2-alt2:sisyphus+272468.100.1.1@1621939313
[i586] MI2a:                    target SELECTED: python3-module-PasteScript 1:2.0.2-alt2:sisyphus+272468.100.1.1@1621939313
[i586] MI2a:                    requesting to install python3-module-PasteScript (unspec'd ver; inspect with Debug::pkgMark-shallow)
[i586] MI2a:                      marked for install (shallow): python3-module-PasteScript
[i586] MI2a:                       satisfying Depends: python3(Cheetah) < 0
[i586] MI2a:                        maybe install (a providing target): python3-module-Cheetah 3.2.3-alt3:sisyphus+279534.100.1.3@1626591150
[i586] MI2a:                       target SELECTED: python3-module-Cheetah 3.2.3-alt3:sisyphus+279534.100.1.3@1626591150
[i586] MI2a:                       requesting to install python3-module-Cheetah (unspec'd ver; inspect with Debug::pkgMark-shallow)
[i586] MI2a:                         marked for install (shallow): python3-module-Cheetah
[i586] MI2a:                 satisfying Depends: python3(tornado.httpserver) < 0
[i586] MI2a:                  maybe install (a providing target): python3-module-tornado 6.3.2-alt1:p10+307833.177640.205.1@1693946885
[i586] MI2a:                 target SELECTED: python3-module-tornado 6.3.2-alt1:p10+307833.177640.205.1@1693946885
[i586] MI2a:                 requesting to install python3-module-tornado (unspec'd ver; inspect with Debug::pkgMark-shallow)
[i586] MI2a:                   marked for install (shallow): python3-module-tornado
[i586] MI2a:                    satisfying Depends: python3-module-certifi  (NULL)
[i586] MI2a:                     maybe install (a direct target): python3-module-certifi 2024.8.30-alt1:p10+364853.100.3.1@1734696308
[i586] MI2a:                    target SELECTED: python3-module-certifi 2024.8.30-alt1:p10+364853.100.3.1@1734696308
[i586] MI2a:                    requesting to install python3-module-certifi (unspec'd ver; inspect with Debug::pkgMark-shallow)
[i586] MI2a:                      marked for install (shallow): python3-module-certifi
[i586] MI2a:                    satisfying Depends: python3(pycares) < 0
[i586] MI2a:                     maybe install (a providing target): python3-module-pycares 2.3.0-alt1.1:sisyphus+277970.100.1.1@1625928545
[i586] MI2a:                    target SELECTED: python3-module-pycares 2.3.0-alt1.1:sisyphus+277970.100.1.1@1625928545
[i586] MI2a:                    requesting to install python3-module-pycares (unspec'd ver; inspect with Debug::pkgMark-shallow)
[i586] MI2a:                      marked for install (shallow): python3-module-pycares
[i586] MI2a:                    satisfying Depends: python3(twisted.internet.abstract) < 0
[i586] MI2a:                     maybe install (a providing target): python3-module-twisted-core 20.3.0-alt2:sisyphus+265234.27700.49.1@1613763709
[i586] MI2a:                    target SELECTED: python3-module-twisted-core 20.3.0-alt2:sisyphus+265234.27700.49.1@1613763709
[i586] MI2a:                    requesting to install python3-module-twisted-core (unspec'd ver; inspect with Debug::pkgMark-shallow)
[i586] MI2a:                      marked for install (shallow): python3-module-twisted-core
[i586] MI2a:                       satisfying Depends: python3(appdirs) < 0
[i586] MI2a:                        maybe install (a providing target): python3-module-appdirs 1.4.4-alt1:sisyphus+267613.300.2.1@1620039159
[i586] MI2a:                       target SELECTED: python3-module-appdirs 1.4.4-alt1:sisyphus+267613.300.2.1@1620039159
[i586] MI2a:                       requesting to install python3-module-appdirs (unspec'd ver; inspect with Debug::pkgMark-shallow)
[i586] MI2a:                         marked for install (shallow): python3-module-appdirs
[i586] MI2a:                       satisfying Depends: python3(automat) < 0
[i586] MI2a:                        maybe install (a providing target): python3-module-automat 20.2.0-alt2:sisyphus+275898.100.1.2@1624826834
[i586] MI2a:                       target SELECTED: python3-module-automat 20.2.0-alt2:sisyphus+275898.100.1.2@1624826834
[i586] MI2a:                       requesting to install python3-module-automat (unspec'd ver; inspect with Debug::pkgMark-shallow)
[i586] MI2a:                         marked for install (shallow): python3-module-automat
[i586] MI2a:                       satisfying Depends: python3(gobject) < 0
[i586] MI2a:                        maybe install (a providing target): python3-module-pygobject 2.28.6-alt11:sisyphus+279128.100.1.1@1626380827
[i586] MI2a:                       target SELECTED: python3-module-pygobject 2.28.6-alt11:sisyphus+279128.100.1.1@1626380827
[i586] MI2a:                       requesting to install python3-module-pygobject (unspec'd ver; inspect with Debug::pkgMark-shallow)
[i586] MI2a:                         marked for install (shallow): python3-module-pygobject
[i586] MI2a:                       satisfying Depends: python3(hyperlink) < 0
[i586] MI2a:                        maybe install (a providing target): python3-module-hyperlink 19.0.0-alt1:sisyphus+275823.100.1.1@1624795895
[i586] MI2a:                       target SELECTED: python3-module-hyperlink 19.0.0-alt1:sisyphus+275823.100.1.1@1624795895
[i586] MI2a:                       requesting to install python3-module-hyperlink (unspec'd ver; inspect with Debug::pkgMark-shallow)
[i586] MI2a:                         marked for install (shallow): python3-module-hyperlink
[i586] MI2a:                       satisfying Depends: python3(serial) < 0
[i586] MI2a:                        maybe install (a providing target): python3-module-serial 3.5-alt1:sisyphus+275865.100.2.1@1624872757
[i586] MI2a:                       target SELECTED: python3-module-serial 3.5-alt1:sisyphus+275865.100.2.1@1624872757
[i586] MI2a:                       requesting to install python3-module-serial (unspec'd ver; inspect with Debug::pkgMark-shallow)
[i586] MI2a:                         marked for install (shallow): python3-module-serial
[i586] MI2a:                          satisfying Depends: python3(hid) < 0
[i586] MI2a:                           maybe install (a providing target): python3-module-cython-hidapi 0.9.0-alt0.1:sisyphus+279127.100.1.1@1626380802
[i586] MI2a:                          target SELECTED: python3-module-cython-hidapi 0.9.0-alt0.1:sisyphus+279127.100.1.1@1626380802
[i586] MI2a:                          requesting to install python3-module-cython-hidapi (unspec'd ver; inspect with Debug::pkgMark-shallow)
[i586] MI2a:                            marked for install (shallow): python3-module-cython-hidapi
[i586] MI2a:                             satisfying Depends: libhidapi-hidraw.so.0 >= set:idVzQSm8qwHaDxTA68McgKaPbJXhcb5TVG2
[i586] MI2a:                              maybe install (a providing target): libhidapi 0.10.1-alt1_2:sisyphus+279018.100.1.1@1626353615
[i586] MI2a:                             target SELECTED: libhidapi 0.10.1-alt1_2:sisyphus+279018.100.1.1@1626353615
[i586] MI2a:                             requesting to install libhidapi (unspec'd ver; inspect with Debug::pkgMark-shallow)
[i586] MI2a:                               marked for install (shallow): libhidapi
[i586] MI2a:                                satisfying Depends: libusb-1.0.so.0 >= set:kfVTRgwr9jFX2IAipIvys7MZqexJaD3JlmiYanqVHFDk94KrUVRt9vUBKana
[i586] MI2a:                                 maybe install (a providing target): libusb 1.0.26-alt2:p10+305622.100.3.1@1662994400
[i586] MI2a:                                target SELECTED: libusb 1.0.26-alt2:p10+305622.100.3.1@1662994400
[i586] MI2a:                                requesting to install libusb (unspec'd ver; inspect with Debug::pkgMark-shallow)
[i586] MI2a:                                  marked for install (shallow): libusb
[i586] MI2a:                       satisfying Depends: python3-module-twisted-logger = 20.3.0-alt2:sisyphus+265234.27700.49.1
[i586] MI2a:                        maybe install (a direct target): python3-module-twisted-logger 20.3.0-alt2:sisyphus+265234.27700.49.1@1613763709
[i586] MI2a:                       target SELECTED: python3-module-twisted-logger 20.3.0-alt2:sisyphus+265234.27700.49.1@1613763709
[i586] MI2a:                       requesting to install python3-module-twisted-logger (unspec'd ver; inspect with Debug::pkgMark-shallow)
[i586] MI2a:                         marked for install (shallow): python3-module-twisted-logger
[i586] MI2a:                          satisfying Depends: python3(constantly) < 0
[i586] MI2a:                           maybe install (a providing target): python3-module-constantly 15.1.0-alt5.qa1:sisyphus+275808.100.1.1@1624794561
[i586] MI2a:                          target SELECTED: python3-module-constantly 15.1.0-alt5.qa1:sisyphus+275808.100.1.1@1624794561
[i586] MI2a:                          requesting to install python3-module-constantly (unspec'd ver; inspect with Debug::pkgMark-shallow)
[i586] MI2a:                            marked for install (shallow): python3-module-constantly
[i586] MI2a:                       satisfying Depends: python3-module-twisted-words = 20.3.0-alt2:sisyphus+265234.27700.49.1
[i586] MI2a:                        maybe install (a direct target): python3-module-twisted-words 20.3.0-alt2:sisyphus+265234.27700.49.1@1613763709
[i586] MI2a:                       target SELECTED: python3-module-twisted-words 20.3.0-alt2:sisyphus+265234.27700.49.1@1613763709
[i586] MI2a:                       requesting to install python3-module-twisted-words (unspec'd ver; inspect with Debug::pkgMark-shallow)
[i586] MI2a:                         marked for install (shallow): python3-module-twisted-words
[i586] MI2a:                          satisfying Depends: python3(incremental) < 0
[i586] MI2a:                           maybe install (a providing target): python3-module-incremental 21.3.0-alt1:sisyphus+277407.100.1.1@1625535091
[i586] MI2a:                          target SELECTED: python3-module-incremental 21.3.0-alt1:sisyphus+277407.100.1.1@1625535091
[i586] MI2a:                          requesting to install python3-module-incremental (unspec'd ver; inspect with Debug::pkgMark-shallow)
[i586] MI2a:                            marked for install (shallow): python3-module-incremental
[i586] MI2a:                             satisfying Depends: python3(click) < 0
[i586] MI2a:                              maybe install (a providing target): python3-module-click 8.1.3-alt1:p10+317847.20130.110.1@1687546694
[i586] MI2a:                             target SELECTED: python3-module-click 8.1.3-alt1:p10+317847.20130.110.1@1687546694
[i586] MI2a:                             requesting to install python3-module-click (unspec'd ver; inspect with Debug::pkgMark-shallow)
[i586] MI2a:                               marked for install (shallow): python3-module-click
[i586] MI2a:                    satisfying Depends: python3(twisted.names.cache) < 0
[i586] MI2a:                     maybe install (a providing target): python3-module-twisted-names 20.3.0-alt2:sisyphus+265234.27700.49.1@1613763709
[i586] MI2a:                    target SELECTED: python3-module-twisted-names 20.3.0-alt2:sisyphus+265234.27700.49.1@1613763709
[i586] MI2a:                    requesting to install python3-module-twisted-names (unspec'd ver; inspect with Debug::pkgMark-shallow)
[i586] MI2a:                      marked for install (shallow): python3-module-twisted-names
[i586] MI2a:              satisfying Depends: python3(multidict) < 0
[i586] MI2a:               maybe install (a providing target): python3-module-multidict 6.0.4-alt1:p10+341764.5700.18.1@1711522612
[i586] MI2a:              target SELECTED: python3-module-multidict 6.0.4-alt1:p10+341764.5700.18.1@1711522612
[i586] MI2a:              requesting to install python3-module-multidict (unspec'd ver; inspect with Debug::pkgMark-shallow)
[i586] MI2a:                marked for install (shallow): python3-module-multidict
[i586] MI2a:              satisfying Depends: python3(yarl) < 0
[i586] MI2a:               maybe install (a providing target): python3-module-yarl 1.6.3-alt2:sisyphus+279721.100.1.1@1626647920
[i586] MI2a:              target SELECTED: python3-module-yarl 1.6.3-alt2:sisyphus+279721.100.1.1@1626647920
[i586] MI2a:              requesting to install python3-module-yarl (unspec'd ver; inspect with Debug::pkgMark-shallow)
[i586] MI2a:                marked for install (shallow): python3-module-yarl
[i586] MI2a:           satisfying Depends: python3(maxminddb) < 0
[i586] MI2a:            maybe install (a providing target): python3-module-MaxMindDB 2.0.3-alt1:sisyphus+265234.33300.49.1@1613767716
[i586] MI2a:           target SELECTED: python3-module-MaxMindDB 2.0.3-alt1:sisyphus+265234.33300.49.1@1613767716
[i586] MI2a:           requesting to install python3-module-MaxMindDB (unspec'd ver; inspect with Debug::pkgMark-shallow)
[i586] MI2a:             marked for install (shallow): python3-module-MaxMindDB
[i586] MI2a:              satisfying Depends: libmaxminddb.so.0 >= set:hezcr0MimdlJCtNa5
[i586] MI2a:               maybe install (a providing target): libmaxminddb 1.7.1-alt1:p10+330589.60.5.1@1697468590
[i586] MI2a:              target SELECTED: libmaxminddb 1.7.1-alt1:p10+330589.60.5.1@1697468590
[i586] MI2a:              requesting to install libmaxminddb (unspec'd ver; inspect with Debug::pkgMark-shallow)
[i586] MI2a:                marked for install (shallow): libmaxminddb
[i586] MI2a:           satisfying Depends: python3(requests) < 0
[i586] MI2a:            maybe install (a providing target): python3-module-requests 2.32.3-alt0.p10.1:p10+363330.140.9.1@1733142042
[i586] MI2a:           target SELECTED: python3-module-requests 2.32.3-alt0.p10.1:p10+363330.140.9.1@1733142042
[i586] MI2a:           requesting to install python3-module-requests (unspec'd ver; inspect with Debug::pkgMark-shallow)
[i586] MI2a:             marked for install (shallow): python3-module-requests
[i586] MI2a:              satisfying Depends: python3-module-charset-normalizer  (NULL)
[i586] MI2a:               maybe install (a direct target): python3-module-charset-normalizer 2.1.1-alt1:p10+320151.200.3.1@1685544956
[i586] MI2a:              target SELECTED: python3-module-charset-normalizer 2.1.1-alt1:p10+320151.200.3.1@1685544956
[i586] MI2a:              requesting to install python3-module-charset-normalizer (unspec'd ver; inspect with Debug::pkgMark-shallow)
[i586] MI2a:                marked for install (shallow): python3-module-charset-normalizer
[i586] MI2a:              satisfying Depends: python3-module-urllib3  (NULL)
[i586] MI2a:               maybe install (a direct target): python3-module-urllib3 2:1.26.17-alt0.p10.1:p10+336509.200.11.1@1706333977
[i586] MI2a:              target SELECTED: python3-module-urllib3 2:1.26.17-alt0.p10.1:p10+336509.200.11.1@1706333977
[i586] MI2a:              requesting to install python3-module-urllib3 (unspec'd ver; inspect with Debug::pkgMark-shallow)
[i586] MI2a:                marked for install (shallow): python3-module-urllib3
[i586] MI2a:                 satisfying Depends: python3-module-ndg-httpsclient  (NULL)
[i586] MI2a:                  maybe install (a direct target): python3-module-ndg-httpsclient 0.4.2-alt1.qa1:sisyphus+275837.100.1.2@1624808490
[i586] MI2a:                 target SELECTED: python3-module-ndg-httpsclient 0.4.2-alt1.qa1:sisyphus+275837.100.1.2@1624808490
[i586] MI2a:                 requesting to install python3-module-ndg-httpsclient (unspec'd ver; inspect with Debug::pkgMark-shallow)
[i586] MI2a:                   marked for install (shallow): python3-module-ndg-httpsclient
[i586] MI2a:                    satisfying Depends: python3-module-ndg = 0.4.2-alt1.qa1:sisyphus+275837.100.1.2
[i586] MI2a:                     maybe install (a direct target): python3-module-ndg 0.4.2-alt1.qa1:sisyphus+275837.100.1.2@1624808490
[i586] MI2a:                    target SELECTED: python3-module-ndg 0.4.2-alt1.qa1:sisyphus+275837.100.1.2@1624808490
[i586] MI2a:                    requesting to install python3-module-ndg (unspec'd ver; inspect with Debug::pkgMark-shallow)
[i586] MI2a:                      marked for install (shallow): python3-module-ndg
[i586] MI2a:                 satisfying Depends: python3(ntlm) < 0
[i586] MI2a:                  maybe install (a providing target): python3-module-ntlm 1.1.0-alt1.2:sisyphus+275841.100.1.1@1624797814
[i586] MI2a:                 target SELECTED: python3-module-ntlm 1.1.0-alt1.2:sisyphus+275841.100.1.1@1624797814
[i586] MI2a:                 requesting to install python3-module-ntlm (unspec'd ver; inspect with Debug::pkgMark-shallow)
[i586] MI2a:                   marked for install (shallow): python3-module-ntlm
[i586] MI2a:        satisfying Depends: python3(jinja2) < 0
[i586] MI2a:         maybe install (a providing target): python3-module-jinja2 3.0.1-alt1.p10.1:p10+341197.520.19.1@1710991350
[i586] MI2a:        target SELECTED: python3-module-jinja2 3.0.1-alt1.p10.1:p10+341197.520.19.1@1710991350
[i586] MI2a:        requesting to install python3-module-jinja2 (unspec'd ver; inspect with Debug::pkgMark-shallow)
[i586] MI2a:          marked for install (shallow): python3-module-jinja2
[i586] MI2a:           satisfying Depends: python3(markupsafe) < 0
[i586] MI2a:            maybe install (a providing target): python3-module-markupsafe 1:2.1.2-alt1:p10+317847.21460.110.1@1687547612
[i586] MI2a:           target SELECTED: python3-module-markupsafe 1:2.1.2-alt1:p10+317847.21460.110.1@1687547612
[i586] MI2a:           requesting to install python3-module-markupsafe (unspec'd ver; inspect with Debug::pkgMark-shallow)
[i586] MI2a:             marked for install (shallow): python3-module-markupsafe
[i586] MI2a:        satisfying Depends: python3(pytz) < 0
[i586] MI2a:         maybe install (a providing target): python3-module-pytz 1:2021.1-alt1:sisyphus+267903.400.1.1@1615896636
[i586] MI2a:        target SELECTED: python3-module-pytz 1:2021.1-alt1:sisyphus+267903.400.1.1@1615896636
[i586] MI2a:        requesting to install python3-module-pytz (unspec'd ver; inspect with Debug::pkgMark-shallow)
[i586] MI2a:          marked for install (shallow): python3-module-pytz
[i586] MI2a:        satisfying Depends: python3(sqlparse) < 0
[i586] MI2a:         maybe install (a providing target): python3-module-sqlparse 0.5.0-alt1:p10+350774.100.1.1@1718029413
[i586] MI2a:        target SELECTED: python3-module-sqlparse 0.5.0-alt1:p10+350774.100.1.1@1718029413
[i586] MI2a:        requesting to install python3-module-sqlparse (unspec'd ver; inspect with Debug::pkgMark-shallow)
[i586] MI2a:          marked for install (shallow): python3-module-sqlparse
[i586] MI2a:        satisfying Depends: python3(yaml) < 0
[i586] MI2a:         maybe install (a providing target): python3-module-yaml 6.0.1-alt1.1:p10+340092.554.16.1@1709018094
[i586] MI2a:        target SELECTED: python3-module-yaml 6.0.1-alt1.1:p10+340092.554.16.1@1709018094
[i586] MI2a:        requesting to install python3-module-yaml (unspec'd ver; inspect with Debug::pkgMark-shallow)
[i586] MI2a:          marked for install (shallow): python3-module-yaml
[i586] MI2a:           satisfying Depends: libyaml-0.so.2 >= set:jeDuSUAbEuz1xrY3muBZ56F9Jbi2W3kR6iB5oRQxGfDDGyazcKxJ4shcJWS8IVb7
[i586] MI2a:            maybe install (a providing target): libyaml2 0.2.5-alt1:sisyphus+278391.100.1.1@1626094932
[i586] MI2a:           target SELECTED: libyaml2 0.2.5-alt1:sisyphus+278391.100.1.1@1626094932
[i586] MI2a:           requesting to install libyaml2 (unspec'd ver; inspect with Debug::pkgMark-shallow)
[i586] MI2a:             marked for install (shallow): libyaml2
[i586] MI2a:  satisfying Depends: python3(setuptools.command.build) < 0
[i586] MI2a:  satisfying Depends: python3(typing_extensions) < 0
[i586] MI2a:   maybe install (a providing target): python3-module-typing_extensions 4.5.0-alt0.p10.1:p10+345373.1332.24.1@1713534744
[i586] MI2a:  target SELECTED: python3-module-typing_extensions 4.5.0-alt0.p10.1:p10+345373.1332.24.1@1713534744
[i586] MI2a:  requesting to install python3-module-typing_extensions (unspec'd ver; inspect with Debug::pkgMark-shallow)
[i586] MI2a:    marked for install (shallow): python3-module-typing_extensions
[i586] MI2a: marked for install (shallow): python3-module-setuptools_rust
[i586] MI2a:  satisfying Depends: python3(setuptools.command.build) < 0
[i586] Starting
[i586] Starting 2
[i586] Investigating python3-module-setuptools_rust 1.6.0-alt1:p10+376208.517.10.1@1740730780
[i586]  Package python3-module-setuptools_rust has a broken Depends: python3(setuptools.command.build) < 0
[i586] Done
[i586] rpm-build-pyproject is already the newest version.
[i586] Selecting filesystem for '/proc'
[i586] filesystem is already the newest version.
[i586] Selecting bzlib-devel for 'pkgconfig(bzip2)'
[i586] Selecting python3-module-setuptools_rust for 'python3-module-setuptools-rust'
[i586] Selecting python3-module-setuptools_rust for 'python3-module-setuptools-rust'
[i586] Some packages could not be installed. This may mean that you have
[i586] requested an impossible situation or if you are using the unstable
[i586] distribution that some required packages have not yet been created
[i586] or been moved out of Incoming.
[i586] The following information may help to resolve the situation:
[i586] 
[i586] The following packages have unmet dependencies:
[i586]   python3-module-setuptools_rust: Depends: python3(setuptools.command.build) (< 0) but it is not installable
[i586] E: Broken packages
[i586] hsh-install: Failed to calculate package file list.
[i586] hsh-install: Failed to generate package file list.
2025-Feb-28 08:19:58 :: [i586] python3-module-maturin-1.5.1-alt1.src.rpm: remote: cannot build src.rpm
2025-Feb-28 08:19:58 :: [i586] #520 python3-module-maturin-1.5.1-alt1.src.rpm: build FAILED
2025-Feb-28 08:19:58 :: [i586] requesting cancellation of task processing
[x86_64] <13>Feb 28 08:19:56 rpmi: libgdbm-1.8.3-alt10 sisyphus+278100.1600.1.1 1626058413 installed
[x86_64] <13>Feb 28 08:19:56 rpmi: libexpat-2.5.0-alt1 p10+324220.100.1.1 1688465137 installed
[x86_64] <13>Feb 28 08:19:56 rpmi: libp11-kit-0.24.1-alt1 p10+305061.100.3.1 1660573397 installed
[x86_64] <13>Feb 28 08:19:56 rpmi: libtasn1-4.20.0-alt1 p10+374934.100.1.1 1739780092 installed
[x86_64] <13>Feb 28 08:19:56 rpmi: rpm-macros-alternatives-0.5.2-alt1 p10+309129.100.2.1 1668066636 installed
[x86_64] <13>Feb 28 08:19:56 rpmi: alternatives-0.5.2-alt1 p10+309129.100.2.1 1668066636 installed
[x86_64] <13>Feb 28 08:19:56 rpmi: ca-certificates-2024.12.10-alt1 p10+372243.20.2.1 1738332466 installed
[x86_64] <13>Feb 28 08:19:56 rpmi: ca-trust-0.1.6-alt1 p10+344774.100.1.1 1712685728 installed
[x86_64] <13>Feb 28 08:19:56 rpmi: p11-kit-trust-0.24.1-alt1 p10+305061.100.3.1 1660573397 installed
[x86_64] <13>Feb 28 08:19:57 rpmi: libcrypto1.1-1.1.1w-alt0.p10.2 p10+364728.100.2.1 1734595128 installed
[x86_64] <13>Feb 28 08:19:57 rpmi: libssl1.1-1.1.1w-alt0.p10.2 p10+364728.100.2.1 1734595128 installed
[x86_64] <13>Feb 28 08:19:57 rpmi: python3-3.9.20-alt1 p10+357900.100.1.1 1726758230 installed
[x86_64] <13>Feb 28 08:19:57 rpmi: python3-base-3.9.20-alt1 p10+357900.100.1.1 1726758230 installed
[x86_64] <13>Feb 28 08:19:57 rpmi: python3-module-pyproject-installer-0.5.2-alt1 p10+325520.300.7.1 1691156288 installed
[x86_64] <13>Feb 28 08:19:57 rpmi: rpm-macros-pyproject-0.0.4-alt1 p10+325520.400.7.1 1691156303 installed
[x86_64] <13>Feb 28 08:19:57 rpmi: tests-for-installed-python3-pkgs-0.1.22-alt1 p10+325520.200.7.1 1691156214 installed
[x86_64] <13>Feb 28 08:19:57 rpmi: rpm-build-python3-0.1.22-alt1 p10+325520.200.7.1 1691156214 installed
[x86_64] <13>Feb 28 08:19:57 rpmi: rpm-build-pyproject-0.0.4-alt1 p10+325520.400.7.1 1691156303 installed
[x86_64] Reading Package Lists...
[x86_64] Building Dependency Tree...
[x86_64] MI2a: marked for install (shallow): rust-cargo
[x86_64] MI2a:  satisfying Depends: libcurl.so.4()(64bit) >= set:kfYXmqZlFgJ4IJYBZ6pyZgfWb4RiPZkeS62BeP5r4vGGy8sViS0Ezc
[x86_64] MI2a:   maybe install (a providing target): libcurl 8.12.0-alt1:p10+374306.100.2.1@1739647005
[x86_64] MI2a:  target SELECTED: libcurl 8.12.0-alt1:p10+374306.100.2.1@1739647005
[x86_64] MI2a:  requesting to install libcurl (unspec'd ver; inspect with Debug::pkgMark-shallow)
[x86_64] MI2a:    marked for install (shallow): libcurl
[x86_64] MI2a:     satisfying Depends: libbrotlidec.so.1()(64bit) >= set:heroOawuYbTK8
[x86_64] MI2a:      maybe install (a providing target): libbrotlidec 1.0.9-alt2:sisyphus+278430.100.1.2@1626213212
[x86_64] MI2a:     target SELECTED: libbrotlidec 1.0.9-alt2:sisyphus+278430.100.1.2@1626213212
[x86_64] MI2a:     requesting to install libbrotlidec (unspec'd ver; inspect with Debug::pkgMark-shallow)
[x86_64] MI2a:       marked for install (shallow): libbrotlidec
[x86_64] MI2a:        satisfying Depends: libbrotlicommon = 1.0.9-alt2:sisyphus+278430.100.1.2
[x86_64] MI2a:         maybe install (a direct target): libbrotlicommon 1.0.9-alt2:sisyphus+278430.100.1.2@1626213212
[x86_64] MI2a:        target SELECTED: libbrotlicommon 1.0.9-alt2:sisyphus+278430.100.1.2@1626213212
[x86_64] MI2a:        requesting to install libbrotlicommon (unspec'd ver; inspect with Debug::pkgMark-shallow)
[x86_64] MI2a:          marked for install (shallow): libbrotlicommon
[x86_64] MI2a:     satisfying Depends: libgsasl.so.7()(64bit) >= set:jfNMMjxjlLiKUyEAZvcPMCX3
[x86_64] MI2a:      maybe install (a providing target): libgsasl 1.8.0-alt3:sisyphus+275307.100.1.2@1624478543
[x86_64] MI2a:     target SELECTED: libgsasl 1.8.0-alt3:sisyphus+275307.100.1.2@1624478543
[x86_64] MI2a:     requesting to install libgsasl (unspec'd ver; inspect with Debug::pkgMark-shallow)
[x86_64] MI2a:       marked for install (shallow): libgsasl
[x86_64] MI2a:        satisfying Depends: libgssapi_krb5.so.2()(64bit) >= set:lgUI5pnpbNsJUr9F0ECN6LIbSVz7j3UNHAXVG0YYmbjijMyN
[x86_64] MI2a:         maybe install (a providing target): libkrb5 1.19.4-alt4:p10+351854.100.3.1@1733167911
[x86_64] MI2a:        target SELECTED: libkrb5 1.19.4-alt4:p10+351854.100.3.1@1733167911
[x86_64] MI2a:        requesting to install libkrb5 (unspec'd ver; inspect with Debug::pkgMark-shallow)
[x86_64] MI2a:          marked for install (shallow): libkrb5
[x86_64] MI2a:           satisfying Depends: libcom_err.so.2()(64bit) >= set:ifPl8xIvqFmQe8JQo3
[x86_64] MI2a:            maybe install (a providing target): libcom_err 1.46.2.0.16.f114-alt1:sisyphus+278100.1000.1.1@1626056805
[x86_64] MI2a:           target SELECTED: libcom_err 1.46.2.0.16.f114-alt1:sisyphus+278100.1000.1.1@1626056805
[x86_64] MI2a:           requesting to install libcom_err (unspec'd ver; inspect with Debug::pkgMark-shallow)
[x86_64] MI2a:             marked for install (shallow): libcom_err
[x86_64] MI2a:           satisfying Depends: libkeyutils.so.1()(64bit) >= set:jfWn12U6KThBXgruPLZ68yYZt2
[x86_64] MI2a:            maybe install (a providing target): libkeyutils 1.6.3-alt1:sisyphus+266061.100.1.1@1612919566
[x86_64] MI2a:           target SELECTED: libkeyutils 1.6.3-alt1:sisyphus+266061.100.1.1@1612919566
[x86_64] MI2a:           requesting to install libkeyutils (unspec'd ver; inspect with Debug::pkgMark-shallow)
[x86_64] MI2a:             marked for install (shallow): libkeyutils
[x86_64] MI2a:           satisfying Depends: liblmdb.so.0()(64bit) >= set:kfalKd4xYAkaAG2MqeH0wB2F4kTaBEo1iv0KFpxVmqzFIV6HJ0
[x86_64] MI2a:            maybe install (a providing target): liblmdb 0.9.23-alt1:sisyphus+275369.100.1.2@1624493869
[x86_64] MI2a:           target SELECTED: liblmdb 0.9.23-alt1:sisyphus+275369.100.1.2@1624493869
[x86_64] MI2a:           requesting to install liblmdb (unspec'd ver; inspect with Debug::pkgMark-shallow)
[x86_64] MI2a:             marked for install (shallow): liblmdb
[x86_64] MI2a:           satisfying Depends: libverto.so.1()(64bit) >= set:jfI5MRvI6tmNn0zwQdb68Gk0
[x86_64] MI2a:            maybe install (a providing target): libverto 0.3.2-alt1_1:sisyphus+279289.100.1.3@1626493868
[x86_64] MI2a:           target SELECTED: libverto 0.3.2-alt1_1:sisyphus+279289.100.1.3@1626493868
[x86_64] MI2a:           requesting to install libverto (unspec'd ver; inspect with Debug::pkgMark-shallow)
[x86_64] MI2a:             marked for install (shallow): libverto
[x86_64] MI2a:        satisfying Depends: libidn.so.12()(64bit) >= set:kiBXars6
[x86_64] MI2a:         maybe install (a providing target): libidn 1.37-alt1:sisyphus+278604.100.1.1@1626095122
[x86_64] MI2a:        target SELECTED: libidn 1.37-alt1:sisyphus+278604.100.1.1@1626095122
[x86_64] MI2a:        requesting to install libidn (unspec'd ver; inspect with Debug::pkgMark-shallow)
[x86_64] MI2a:          marked for install (shallow): libidn
[x86_64] MI2a:        satisfying Depends: libntlm.so.0()(64bit) >= set:hfknJM1
[x86_64] MI2a:         maybe install (a providing target): libntlm 1.5-alt1:sisyphus+278100.3300.1.1@1626058899
[x86_64] MI2a:        target SELECTED: libntlm 1.5-alt1:sisyphus+278100.3300.1.1@1626058899
[x86_64] MI2a:        requesting to install libntlm (unspec'd ver; inspect with Debug::pkgMark-shallow)
[x86_64] MI2a:          marked for install (shallow): libntlm
[x86_64] MI2a:     satisfying Depends: libidn2.so.0()(64bit) >= set:ifA2ZHZ1X9N2
[x86_64] MI2a:      maybe install (a providing target): libidn2 2.3.2-alt1:p10+281239.100.3.1@1627673251
[x86_64] MI2a:     target SELECTED: libidn2 2.3.2-alt1:p10+281239.100.3.1@1627673251
[x86_64] MI2a:     requesting to install libidn2 (unspec'd ver; inspect with Debug::pkgMark-shallow)
[x86_64] MI2a:       marked for install (shallow): libidn2
[x86_64] MI2a:     satisfying Depends: liblber-2.4.so.2()(64bit) >= set:liRJP9c9FzZ8q5FR
[x86_64] MI2a:      maybe install (a providing target): libldap 2.4.59-alt1.p10.3:p10+374530.200.4.1@1739797003
[x86_64] MI2a:     target SELECTED: libldap 2.4.59-alt1.p10.3:p10+374530.200.4.1@1739797003
[x86_64] MI2a:     requesting to install libldap (unspec'd ver; inspect with Debug::pkgMark-shallow)
[x86_64] MI2a:       marked for install (shallow): libldap
[x86_64] MI2a:        satisfying Depends: libsasl2.so.3()(64bit) >= set:lhKAh7QjCM36Vnr6MdFxFf8LIcZsS1kl0wH7Iyp
[x86_64] MI2a:         maybe install (a providing target): libsasl2-3 2.1.28-alt2:p10+350745.100.3.1@1719827030
[x86_64] MI2a:        target SELECTED: libsasl2-3 2.1.28-alt2:p10+350745.100.3.1@1719827030
[x86_64] MI2a:        requesting to install libsasl2-3 (unspec'd ver; inspect with Debug::pkgMark-shallow)
[x86_64] MI2a:          marked for install (shallow): libsasl2-3
[x86_64] MI2a:        satisfying Depends: openldap-common = 2.4.59-alt1.p10.3:p10+374530.200.4.1
[x86_64] MI2a:         maybe install (a direct target): openldap-common 2.4.59-alt1.p10.3:p10+374530.200.4.1@1739797003
[x86_64] MI2a:        target SELECTED: openldap-common 2.4.59-alt1.p10.3:p10+374530.200.4.1@1739797003
[x86_64] MI2a:        requesting to install openldap-common (unspec'd ver; inspect with Debug::pkgMark-shallow)
[x86_64] MI2a:          marked for install (shallow): openldap-common
[x86_64] MI2a:     satisfying Depends: libnghttp2.so.14()(64bit) >= set:lfKRgJ8UKsv8mdZbLF8UZpCjqzxjS4uXpINNNC9lNPxPEJZqw9IfpEB51C0QFeHEVpGv95xGtf4CksgxNiZbJO6CvE4RCQxaKbdf6IG29SZkOus
[x86_64] MI2a:      maybe install (a providing target): libnghttp2 1.61.0-alt1:p10+344447.40.1.1@1712304236
[x86_64] MI2a:     target SELECTED: libnghttp2 1.61.0-alt1:p10+344447.40.1.1@1712304236
[x86_64] MI2a:     requesting to install libnghttp2 (unspec'd ver; inspect with Debug::pkgMark-shallow)
[x86_64] MI2a:       marked for install (shallow): libnghttp2
[x86_64] MI2a:     satisfying Depends: libpsl.so.5()(64bit) >= set:ifo8sG4NYozTZj0
[x86_64] MI2a:      maybe install (a providing target): libpsl 0.21.5-alt1:p10+345385.100.1.1@1713430418
[x86_64] MI2a:     target SELECTED: libpsl 0.21.5-alt1:p10+345385.100.1.1@1713430418
[x86_64] MI2a:     requesting to install libpsl (unspec'd ver; inspect with Debug::pkgMark-shallow)
[x86_64] MI2a:       marked for install (shallow): libpsl
[x86_64] MI2a:        satisfying Depends: publicsuffix-list-dafsa  (NULL)
[x86_64] MI2a:         maybe install (a direct target): publicsuffix-list-dafsa 20250131-alt1:p10+373300.100.2.1@1739435494
[x86_64] MI2a:        target SELECTED: publicsuffix-list-dafsa 20250131-alt1:p10+373300.100.2.1@1739435494
[x86_64] MI2a:        requesting to install publicsuffix-list-dafsa (unspec'd ver; inspect with Debug::pkgMark-shallow)
[x86_64] MI2a:          marked for install (shallow): publicsuffix-list-dafsa
[x86_64] MI2a:     satisfying Depends: libssh2.so.1()(64bit) >= set:lfFi2ZJdCZnNQqC7FxZHyYYVCMxI4j1759y3AVs98cSjdm6BZrMSTPA4BKYeWR49vSI0JGO8E3yldZ5j77X8z3joPyGVoiqovNAwPc5RvPDTKNRR6pS6H80qi1nxAdsxOdZERlIwndLqIyuVb
[x86_64] MI2a:      maybe install (a providing target): libssh2 1.11.0-alt2:p10+339351.200.2.1@1706598963
[x86_64] MI2a:     target SELECTED: libssh2 1.11.0-alt2:p10+339351.200.2.1@1706598963
[x86_64] MI2a:     requesting to install libssh2 (unspec'd ver; inspect with Debug::pkgMark-shallow)
[x86_64] MI2a:       marked for install (shallow): libssh2
[x86_64] MI2a:  satisfying Depends: rust = 1:1.80.0-alt0.p10.2:p10+367423.100.1.1
[x86_64] MI2a:   maybe install (a direct target): rust 1:1.80.0-alt0.p10.2:p10+367423.100.1.1@1735506671
[x86_64] MI2a:  target SELECTED: rust 1:1.80.0-alt0.p10.2:p10+367423.100.1.1@1735506671
[x86_64] MI2a:  requesting to install rust (unspec'd ver; inspect with Debug::pkgMark-shallow)
[x86_64] MI2a:    marked for install (shallow): rust
[x86_64] MI2a:     satisfying Depends: libLLVM-17.so()(64bit) >= set:tjQZ0jK42SA0WkNgKR7o4w0WfSYRNgIpzPp05U8NQ6jPjSz5WmyYQOyQpdwbTfgt4OBwXXQTFe2gRjhKNnmuXtEQrwKZaAMqYzzTybtFUDMUNjMCwvMSnyqlma69KcbIU69bbyKmln0BCpdQN6g9SI5lgJ3yDy4Q01QnqZqZzx65sSehK5DNkKo5N3Kc6fWZkaFvoXZnI4AfDxDYvI9KAgaBE8DA5yra0NF1OXE0G7IZwoaZtDxgK0a6xhdxJG4VuGEF1en3Rx4Ifp1TwxZsg65Og1Mqylxa2c9VjZuJM21BhzNephgFa9i9NsqilcR1M6baZHQqkZgsGDUmRgUdEpRjplx1OnJHxABAENW4eQ5jBSPKB5cdShbMVBaLmQh9ey34i3V95zqVeET5TOjV9I0pDjfxzHAYSeIXdJJhgOuoZcFZHPVZiUpvFvOpto2zpofSa64QINRoW4uegv3ymqJVWSiOmU7UmRVQswzswxApADHyF61I8Z0vrJ4wtXFhKX5ZwQXZ1k0CCE41OY7xTehAi61AhI0RADc08ltDtZb2ZD10JKl4JbUjbqafKWhbKr81VvA4lPpgYLhTLsGcNRgGMqd4r2v0bKLUSDo5lLXKo28FuUVZcSKKZ5hzJGRbNcQjf92DXp4eLkPenoOPT25cpwvoPLDXFWHTzF3TZmWpIZpwIi46VFmnKTT92Hki3xbh8ZpTQBFhOcIkLSDPeo2QzBEJnOMijVp2puB00NZlrL7IEgIvxggd9g6ScUXPoYHgg0zHn0xh90J3F5lmjsEkgqplKSbeTQiobJt32duGiftqgLfrM3h4T3B4Vd3hZiKP5NQGuGWUBqZoglGTNk7LnD3jozRxZqfP4y7LUKI3FMWabCvgsd8svrWa10t1twIHyeJTg0K9beg5Rnir9ueJ1EZzZwOE7AkZ1kvj2dPLvDM2U9mGaSOlkdOYHASJGe5Wm34XlfoUDNjd0KyjTb97gLtHQcbNZ7JE87nMUWDXVO0sYZ7Ms7GmRiFHdL5SFUo9rBjHKfkMlcrOiZ0Ojl2M8AZ0gyZvavHe1OZiwFkOfSayAxdPPTjqM8dOATvTc6kLkyExNiJTdpz3jPJ0gQlM1wuFoO5fcS5aUhJSJouxERwVdfpMI2a:      maybe install (a providing target): llvm17.0-libs 17.0.6-alt2.p10.1:p10+351536.400.5.1@1719905448
[x86_64] MI2a:     target SELECTED: llvm17.0-libs 17.0.6-alt2.p10.1:p10+351536.400.5.1@1719905448
[x86_64] MI2a:     requesting to install llvm17.0-libs (unspec'd ver; inspect with Debug::pkgMark-shallow)
[x86_64] MI2a:       marked for install (shallow): llvm17.0-libs
[x86_64] MI2a:        satisfying Depends: libedit.so.3()(64bit) >= set:lhWGuYsENcm3e5dP3PTKehhHZ5VJpv13
[x86_64] MI2a:         maybe install (a providing target): libedit3 3.1.20191231-alt1:sisyphus+278505.100.1.1@1626106374
[x86_64] MI2a:        target SELECTED: libedit3 3.1.20191231-alt1:sisyphus+278505.100.1.1@1626106374
[x86_64] MI2a:        requesting to install libedit3 (unspec'd ver; inspect with Debug::pkgMark-shallow)
[x86_64] MI2a:          marked for install (shallow): libedit3
[x86_64] MI2a:        satisfying Depends: llvm17.0-gold = 17.0.6-alt2.p10.1:p10+351536.400.5.1
[x86_64] MI2a:         maybe install (a direct target): llvm17.0-gold 17.0.6-alt2.p10.1:p10+351536.400.5.1@1719905448
[x86_64] MI2a:        target SELECTED: llvm17.0-gold 17.0.6-alt2.p10.1:p10+351536.400.5.1@1719905448
[x86_64] MI2a:        requesting to install llvm17.0-gold (unspec'd ver; inspect with Debug::pkgMark-shallow)
[x86_64] MI2a:          marked for install (shallow): llvm17.0-gold
[x86_64] MI2a:        satisfying Depends: llvm17.0-polly = 17.0.6-alt2.p10.1:p10+351536.400.5.1
[x86_64] MI2a:         maybe install (a direct target): llvm17.0-polly 17.0.6-alt2.p10.1:p10+351536.400.5.1@1719905448
[x86_64] MI2a:        target SELECTED: llvm17.0-polly 17.0.6-alt2.p10.1:p10+351536.400.5.1@1719905448
[x86_64] MI2a:        requesting to install llvm17.0-polly (unspec'd ver; inspect with Debug::pkgMark-shallow)
[x86_64] MI2a:          marked for install (shallow): llvm17.0-polly
[x86_64] MI2a:           satisfying Depends: llvm17.0-filesystem = 17.0.6-alt2.p10.1:p10+351536.400.5.1
[x86_64] MI2a:            maybe install (a direct target): llvm17.0-filesystem 17.0.6-alt2.p10.1:p10+351536.400.5.1@1719905448
[x86_64] MI2a:           target SELECTED: llvm17.0-filesystem 17.0.6-alt2.p10.1:p10+351536.400.5.1@1719905448
[x86_64] MI2a:           requesting to install llvm17.0-filesystem (unspec'd ver; inspect with Debug::pkgMark-shallow)
[x86_64] MI2a:             marked for install (shallow): llvm17.0-filesystem
[x86_64] MI2a: marked for install (shallow): python3-module-setuptools
[x86_64] MI2a:  satisfying Depends: python3-dev  (NULL)
[x86_64] MI2a:   maybe install (a direct target): python3-dev 3.9.20-alt1:p10+357900.100.1.1@1726758230
[x86_64] MI2a:  target SELECTED: python3-dev 3.9.20-alt1:p10+357900.100.1.1@1726758230
[x86_64] MI2a:  requesting to install python3-dev (unspec'd ver; inspect with Debug::pkgMark-shallow)
[x86_64] MI2a:    marked for install (shallow): python3-dev
[x86_64] MI2a:     satisfying Depends: libncurses-devel  (NULL)
[x86_64] MI2a:      maybe install (a direct target): libncurses-devel 6.3.20220618-alt1:p10+319472.100.4.1@1685092691
[x86_64] MI2a:     target SELECTED: libncurses-devel 6.3.20220618-alt1:p10+319472.100.4.1@1685092691
[x86_64] MI2a:     requesting to install libncurses-devel (unspec'd ver; inspect with Debug::pkgMark-shallow)
[x86_64] MI2a:       marked for install (shallow): libncurses-devel
[x86_64] MI2a:        satisfying Depends: libtinfo-devel = 6.3.20220618-alt1:p10+319472.100.4.1
[x86_64] MI2a:         maybe install (a direct target): libtinfo-devel 6.3.20220618-alt1:p10+319472.100.4.1@1685092691
[x86_64] MI2a:        target SELECTED: libtinfo-devel 6.3.20220618-alt1:p10+319472.100.4.1@1685092691
[x86_64] MI2a:        requesting to install libtinfo-devel (unspec'd ver; inspect with Debug::pkgMark-shallow)
[x86_64] MI2a:          marked for install (shallow): libtinfo-devel
[x86_64] MI2a:        satisfying Depends: libncurses = 6.3.20220618-alt1:p10+319472.100.4.1
[x86_64] MI2a:         maybe install (a direct target): libncurses 6.3.20220618-alt1:p10+319472.100.4.1@1685092691
[x86_64] MI2a:        target SELECTED: libncurses 6.3.20220618-alt1:p10+319472.100.4.1@1685092691
[x86_64] MI2a:        requesting to install libncurses (unspec'd ver; inspect with Debug::pkgMark-shallow)
[x86_64] MI2a:          marked for install (shallow): libncurses
[x86_64] MI2a:     satisfying Depends: libpython3 = 3.9.20-alt1:p10+357900.100.1.1
[x86_64] MI2a:      maybe install (a direct target): libpython3 3.9.20-alt1:p10+357900.100.1.1@1726758230
[x86_64] MI2a:     target SELECTED: libpython3 3.9.20-alt1:p10+357900.100.1.1@1726758230
[x86_64] MI2a:     requesting to install libpython3 (unspec'd ver; inspect with Debug::pkgMark-shallow)
[x86_64] MI2a:       marked for install (shallow): libpython3
[x86_64] MI2a:  satisfying Depends: python3-module-pkg_resources = 1:57.4.0-alt1.p10.1:p10+362900.200.1.1
[x86_64] MI2a:   maybe install (a direct target): python3-module-pkg_resources 1:57.4.0-alt1.p10.1:p10+362900.200.1.1@1732008742
[x86_64] MI2a:  target SELECTED: python3-module-pkg_resources 1:57.4.0-alt1.p10.1:p10+362900.200.1.1@1732008742
[x86_64] MI2a:  requesting to install python3-module-pkg_resources (unspec'd ver; inspect with Debug::pkgMark-shallow)
[x86_64] MI2a:    marked for install (shallow): python3-module-pkg_resources
[x86_64] MI2a: marked for install (shallow): python3-module-setuptools_rust
[x86_64] MI2a:  satisfying Depends: python3(semantic_version) < 0
[x86_64] MI2a:   maybe install (a providing target): python3-module-semantic_version 2.8.5-alt4:sisyphus+278950.100.1.1@1626298359
[x86_64] MI2a:  target SELECTED: python3-module-semantic_version 2.8.5-alt4:sisyphus+278950.100.1.1@1626298359
[x86_64] MI2a:  requesting to install python3-module-semantic_version (unspec'd ver; inspect with Debug::pkgMark-shallow)
[x86_64] MI2a:    marked for install (shallow): python3-module-semantic_version
[x86_64] MI2a:     satisfying Depends: python3(django.db) < 0
[x86_64] MI2a:      maybe install (a providing target): python3-module-django 3.2.25-alt1:p10+348531.100.1.1@1716220083
[x86_64] MI2a:     target SELECTED: python3-module-django 3.2.25-alt1:p10+348531.100.1.1@1716220083
[x86_64] MI2a:     requesting to install python3-module-django (unspec'd ver; inspect with Debug::pkgMark-shallow)
[x86_64] MI2a:       marked for install (shallow): python3-module-django
[x86_64] MI2a:        satisfying Depends: python3(asgiref.local) < 0
[x86_64] MI2a:         maybe install (a providing target): python3-module-asgiref 3.4.1-alt1:p10+283535.100.4.1@1631192500
[x86_64] MI2a:        target SELECTED: python3-module-asgiref 3.4.1-alt1:p10+283535.100.4.1@1631192500
[x86_64] MI2a:        requesting to install python3-module-asgiref (unspec'd ver; inspect with Debug::pkgMark-shallow)
[x86_64] MI2a:          marked for install (shallow): python3-module-asgiref
[x86_64] MI2a:        satisfying Depends: python3(geoip2.database) < 0
[x86_64] MI2a:         maybe install (a providing target): python3-module-GeoIP2 4.2.0-alt1:sisyphus+277971.100.1.1@1625928820
[x86_64] MI2a:        target SELECTED: python3-module-GeoIP2 4.2.0-alt1:sisyphus+277971.100.1.1@1625928820
[x86_64] MI2a:        requesting to install python3-module-GeoIP2 (unspec'd ver; inspect with Debug::pkgMark-shallow)
[x86_64] MI2a:          marked for install (shallow): python3-module-GeoIP2
[x86_64] MI2a:           satisfying Depends: python3(aiohttp) < 0
[x86_64] MI2a:            maybe install (a providing target): python3-module-aiohttp 3.9.5-alt1:p10+364068.100.3.1@1734099630
[x86_64] MI2a:           target SELECTED: python3-module-aiohttp 3.9.5-alt1:p10+364068.100.3.1@1734099630
[x86_64] MI2a:           requesting to install python3-module-aiohttp (unspec'd ver; inspect with Debug::pkgMark-shallow)
[x86_64] MI2a:             marked for install (shallow): python3-module-aiohttp
[x86_64] MI2a:              satisfying Depends: python3(async_timeout)  (NULL)
[x86_64] MI2a:               maybe install (a providing target): python3-module-async-timeout 4.0.3-alt1:p10+341764.5600.16.1@1711109524
[x86_64] MI2a:              target SELECTED: python3-module-async-timeout 4.0.3-alt1:p10+341764.5600.16.1@1711109524
[x86_64] MI2a:              requesting to install python3-module-async-timeout (unspec'd ver; inspect with Debug::pkgMark-shallow)
[x86_64] MI2a:                marked for install (shallow): python3-module-async-timeout
[x86_64] MI2a:              satisfying Depends: python3(aiosignal) < 0
[x86_64] MI2a:               maybe install (a providing target): python3-module-aiosignal 1.3.1-alt1:p10+341764.4400.10.1@1710342246
[x86_64] MI2a:              target SELECTED: python3-module-aiosignal 1.3.1-alt1:p10+341764.4400.10.1@1710342246
[x86_64] MI2a:              requesting to install python3-module-aiosignal (unspec'd ver; inspect with Debug::pkgMark-shallow)
[x86_64] MI2a:                marked for install (shallow): python3-module-aiosignal
[x86_64] MI2a:                 satisfying Depends: python3(frozenlist) < 0
[x86_64] MI2a:                  maybe install (a providing target): python3-module-frozenlist 1.3.3-alt1:p10+341764.4600.10.1@1710342290
[x86_64] MI2a:                 target SELECTED: python3-module-frozenlist 1.3.3-alt1:p10+341764.4600.10.1@1710342290
[x86_64] MI2a:                 requesting to install python3-module-frozenlist (unspec'd ver; inspect with Debug::pkgMark-shallow)
[x86_64] MI2a:                   marked for install (shallow): python3-module-frozenlist
[x86_64] MI2a:              satisfying Depends: python3(attr) < 0
[x86_64] MI2a:               maybe install (a providing target): python3-module-attrs 22.1.0-alt1:p10+307737.2052.28.1@1666775429
[x86_64] MI2a:              target SELECTED: python3-module-attrs 22.1.0-alt1:p10+307737.2052.28.1@1666775429
[x86_64] MI2a:              requesting to install python3-module-attrs (unspec'd ver; inspect with Debug::pkgMark-shallow)
[x86_64] MI2a:                marked for install (shallow): python3-module-attrs
[x86_64] MI2a:              satisfying Depends: python3(gunicorn.config) < 0
[x86_64] MI2a:               maybe install (a providing target): python3-module-gunicorn 23.0.0-alt0.p10.1:p10+362975.100.1.1@1732088685
[x86_64] MI2a:              target SELECTED: python3-module-gunicorn 23.0.0-alt0.p10.1:p10+362975.100.1.1@1732088685
[x86_64] MI2a:              requesting to install python3-module-gunicorn (unspec'd ver; inspect with Debug::pkgMark-shallow)
[x86_64] MI2a:                marked for install (shallow): python3-module-gunicorn
[x86_64] MI2a:                 satisfying Depends: python3(eventlet) < 0
[x86_64] MI2a:                  maybe install (a providing target): python3-module-eventlet 0.33.3-alt2.p10:p10+336214.1240.7.1@1702970652
[x86_64] MI2a:                 target SELECTED: python3-module-eventlet 0.33.3-alt2.p10:p10+336214.1240.7.1@1702970652
[x86_64] MI2a:                 requesting to install python3-module-eventlet (unspec'd ver; inspect with Debug::pkgMark-shallow)
[x86_64] MI2a:                   marked for install (shallow): python3-module-eventlet
[x86_64] MI2a:                    satisfying Depends: python3-module-dns >= 1.15.0
[x86_64] MI2a:                     maybe install (a direct target): python3-module-dns 1:2.2.0-alt2:p10+338224.100.3.1@1708886560
[x86_64] MI2a:                    target SELECTED: python3-module-dns 1:2.2.0-alt2:p10+338224.100.3.1@1708886560
[x86_64] MI2a:                    requesting to install python3-module-dns (unspec'd ver; inspect with Debug::pkgMark-shallow)
[x86_64] MI2a:                      marked for install (shallow): python3-module-dns
[x86_64] MI2a:                       satisfying Depends: python3(trio) < 0
[x86_64] MI2a:                        maybe install (a providing target): python3-module-trio 0.16.0-alt0.p10.1:p10+345373.3440.23.1@1713528050
[x86_64] MI2a:                       target SELECTED: python3-module-trio 0.16.0-alt0.p10.1:p10+345373.3440.23.1@1713528050
[x86_64] MI2a:                       requesting to install python3-module-trio (unspec'd ver; inspect with Debug::pkgMark-shallow)
[x86_64] MI2a:                         marked for install (shallow): python3-module-trio
[x86_64] MI2a:                          satisfying Depends: python3-module-async-generator  (NULL)
[x86_64] MI2a:                           maybe install (a providing target): python3-module-async_generator 1.10-alt3:p10+345373.3060.23.1@1713527957
[x86_64] MI2a:                          target SELECTED: python3-module-async_generator 1.10-alt3:p10+345373.3060.23.1@1713527957
[x86_64] MI2a:                          requesting to install python3-module-async_generator (unspec'd ver; inspect with Debug::pkgMark-shallow)
[x86_64] MI2a:                            marked for install (shallow): python3-module-async_generator
[x86_64] MI2a:                          satisfying Depends: python3-module-idna  (NULL)
[x86_64] MI2a:                           maybe install (a direct target): python3-module-idna 3.7-alt1:p10+358498.100.2.1@1728398204
[x86_64] MI2a:                          target SELECTED: python3-module-idna 3.7-alt1:p10+358498.100.2.1@1728398204
[x86_64] MI2a:                          requesting to install python3-module-idna (unspec'd ver; inspect with Debug::pkgMark-shallow)
[x86_64] MI2a:                            marked for install (shallow): python3-module-idna
[x86_64] MI2a:                          satisfying Depends: python3-module-outcome  (NULL)
[x86_64] MI2a:                           maybe install (a direct target): python3-module-outcome 1.0.0-alt1:sisyphus+275966.100.1.1@1624808278
[x86_64] MI2a:                          target SELECTED: python3-module-outcome 1.0.0-alt1:sisyphus+275966.100.1.1@1624808278
[x86_64] MI2a:                          requesting to install python3-module-outcome (unspec'd ver; inspect with Debug::pkgMark-shallow)
[x86_64] MI2a:                            marked for install (shallow): python3-module-outcome
[x86_64] MI2a:                          satisfying Depends: python3-module-sniffio  (NULL)
[x86_64] MI2a:                           maybe install (a direct target): python3-module-sniffio 1.0.0-alt2:sisyphus+276000.100.1.1@1624811306
[x86_64] MI2a:                          target SELECTED: python3-module-sniffio 1.0.0-alt2:sisyphus+276000.100.1.1@1624811306
[x86_64] MI2a:                          requesting to install python3-module-sniffio (unspec'd ver; inspect with Debug::pkgMark-shallow)
[x86_64] MI2a:                            marked for install (shallow): python3-module-sniffio
[x86_64] MI2a:                          satisfying Depends: python3-module-sortedcontainers  (NULL)
[x86_64] MI2a:                           maybe install (a direct target): python3-module-sortedcontainers 2.4.0-alt1:sisyphus+272042.100.1.1@1621262424
[x86_64] MI2a:                          target SELECTED: python3-module-sortedcontainers 2.4.0-alt1:sisyphus+272042.100.1.1@1621262424
[x86_64] MI2a:                          requesting to install python3-module-sortedcontainers (unspec'd ver; inspect with Debug::pkgMark-shallow)
[x86_64] MI2a:                            marked for install (shallow): python3-module-sortedcontainers
[x86_64] MI2a:                          satisfying Depends: python3(astor) < 0
[x86_64] MI2a:                           maybe install (a providing target): python3-module-astor 0.8.1-alt1.1:p10+345373.3100.23.1@1713527982
[x86_64] MI2a:                          target SELECTED: python3-module-astor 0.8.1-alt1.1:p10+345373.3100.23.1@1713527982
[x86_64] MI2a:                          requesting to install python3-module-astor (unspec'd ver; inspect with Debug::pkgMark-shallow)
[x86_64] MI2a:                            marked for install (shallow): python3-module-astor
[x86_64] MI2a:                          satisfying Depends: python3(cffi) < 0
[x86_64] MI2a:                           maybe install (a providing target): python3-module-cffi 1.14.5-alt2:sisyphus+279395.100.1.2@1626532846
[x86_64] MI2a:                          target SELECTED: python3-module-cffi 1.14.5-alt2:sisyphus+279395.100.1.2@1626532846
[x86_64] MI2a:                          requesting to install python3-module-cffi (unspec'd ver; inspect with Debug::pkgMark-shallow)
[x86_64] MI2a:                            marked for install (shallow): python3-module-cffi
[x86_64] MI2a:                             satisfying Depends: python3(pycparser) < 0
[x86_64] MI2a:                              maybe install (a providing target): python3-module-pycparser 2.20-alt2:sisyphus+278697.200.1.1@1626167452
[x86_64] MI2a:                             target SELECTED: python3-module-pycparser 2.20-alt2:sisyphus+278697.200.1.1@1626167452
[x86_64] MI2a:                             requesting to install python3-module-pycparser (unspec'd ver; inspect with Debug::pkgMark-shallow)
[x86_64] MI2a:                               marked for install (shallow): python3-module-pycparser
[x86_64] MI2a:                    satisfying Depends: python3-module-greenlet >= 0.3
[x86_64] MI2a:                     maybe install (a direct target): python3-module-greenlet 3.0.1-alt1:p10+348710.40.4.1@1717603449
[x86_64] MI2a:                    target SELECTED: python3-module-greenlet 3.0.1-alt1:p10+348710.40.4.1@1717603449
[x86_64] MI2a:                    requesting to install python3-module-greenlet (unspec'd ver; inspect with Debug::pkgMark-shallow)
[x86_64] MI2a:                      marked for install (shallow): python3-module-greenlet
[x86_64] MI2a:                    satisfying Depends: python3-module-six >= 1.10.0
[x86_64] MI2a:                     maybe install (a direct target): python3-module-six 1.16.0-alt1.p10:p10+340092.560.10.1@1707922977
[x86_64] MI2a:                    target SELECTED: python3-module-six 1.16.0-alt1.p10:p10+340092.560.10.1@1707922977
[x86_64] MI2a:                    requesting to install python3-module-six (unspec'd ver; inspect with Debug::pkgMark-shallow)
[x86_64] MI2a:                      marked for install (shallow): python3-module-six
[x86_64] MI2a:                    satisfying Depends: python3(OpenSSL) < 0
[x86_64] MI2a:                     maybe install (a providing target): python3-module-openssl 23.2.0-alt2:p10+340922.540.5.1@1708214779
[x86_64] MI2a:                    target SELECTED: python3-module-openssl 23.2.0-alt2:p10+340922.540.5.1@1708214779
[x86_64] MI2a:                    requesting to install python3-module-openssl (unspec'd ver; inspect with Debug::pkgMark-shallow)
[x86_64] MI2a:                      marked for install (shallow): python3-module-openssl
[x86_64] MI2a:                       satisfying Depends: python3-module-cryptography < 42
[x86_64] MI2a:                        maybe install (a direct target): python3-module-cryptography 41.0.7-alt0.p10.1:p10+336509.100.11.1@1706333950
[x86_64] MI2a:                       target SELECTED: python3-module-cryptography 41.0.7-alt0.p10.1:p10+336509.100.11.1@1706333950
[x86_64] MI2a:                       requesting to install python3-module-cryptography (unspec'd ver; inspect with Debug::pkgMark-shallow)
[x86_64] MI2a:                         marked for install (shallow): python3-module-cryptography
[x86_64] MI2a:                    satisfying Depends: python3(packaging.version) < 0
[x86_64] MI2a:                     maybe install (a providing target): python3-module-packaging 23.0-alt1:p10+325520.240.7.1@1691156260
[x86_64] MI2a:                    target SELECTED: python3-module-packaging 23.0-alt1:p10+325520.240.7.1@1691156260
[x86_64] MI2a:                    requesting to install python3-module-packaging (unspec'd ver; inspect with Debug::pkgMark-shallow)
[x86_64] MI2a:                      marked for install (shallow): python3-module-packaging
[x86_64] MI2a:                    satisfying Depends: python3(psycopg2) < 0
[x86_64] MI2a:                     maybe install (a providing target): python3-module-psycopg2 2.9.1-alt1:sisyphus+279721.1200.1.2@1626668985
[x86_64] MI2a:                    target SELECTED: python3-module-psycopg2 2.9.1-alt1:sisyphus+279721.1200.1.2@1626668985
[x86_64] MI2a:                    requesting to install python3-module-psycopg2 (unspec'd ver; inspect with Debug::pkgMark-shallow)
[x86_64] MI2a:                      marked for install (shallow): python3-module-psycopg2
[x86_64] MI2a:                       satisfying Depends: libpq.so.5()(64bit) >= set:le0TVGKd0aLPs2Nto7Z1f8FxU3t37565zOwtmwlUaWn0dXOK7GBJfWweelDqOjusm7LJHI69oPyonkICCiZ0KE8twsNhtmDQxu1w9MNRQM6iIwtsGmhvDgb4B6QuzxLcX13wdIuoKDPIJQr4x1t1hL1zoDFNfnwrgBoGCYuEls2pCkkAe2WpTW8FwTtXB
[x86_64] MI2a:                        maybe install (a providing target): libpq5 17.2-alt0.p10.1:p10+364671.100.4.2@1735384073
[x86_64] MI2a:                       target SELECTED: libpq5 17.2-alt0.p10.1:p10+364671.100.4.2@1735384073
[x86_64] MI2a:                       requesting to install libpq5 (unspec'd ver; inspect with Debug::pkgMark-shallow)
[x86_64] MI2a:                         marked for install (shallow): libpq5
[x86_64] MI2a:                 satisfying Depends: python3(gevent) < 0
[x86_64] MI2a:                  maybe install (a providing target): python3-module-gevent 23.9.1-alt1:p10+348710.100.4.1@1717603532
[x86_64] MI2a:                 target SELECTED: python3-module-gevent 23.9.1-alt1:p10+348710.100.4.1@1717603532
[x86_64] MI2a:                 requesting to install python3-module-gevent (unspec'd ver; inspect with Debug::pkgMark-shallow)
[x86_64] MI2a:                   marked for install (shallow): python3-module-gevent
[x86_64] MI2a:                    satisfying Depends: libcares.so.2()(64bit) >= set:miZcqpIMz6qNacolQqvWHLweBKrWcLuhJfbHqi1
[x86_64] MI2a:                     maybe install (a providing target): libcares 1.26.0-alt1:p10+341112.100.1.1@1708403992
[x86_64] MI2a:                    target SELECTED: libcares 1.26.0-alt1:p10+341112.100.1.1@1708403992
[x86_64] MI2a:                    requesting to install libcares (unspec'd ver; inspect with Debug::pkgMark-shallow)
[x86_64] MI2a:                      marked for install (shallow): libcares
[x86_64] MI2a:                    satisfying Depends: libev.so.4()(64bit) >= set:kePKyiZkErgk4oJyZD1pYiw8QUPkSlSo2oVWB4hEjYIlbFFasBbJvt9OeoFp4LMJ78Kc9UNyZkOb2wesW3ydCD7c9Y8WeSX5nuqixAjAvDr7Kfi0
[x86_64] MI2a:                     maybe install (a providing target): libev4 4.33-alt1:sisyphus+279015.100.1.1@1626353403
[x86_64] MI2a:                    target SELECTED: libev4 4.33-alt1:sisyphus+279015.100.1.1@1626353403
[x86_64] MI2a:                    requesting to install libev4 (unspec'd ver; inspect with Debug::pkgMark-shallow)
[x86_64] MI2a:                      marked for install (shallow): libev4
[x86_64] MI2a:                    satisfying Depends: libuv.so.1()(64bit) >= set:mgRq8px87t4QhqZzhBUt9vZwZr1vmZnmzCV5IbCLaaZLWFkE9gdw6ZprPC1KJnsOvDMmsgo2Z9Ok94PMM6TDqSIad7nY65Cd1B98abNW7RWLiTl0xdTh57Mc6j9h1bEVXhWT93buejCqXts2
[x86_64] MI2a:                     maybe install (a providing target): libuv 1.49.2-alt0.p10.1:p10+371077.100.1.1@1737712684
[x86_64] MI2a:                    target SELECTED: libuv 1.49.2-alt0.p10.1:p10+371077.100.1.1@1737712684
[x86_64] MI2a:                    requesting to install libuv (unspec'd ver; inspect with Debug::pkgMark-shallow)
[x86_64] MI2a:                      marked for install (shallow): libuv
[x86_64] MI2a:                    satisfying Depends: python3(zope.event) < 0
[x86_64] MI2a:                     maybe install (a providing target): python3-module-zope.event 4.4-alt1:sisyphus+275885.100.1.1@1624802662
[x86_64] MI2a:                    target SELECTED: python3-module-zope.event 4.4-alt1:sisyphus+275885.100.1.1@1624802662
[x86_64] MI2a:                    requesting to install python3-module-zope.event (unspec'd ver; inspect with Debug::pkgMark-shallow)
[x86_64] MI2a:                      marked for install (shallow): python3-module-zope.event
[x86_64] MI2a:                       satisfying Depends: python3(zope) < 0
[x86_64] MI2a:                        maybe install (a providing target): python3-module-zope 3.3.0-alt8.5:sisyphus+275884.100.2.1@1624872797
[x86_64] MI2a:                       target SELECTED: python3-module-zope 3.3.0-alt8.5:sisyphus+275884.100.2.1@1624872797
[x86_64] MI2a:                       requesting to install python3-module-zope (unspec'd ver; inspect with Debug::pkgMark-shallow)
[x86_64] MI2a:                         marked for install (shallow): python3-module-zope
[x86_64] MI2a:                          satisfying Depends: python3-module-zope.interface  (NULL)
[x86_64] MI2a:                           maybe install (a direct target): python3-module-zope.interface 5.4.0-alt1:sisyphus+270674.200.1.1@1619413815
[x86_64] MI2a:                          target SELECTED: python3-module-zope.interface 5.4.0-alt1:sisyphus+270674.200.1.1@1619413815
[x86_64] MI2a:                          requesting to install python3-module-zope.interface (unspec'd ver; inspect with Debug::pkgMark-shallow)
[x86_64] MI2a:                            marked for install (shallow): python3-module-zope.interface
[x86_64] MI2a:                          satisfying Depends: python3-module-zc  (NULL)
[x86_64] MI2a:                           maybe install (a direct target): python3-module-zc 1.0.0-alt6.2:sisyphus+275883.100.2.1@1624872753
[x86_64] MI2a:                          target SELECTED: python3-module-zc 1.0.0-alt6.2:sisyphus+275883.100.2.1@1624872753
[x86_64] MI2a:                          requesting to install python3-module-zc (unspec'd ver; inspect with Debug::pkgMark-shallow)
[x86_64] MI2a:                            marked for install (shallow): python3-module-zc
[x86_64] MI2a:                             satisfying Depends: python3-module-z3c  (NULL)
[x86_64] MI2a:                              maybe install (a direct target): python3-module-z3c 3.0.0-alt3:sisyphus+275882.100.1.1@1624802402
[x86_64] MI2a:                             target SELECTED: python3-module-z3c 3.0.0-alt3:sisyphus+275882.100.1.1@1624802402
[x86_64] MI2a:                             requesting to install python3-module-z3c (unspec'd ver; inspect with Debug::pkgMark-shallow)
[x86_64] MI2a:                               marked for install (shallow): python3-module-z3c
[x86_64] MI2a:                 satisfying Depends: python3(paste.deploy) < 0
[x86_64] MI2a:                  maybe install (a providing target): python3-module-PasteDeploy 1:3.0.1-alt1:p10+341944.200.5.1@1710442255
[x86_64] MI2a:                 target SELECTED: python3-module-PasteDeploy 1:3.0.1-alt1:p10+341944.200.5.1@1710442255
[x86_64] MI2a:                 requesting to install python3-module-PasteDeploy (unspec'd ver; inspect with Debug::pkgMark-shallow)
[x86_64] MI2a:                   marked for install (shallow): python3-module-PasteDeploy
[x86_64] MI2a:                    satisfying Depends: python3(Paste) < 0
[x86_64] MI2a:                     maybe install (a providing target): python3-module-paste 3.5.0-alt1:sisyphus+278050.10.9.1@1625992949
[x86_64] MI2a:                    target SELECTED: python3-module-paste 3.5.0-alt1:sisyphus+278050.10.9.1@1625992949
[x86_64] MI2a:                    requesting to install python3-module-paste (unspec'd ver; inspect with Debug::pkgMark-shallow)
[x86_64] MI2a:                      marked for install (shallow): python3-module-paste
[x86_64] MI2a:                       satisfying Depends: python3(openid.consumer) < 0
[x86_64] MI2a:                        maybe install (a providing target): python3-module-openid 3.2.0-alt1:sisyphus+278049.100.2.1@1625998936
[x86_64] MI2a:                       target SELECTED: python3-module-openid 3.2.0-alt1:sisyphus+278049.100.2.1@1625998936
[x86_64] MI2a:                       requesting to install python3-module-openid (unspec'd ver; inspect with Debug::pkgMark-shallow)
[x86_64] MI2a:                         marked for install (shallow): python3-module-openid
[x86_64] MI2a:                    satisfying Depends: python3(paste.script.templates) < 0
[x86_64] MI2a:                     maybe install (a providing target): python3-module-PasteScript 1:2.0.2-alt2:sisyphus+272468.100.1.1@1621939313
[x86_64] MI2a:                    target SELECTED: python3-module-PasteScript 1:2.0.2-alt2:sisyphus+272468.100.1.1@1621939313
[x86_64] MI2a:                    requesting to install python3-module-PasteScript (unspec'd ver; inspect with Debug::pkgMark-shallow)
[x86_64] MI2a:                      marked for install (shallow): python3-module-PasteScript
[x86_64] MI2a:                       satisfying Depends: python3(Cheetah) < 0
[x86_64] MI2a:                        maybe install (a providing target): python3-module-Cheetah 3.2.3-alt3:sisyphus+279534.100.1.3@1626591141
[x86_64] MI2a:                       target SELECTED: python3-module-Cheetah 3.2.3-alt3:sisyphus+279534.100.1.3@1626591141
[x86_64] MI2a:                       requesting to install python3-module-Cheetah (unspec'd ver; inspect with Debug::pkgMark-shallow)
[x86_64] MI2a:                         marked for install (shallow): python3-module-Cheetah
[x86_64] MI2a:                 satisfying Depends: python3(tornado.httpserver) < 0
[x86_64] MI2a:                  maybe install (a providing target): python3-module-tornado 6.3.2-alt1:p10+307833.177640.205.1@1693943742
[x86_64] MI2a:                 target SELECTED: python3-module-tornado 6.3.2-alt1:p10+307833.177640.205.1@1693943742
[x86_64] MI2a:                 requesting to install python3-module-tornado (unspec'd ver; inspect with Debug::pkgMark-shallow)
[x86_64] MI2a:                   marked for install (shallow): python3-module-tornado
[x86_64] MI2a:                    satisfying Depends: python3-module-certifi  (NULL)
[x86_64] MI2a:                     maybe install (a direct target): python3-module-certifi 2024.8.30-alt1:p10+364853.100.3.1@1734696308
[x86_64] MI2a:                    target SELECTED: python3-module-certifi 2024.8.30-alt1:p10+364853.100.3.1@1734696308
[x86_64] MI2a:                    requesting to install python3-module-certifi (unspec'd ver; inspect with Debug::pkgMark-shallow)
[x86_64] MI2a:                      marked for install (shallow): python3-module-certifi
[x86_64] MI2a:                    satisfying Depends: python3(pycares) < 0
[x86_64] MI2a:                     maybe install (a providing target): python3-module-pycares 2.3.0-alt1.1:sisyphus+277970.100.1.1@1625928541
[x86_64] MI2a:                    target SELECTED: python3-module-pycares 2.3.0-alt1.1:sisyphus+277970.100.1.1@1625928541
[x86_64] MI2a:                    requesting to install python3-module-pycares (unspec'd ver; inspect with Debug::pkgMark-shallow)
[x86_64] MI2a:                      marked for install (shallow): python3-module-pycares
[x86_64] MI2a:                    satisfying Depends: python3(twisted.internet.abstract) < 0
[x86_64] MI2a:                     maybe install (a providing target): python3-module-twisted-core 20.3.0-alt2:sisyphus+265234.27700.49.1@1613760186
[x86_64] MI2a:                    target SELECTED: python3-module-twisted-core 20.3.0-alt2:sisyphus+265234.27700.49.1@1613760186
[x86_64] MI2a:                    requesting to install python3-module-twisted-core (unspec'd ver; inspect with Debug::pkgMark-shallow)
[x86_64] MI2a:                      marked for install (shallow): python3-module-twisted-core
[x86_64] MI2a:                       satisfying Depends: python3(appdirs) < 0
[x86_64] MI2a:                        maybe install (a providing target): python3-module-appdirs 1.4.4-alt1:sisyphus+267613.300.2.1@1620039159
[x86_64] MI2a:                       target SELECTED: python3-module-appdirs 1.4.4-alt1:sisyphus+267613.300.2.1@1620039159
[x86_64] MI2a:                       requesting to install python3-module-appdirs (unspec'd ver; inspect with Debug::pkgMark-shallow)
[x86_64] MI2a:                         marked for install (shallow): python3-module-appdirs
[x86_64] MI2a:                       satisfying Depends: python3(automat) < 0
[x86_64] MI2a:                        maybe install (a providing target): python3-module-automat 20.2.0-alt2:sisyphus+275898.100.1.2@1624826834
[x86_64] MI2a:                       target SELECTED: python3-module-automat 20.2.0-alt2:sisyphus+275898.100.1.2@1624826834
[x86_64] MI2a:                       requesting to install python3-module-automat (unspec'd ver; inspect with Debug::pkgMark-shallow)
[x86_64] MI2a:                         marked for install (shallow): python3-module-automat
[x86_64] MI2a:                       satisfying Depends: python3(gobject) < 0
[x86_64] MI2a:                        maybe install (a providing target): python3-module-pygobject 2.28.6-alt11:sisyphus+279128.100.1.1@1626380821
[x86_64] MI2a:                       target SELECTED: python3-module-pygobject 2.28.6-alt11:sisyphus+279128.100.1.1@1626380821
[x86_64] MI2a:                       requesting to install python3-module-pygobject (unspec'd ver; inspect with Debug::pkgMark-shallow)
[x86_64] MI2a:                         marked for install (shallow): python3-module-pygobject
[x86_64] MI2a:                       satisfying Depends: python3(hyperlink) < 0
[x86_64] MI2a:                        maybe install (a providing target): python3-module-hyperlink 19.0.0-alt1:sisyphus+275823.100.1.1@1624795895
[x86_64] MI2a:                       target SELECTED: python3-module-hyperlink 19.0.0-alt1:sisyphus+275823.100.1.1@1624795895
[x86_64] MI2a:                       requesting to install python3-module-hyperlink (unspec'd ver; inspect with Debug::pkgMark-shallow)
[x86_64] MI2a:                         marked for install (shallow): python3-module-hyperlink
[x86_64] MI2a:                       satisfying Depends: python3(serial) < 0
[x86_64] MI2a:                        maybe install (a providing target): python3-module-serial 3.5-alt1:sisyphus+275865.100.2.1@1624872757
[x86_64] MI2a:                       target SELECTED: python3-module-serial 3.5-alt1:sisyphus+275865.100.2.1@1624872757
[x86_64] MI2a:                       requesting to install python3-module-serial (unspec'd ver; inspect with Debug::pkgMark-shallow)
[x86_64] MI2a:                         marked for install (shallow): python3-module-serial
[x86_64] MI2a:                          satisfying Depends: python3(hid) < 0
[x86_64] MI2a:                           maybe install (a providing target): python3-module-cython-hidapi 0.9.0-alt0.1:sisyphus+279127.100.1.1@1626380803
[x86_64] MI2a:                          target SELECTED: python3-module-cython-hidapi 0.9.0-alt0.1:sisyphus+279127.100.1.1@1626380803
[x86_64] MI2a:                          requesting to install python3-module-cython-hidapi (unspec'd ver; inspect with Debug::pkgMark-shallow)
[x86_64] MI2a:                            marked for install (shallow): python3-module-cython-hidapi
[x86_64] MI2a:                             satisfying Depends: libhidapi-hidraw.so.0()(64bit) >= set:idVzQSm8qwHaDxTA68McgKaPbJXhcb5TVG2
[x86_64] MI2a:                              maybe install (a providing target): libhidapi 0.10.1-alt1_2:sisyphus+279018.100.1.1@1626353631
[x86_64] MI2a:                             target SELECTED: libhidapi 0.10.1-alt1_2:sisyphus+279018.100.1.1@1626353631
[x86_64] MI2a:                             requesting to install libhidapi (unspec'd ver; inspect with Debug::pkgMark-shallow)
[x86_64] MI2a:                               marked for install (shallow): libhidapi
[x86_64] MI2a:                                satisfying Depends: libusb-1.0.so.0()(64bit) >= set:kfVTRgwr9jFX2IAipIvys7MZqexJaD3JlmiYanqVHFDk94KrUVRt9vUBKana
[x86_64] MI2a:                                 maybe install (a providing target): libusb 1.0.26-alt2:p10+305622.100.3.1@1662994398
[x86_64] MI2a:                                target SELECTED: libusb 1.0.26-alt2:p10+305622.100.3.1@1662994398
[x86_64] MI2a:                                requesting to install libusb (unspec'd ver; inspect with Debug::pkgMark-shallow)
[x86_64] MI2a:                                  marked for install (shallow): libusb
[x86_64] MI2a:                       satisfying Depends: python3-module-twisted-logger = 20.3.0-alt2:sisyphus+265234.27700.49.1
[x86_64] MI2a:                        maybe install (a direct target): python3-module-twisted-logger 20.3.0-alt2:sisyphus+265234.27700.49.1@1613760186
[x86_64] MI2a:                       target SELECTED: python3-module-twisted-logger 20.3.0-alt2:sisyphus+265234.27700.49.1@1613760186
[x86_64] MI2a:                       requesting to install python3-module-twisted-logger (unspec'd ver; inspect with Debug::pkgMark-shallow)
[x86_64] MI2a:                         marked for install (shallow): python3-module-twisted-logger
[x86_64] MI2a:                          satisfying Depends: python3(constantly) < 0
[x86_64] MI2a:                           maybe install (a providing target): python3-module-constantly 15.1.0-alt5.qa1:sisyphus+275808.100.1.1@1624794561
[x86_64] MI2a:                          target SELECTED: python3-module-constantly 15.1.0-alt5.qa1:sisyphus+275808.100.1.1@1624794561
[x86_64] MI2a:                          requesting to install python3-module-constantly (unspec'd ver; inspect with Debug::pkgMark-shallow)
[x86_64] MI2a:                            marked for install (shallow): python3-module-constantly
[x86_64] MI2a:                       satisfying Depends: python3-module-twisted-words = 20.3.0-alt2:sisyphus+265234.27700.49.1
[x86_64] MI2a:                        maybe install (a direct target): python3-module-twisted-words 20.3.0-alt2:sisyphus+265234.27700.49.1@1613760186
[x86_64] MI2a:                       target SELECTED: python3-module-twisted-words 20.3.0-alt2:sisyphus+265234.27700.49.1@1613760186
[x86_64] MI2a:                       requesting to install python3-module-twisted-words (unspec'd ver; inspect with Debug::pkgMark-shallow)
[x86_64] MI2a:                         marked for install (shallow): python3-module-twisted-words
[x86_64] MI2a:                          satisfying Depends: python3(incremental) < 0
[x86_64] MI2a:                           maybe install (a providing target): python3-module-incremental 21.3.0-alt1:sisyphus+277407.100.1.1@1625535091
[x86_64] MI2a:                          target SELECTED: python3-module-incremental 21.3.0-alt1:sisyphus+277407.100.1.1@1625535091
[x86_64] MI2a:                          requesting to install python3-module-incremental (unspec'd ver; inspect with Debug::pkgMark-shallow)
[x86_64] MI2a:                            marked for install (shallow): python3-module-incremental
[x86_64] MI2a:                             satisfying Depends: python3(click) < 0
[x86_64] MI2a:                              maybe install (a providing target): python3-module-click 8.1.3-alt1:p10+317847.20130.110.1@1687546694
[x86_64] MI2a:                             target SELECTED: python3-module-click 8.1.3-alt1:p10+317847.20130.110.1@1687546694
[x86_64] MI2a:                             requesting to install python3-module-click (unspec'd ver; inspect with Debug::pkgMark-shallow)
[x86_64] MI2a:                               marked for install (shallow): python3-module-click
[x86_64] MI2a:                    satisfying Depends: python3(twisted.names.cache) < 0
[x86_64] MI2a:                     maybe install (a providing target): python3-module-twisted-names 20.3.0-alt2:sisyphus+265234.27700.49.1@1613760186
[x86_64] MI2a:                    target SELECTED: python3-module-twisted-names 20.3.0-alt2:sisyphus+265234.27700.49.1@1613760186
[x86_64] MI2a:                    requesting to install python3-module-twisted-names (unspec'd ver; inspect with Debug::pkgMark-shallow)
[x86_64] MI2a:                      marked for install (shallow): python3-module-twisted-names
[x86_64] MI2a:              satisfying Depends: python3(multidict) < 0
[x86_64] MI2a:               maybe install (a providing target): python3-module-multidict 6.0.4-alt1:p10+341764.5700.18.1@1711522616
[x86_64] MI2a:              target SELECTED: python3-module-multidict 6.0.4-alt1:p10+341764.5700.18.1@1711522616
[x86_64] MI2a:              requesting to install python3-module-multidict (unspec'd ver; inspect with Debug::pkgMark-shallow)
[x86_64] MI2a:                marked for install (shallow): python3-module-multidict
[x86_64] MI2a:              satisfying Depends: python3(yarl) < 0
[x86_64] MI2a:               maybe install (a providing target): python3-module-yarl 1.6.3-alt2:sisyphus+279721.100.1.1@1626647918
[x86_64] MI2a:              target SELECTED: python3-module-yarl 1.6.3-alt2:sisyphus+279721.100.1.1@1626647918
[x86_64] MI2a:              requesting to install python3-module-yarl (unspec'd ver; inspect with Debug::pkgMark-shallow)
[x86_64] MI2a:                marked for install (shallow): python3-module-yarl
[x86_64] MI2a:           satisfying Depends: python3(maxminddb) < 0
[x86_64] MI2a:            maybe install (a providing target): python3-module-MaxMindDB 2.0.3-alt1:sisyphus+265234.33300.49.1@1613764506
[x86_64] MI2a:           target SELECTED: python3-module-MaxMindDB 2.0.3-alt1:sisyphus+265234.33300.49.1@1613764506
[x86_64] MI2a:           requesting to install python3-module-MaxMindDB (unspec'd ver; inspect with Debug::pkgMark-shallow)
[x86_64] MI2a:             marked for install (shallow): python3-module-MaxMindDB
[x86_64] MI2a:              satisfying Depends: libmaxminddb.so.0()(64bit) >= set:hezcr0MimdlJCtNa5
[x86_64] MI2a:               maybe install (a providing target): libmaxminddb 1.7.1-alt1:p10+330589.60.5.1@1697468590
[x86_64] MI2a:              target SELECTED: libmaxminddb 1.7.1-alt1:p10+330589.60.5.1@1697468590
[x86_64] MI2a:              requesting to install libmaxminddb (unspec'd ver; inspect with Debug::pkgMark-shallow)
[x86_64] MI2a:                marked for install (shallow): libmaxminddb
[x86_64] MI2a:           satisfying Depends: python3(requests) < 0
[x86_64] MI2a:            maybe install (a providing target): python3-module-requests 2.32.3-alt0.p10.1:p10+363330.140.9.1@1733142042
[x86_64] MI2a:           target SELECTED: python3-module-requests 2.32.3-alt0.p10.1:p10+363330.140.9.1@1733142042
[x86_64] MI2a:           requesting to install python3-module-requests (unspec'd ver; inspect with Debug::pkgMark-shallow)
[x86_64] MI2a:             marked for install (shallow): python3-module-requests
[x86_64] MI2a:              satisfying Depends: python3-module-charset-normalizer  (NULL)
[x86_64] MI2a:               maybe install (a direct target): python3-module-charset-normalizer 2.1.1-alt1:p10+320151.200.3.1@1685544956
[x86_64] MI2a:              target SELECTED: python3-module-charset-normalizer 2.1.1-alt1:p10+320151.200.3.1@1685544956
[x86_64] MI2a:              requesting to install python3-module-charset-normalizer (unspec'd ver; inspect with Debug::pkgMark-shallow)
[x86_64] MI2a:                marked for install (shallow): python3-module-charset-normalizer
[x86_64] MI2a:              satisfying Depends: python3-module-urllib3  (NULL)
[x86_64] MI2a:               maybe install (a direct target): python3-module-urllib3 2:1.26.17-alt0.p10.1:p10+336509.200.11.1@1706333977
[x86_64] MI2a:              target SELECTED: python3-module-urllib3 2:1.26.17-alt0.p10.1:p10+336509.200.11.1@1706333977
[x86_64] MI2a:              requesting to install python3-module-urllib3 (unspec'd ver; inspect with Debug::pkgMark-shallow)
[x86_64] MI2a:                marked for install (shallow): python3-module-urllib3
[x86_64] MI2a:                 satisfying Depends: python3-module-ndg-httpsclient  (NULL)
[x86_64] MI2a:                  maybe install (a direct target): python3-module-ndg-httpsclient 0.4.2-alt1.qa1:sisyphus+275837.100.1.2@1624808487
[x86_64] MI2a:                 target SELECTED: python3-module-ndg-httpsclient 0.4.2-alt1.qa1:sisyphus+275837.100.1.2@1624808487
[x86_64] MI2a:                 requesting to install python3-module-ndg-httpsclient (unspec'd ver; inspect with Debug::pkgMark-shallow)
[x86_64] MI2a:                   marked for install (shallow): python3-module-ndg-httpsclient
[x86_64] MI2a:                    satisfying Depends: python3-module-ndg = 0.4.2-alt1.qa1:sisyphus+275837.100.1.2
[x86_64] MI2a:                     maybe install (a direct target): python3-module-ndg 0.4.2-alt1.qa1:sisyphus+275837.100.1.2@1624808487
[x86_64] MI2a:                    target SELECTED: python3-module-ndg 0.4.2-alt1.qa1:sisyphus+275837.100.1.2@1624808487
[x86_64] MI2a:                    requesting to install python3-module-ndg (unspec'd ver; inspect with Debug::pkgMark-shallow)
[x86_64] MI2a:                      marked for install (shallow): python3-module-ndg
[x86_64] MI2a:                 satisfying Depends: python3(ntlm) < 0
[x86_64] MI2a:                  maybe install (a providing target): python3-module-ntlm 1.1.0-alt1.2:sisyphus+275841.100.1.1@1624797814
[x86_64] MI2a:                 target SELECTED: python3-module-ntlm 1.1.0-alt1.2:sisyphus+275841.100.1.1@1624797814
[x86_64] MI2a:                 requesting to install python3-module-ntlm (unspec'd ver; inspect with Debug::pkgMark-shallow)
[x86_64] MI2a:                   marked for install (shallow): python3-module-ntlm
[x86_64] MI2a:        satisfying Depends: python3(jinja2) < 0
[x86_64] MI2a:         maybe install (a providing target): python3-module-jinja2 3.0.1-alt1.p10.1:p10+341197.520.19.1@1710991350
[x86_64] MI2a:        target SELECTED: python3-module-jinja2 3.0.1-alt1.p10.1:p10+341197.520.19.1@1710991350
[x86_64] MI2a:        requesting to install python3-module-jinja2 (unspec'd ver; inspect with Debug::pkgMark-shallow)
[x86_64] MI2a:          marked for install (shallow): python3-module-jinja2
[x86_64] MI2a:           satisfying Depends: python3(markupsafe) < 0
[x86_64] MI2a:            maybe install (a providing target): python3-module-markupsafe 1:2.1.2-alt1:p10+317847.21460.110.1@1687547544
[x86_64] MI2a:           target SELECTED: python3-module-markupsafe 1:2.1.2-alt1:p10+317847.21460.110.1@1687547544
[x86_64] MI2a:           requesting to install python3-module-markupsafe (unspec'd ver; inspect with Debug::pkgMark-shallow)
[x86_64] MI2a:             marked for install (shallow): python3-module-markupsafe
[x86_64] MI2a:        satisfying Depends: python3(pytz) < 0
[x86_64] MI2a:         maybe install (a providing target): python3-module-pytz 1:2021.1-alt1:sisyphus+267903.400.1.1@1615896636
[x86_64] MI2a:        target SELECTED: python3-module-pytz 1:2021.1-alt1:sisyphus+267903.400.1.1@1615896636
[x86_64] MI2a:        requesting to install python3-module-pytz (unspec'd ver; inspect with Debug::pkgMark-shallow)
[x86_64] MI2a:          marked for install (shallow): python3-module-pytz
[x86_64] MI2a:        satisfying Depends: python3(sqlparse) < 0
[x86_64] MI2a:         maybe install (a providing target): python3-module-sqlparse 0.5.0-alt1:p10+350774.100.1.1@1718029413
[x86_64] MI2a:        target SELECTED: python3-module-sqlparse 0.5.0-alt1:p10+350774.100.1.1@1718029413
[x86_64] MI2a:        requesting to install python3-module-sqlparse (unspec'd ver; inspect with Debug::pkgMark-shallow)
[x86_64] MI2a:          marked for install (shallow): python3-module-sqlparse
[x86_64] MI2a:        satisfying Depends: python3(yaml) < 0
[x86_64] MI2a:         maybe install (a providing target): python3-module-yaml 6.0.1-alt1.1:p10+340092.554.16.1@1709018089
[x86_64] MI2a:        target SELECTED: python3-module-yaml 6.0.1-alt1.1:p10+340092.554.16.1@1709018089
[x86_64] MI2a:        requesting to install python3-module-yaml (unspec'd ver; inspect with Debug::pkgMark-shallow)
[x86_64] MI2a:          marked for install (shallow): python3-module-yaml
[x86_64] MI2a:           satisfying Depends: libyaml-0.so.2()(64bit) >= set:jeDuSUAbEuz1xrY3muBZ56F9Jbi2W3kR6iB5oRQxGfDDGyazcKxJ4shcJWS8IVb7
[x86_64] MI2a:            maybe install (a providing target): libyaml2 0.2.5-alt1:sisyphus+278391.100.1.1@1626094928
[x86_64] MI2a:           target SELECTED: libyaml2 0.2.5-alt1:sisyphus+278391.100.1.1@1626094928
[x86_64] MI2a:           requesting to install libyaml2 (unspec'd ver; inspect with Debug::pkgMark-shallow)
[x86_64] MI2a:             marked for install (shallow): libyaml2
[x86_64] MI2a:  satisfying Depends: python3(setuptools.command.build) < 0
[x86_64] MI2a:  satisfying Depends: python3(typing_extensions) < 0
[x86_64] MI2a:   maybe install (a providing target): python3-module-typing_extensions 4.5.0-alt0.p10.1:p10+345373.1332.24.1@1713534744
[x86_64] MI2a:  target SELECTED: python3-module-typing_extensions 4.5.0-alt0.p10.1:p10+345373.1332.24.1@1713534744
[x86_64] MI2a:  requesting to install python3-module-typing_extensions (unspec'd ver; inspect with Debug::pkgMark-shallow)
[x86_64] MI2a:    marked for install (shallow): python3-module-typing_extensions
[x86_64] MI2a: marked for install (shallow): python3-module-setuptools_rust
[x86_64] MI2a:  satisfying Depends: python3(setuptools.command.build) < 0
[x86_64] Starting
[x86_64] Starting 2
[x86_64] Investigating python3-module-setuptools_rust 1.6.0-alt1:p10+376208.517.10.1@1740730781
[x86_64]  Package python3-module-setuptools_rust has a broken Depends: python3(setuptools.command.build) < 0
[x86_64] Done
[x86_64] rpm-build-pyproject is already the newest version.
[x86_64] Selecting filesystem for '/proc'
[x86_64] filesystem is already the newest version.
[x86_64] Selecting bzlib-devel for 'pkgconfig(bzip2)'
[x86_64] Selecting python3-module-setuptools_rust for 'python3-module-setuptools-rust'
[x86_64] Selecting python3-module-setuptools_rust for 'python3-module-setuptools-rust'
[x86_64] Some packages could not be installed. This may mean that you have
[x86_64] requested an impossible situation or if you are using the unstable
[x86_64] distribution that some required packages have not yet been created
[x86_64] or been moved out of Incoming.
[x86_64] The following information may help to resolve the situation:
[x86_64] 
[x86_64] The following packages have unmet dependencies:
[x86_64]   python3-module-setuptools_rust: Depends: python3(setuptools.command.build) (< 0) but it is not installable
[x86_64] E: Broken packages
[x86_64] hsh-install: Failed to calculate package file list.
[x86_64] hsh-install: Failed to generate package file list.
2025-Feb-28 08:19:59 :: [x86_64] python3-module-maturin-1.5.1-alt1.src.rpm: remote: cannot build src.rpm
2025-Feb-28 08:19:59 :: [x86_64] #520 python3-module-maturin-1.5.1-alt1.src.rpm: build FAILED
2025-Feb-28 08:20:21 :: [armh] #400 tbb.git 2021.13.0-alt1.1: build OK (cached)
2025-Feb-28 08:20:21 :: [armh] task processing CANCELLED
2025-Feb-28 08:20:30 :: [aarch64] #400 tbb.git 2021.13.0-alt1.1: build OK (cached)
2025-Feb-28 08:20:30 :: [aarch64] task processing CANCELLED
2025-Feb-28 08:19:58 :: [i586] build FAILED
2025-Feb-28 08:19:59 :: [x86_64] build FAILED
2025-Feb-28 08:20:21 :: [armh] build FAILED
2025-Feb-28 08:20:31 :: [aarch64] build FAILED
2025-Feb-28 08:20:31 :: task #376208 for p10 FAILED


      parent reply	other threads:[~2025-02-28  8:20 UTC|newest]

Thread overview: 10+ messages / expand[flat|nested]  mbox.gz  Atom feed  top
2025-02-26 15:16 [#376208] [test-only] p10 FAILED " Girar awaiter (alton)
2025-02-27  7:30 ` [#376208] [test-only] p10 FAILED (try 2) " Girar awaiter (alton)
2025-02-27  7:42 ` [#376208] [test-only] p10 FAILED (try 3) libfmt.git=10.2.1-alt1 cmrc.git=2.0.1-alt1 Girar awaiter (alton)
2025-02-27  8:21 ` [#376208] [test-only] p10 FAILED (try 4) libfmt.git=10.2.1-alt1 cmrc.git=2.0.1-alt1 vcpkg.git=2023.09.15-alt1 Girar awaiter (alton)
2025-02-27 11:43 ` [#376208] [test-only] p10 FAILED (try 5) " Girar awaiter (alton)
2025-02-27 12:11 ` [#376208] [test-only] p10 FAILED (try 6) " Girar awaiter (alton)
2025-02-27 12:44 ` [#376208] [test-only] p10 FAILED (try 7) " Girar awaiter (alton)
2025-02-27 13:24 ` [#376208] [test-only] p10 FAILED (try 8) " Girar awaiter (alton)
2025-02-27 14:01 ` [#376208] [test-only] p10 FAILED (try 9) " Girar awaiter (alton)
2025-02-28  8:20 ` Girar awaiter (alton) [this message]

Reply instructions:

You may reply publicly to this message via plain-text email
using any one of the following methods:

* Save the following mbox file, import it into your mail client,
  and reply-to-all from there: mbox

  Avoid top-posting and favor interleaved quoting:
  https://en.wikipedia.org/wiki/Posting_style#Interleaved_style

* Reply using the --to, --cc, and --in-reply-to
  switches of git-send-email(1):

  git send-email \
    --in-reply-to=girar.task.376208.10.1@gyle.mskdc.altlinux.org \
    --to=girar-builder@altlinux.org \
    --cc=alton@altlinux.org \
    --cc=devel@lists.altlinux.org \
    --cc=girar-builder-p10@altlinux.org \
    --cc=girar-builder-p10@lists.altlinux.org \
    --cc=sisyphus-incominger@lists.altlinux.org \
    /path/to/YOUR_REPLY

  https://kernel.org/pub/software/scm/git/docs/git-send-email.html

* If your mail client supports setting the In-Reply-To header
  via mailto: links, try the mailto: link

ALT Linux Girar Builder robot reports

This inbox may be cloned and mirrored by anyone:

	git clone --mirror http://lore.altlinux.org/sisyphus-incominger/0 sisyphus-incominger/git/0.git

	# If you have public-inbox 1.1+ installed, you may
	# initialize and index your mirror using the following commands:
	public-inbox-init -V2 sisyphus-incominger sisyphus-incominger/ http://lore.altlinux.org/sisyphus-incominger \
		sisyphus-incominger@lists.altlinux.org sisyphus-incominger@lists.altlinux.ru sisyphus-incominger@lists.altlinux.com
	public-inbox-index sisyphus-incominger

Example config snippet for mirrors.
Newsgroup available over NNTP:
	nntp://lore.altlinux.org/org.altlinux.lists.sisyphus-incominger


AGPL code for this site: git clone https://public-inbox.org/public-inbox.git