ALT Linux Girar Builder robot reports
 help / color / mirror / Atom feed
* [#376155] [test-only] FAILED tuxclocker.git=1.5.1-alt1
@ 2025-02-26  9:12 Girar awaiter (minergenon)
  0 siblings, 0 replies; only message in thread
From: Girar awaiter (minergenon) @ 2025-02-26  9:12 UTC (permalink / raw)
  To: Sergey Palcheh; +Cc: sisyphus-incominger, girar-builder-sisyphus

https://git.altlinux.org/tasks/376155/logs/events.1.1.log
https://packages.altlinux.org/tasks/376155

subtask  name        aarch64  i586  ppc64le  x86_64
   #100  tuxclocker        -     -        -  failed

2025-Feb-26 09:12:37 :: test-only task #376155 for sisyphus started by minergenon:
#100 build 1.5.1-alt1 from /people/minergenon/packages/tuxclocker.git fetched at 2025-Feb-26 09:12:36
2025-Feb-26 09:12:39 :: [ppc64le] #100 tuxclocker.git 1.5.1-alt1: build start
2025-Feb-26 09:12:39 :: [aarch64] #100 tuxclocker.git 1.5.1-alt1: build start
2025-Feb-26 09:12:39 :: [i586] #100 tuxclocker.git 1.5.1-alt1: build start
2025-Feb-26 09:12:39 :: [x86_64] #100 tuxclocker.git 1.5.1-alt1: build start
2025-Feb-26 09:12:50 :: [i586] #100 tuxclocker.git 1.5.1-alt1: build SKIPPED
[x86_64] <13>Feb 26 09:12:50 rpmi: rpm-macros-meson-1.6.1-alt1 sisyphus+365260.100.1.1 1734433594 installed
[x86_64] Reading Package Lists...
[x86_64] Building Dependency Tree...
[x86_64] MI2a: marked for install (shallow): gcc-c++
[x86_64] MI2a:  satisfying Depends: gcc14-c++  (NULL)
[x86_64] MI2a:   maybe install (a direct target): gcc14-c++ 14.2.1-alt1:sisyphus+360995.100.1.1@1730131018
[x86_64] MI2a:  target SELECTED: gcc14-c++ 14.2.1-alt1:sisyphus+360995.100.1.1@1730131018
[x86_64] MI2a:  requesting to install gcc14-c++ (unspec'd ver; inspect with Debug::pkgMark-shallow)
[x86_64] MI2a:    marked for install (shallow): gcc14-c++
[x86_64] MI2a:     satisfying Depends: libstdc++14-devel = 14.2.1-alt1:sisyphus+360995.100.1.1
[x86_64] MI2a:      maybe install (a direct target): libstdc++14-devel 14.2.1-alt1:sisyphus+360995.100.1.1@1730131018
[x86_64] MI2a:     target SELECTED: libstdc++14-devel 14.2.1-alt1:sisyphus+360995.100.1.1@1730131018
[x86_64] MI2a:     requesting to install libstdc++14-devel (unspec'd ver; inspect with Debug::pkgMark-shallow)
[x86_64] MI2a:       marked for install (shallow): libstdc++14-devel
[x86_64] MI2a:        satisfying PreDepends: gcc-c++-common >= 1.4.7
[x86_64] MI2a:         maybe install (a direct target): gcc-c++-common 1.4.28-alt1:sisyphus+348678.100.1.1@1716396142
[x86_64] MI2a:        target SELECTED: gcc-c++-common 1.4.28-alt1:sisyphus+348678.100.1.1@1716396142
[x86_64] MI2a:        requesting to install gcc-c++-common (unspec'd ver; inspect with Debug::pkgMark-shallow)
[x86_64] MI2a:          marked for install (shallow): gcc-c++-common
[x86_64] MI2a: marked for install (shallow): cmake
[x86_64] MI2a:  satisfying Depends: rpm-macros-cmake  (NULL)
[x86_64] MI2a:   maybe install (a direct target): rpm-macros-cmake 3.29.1-alt1:sisyphus+344518.300.3.1@1712379787
[x86_64] MI2a:  target SELECTED: rpm-macros-cmake 3.29.1-alt1:sisyphus+344518.300.3.1@1712379787
[x86_64] MI2a:  requesting to install rpm-macros-cmake (unspec'd ver; inspect with Debug::pkgMark-shallow)
[x86_64] MI2a:    marked for install (shallow): rpm-macros-cmake
[x86_64] MI2a:  satisfying Depends: libarchive.so.13()(64bit) >= set:mfws0SCfLRvPUKXi0gkbE0yqsuzVMI88jwJ7kSDXXM11MUSPfvqwmDm2xDogNmeEkAorJTlC2B1ZatQqH4cJ32OndcAjazDxDaNvG6mMdDQthrMI5Ie5skSvbnLedY5O95MlUcFQ1thxqvQWyDvIECoveyzf0x7I3xw6vu1
[x86_64] MI2a:   maybe install (a providing target): libarchive13 3.7.5-alt2:sisyphus+358189.100.1.1@1727162763
[x86_64] MI2a:  target SELECTED: libarchive13 3.7.5-alt2:sisyphus+358189.100.1.1@1727162763
[x86_64] MI2a:  requesting to install libarchive13 (unspec'd ver; inspect with Debug::pkgMark-shallow)
[x86_64] MI2a:    marked for install (shallow): libarchive13
[x86_64] MI2a:     satisfying Depends: libcrypto.so.3()(64bit) >= set:ql3PXSClcBY9FOuxT2MmWBTjuZAnRZBckPsGEaWp9qs3syAhoLygApfuKoEShvbjoafnDOFhzK75IPaZxvmCZilEjkjo
[x86_64] MI2a:      maybe install (a providing target): libcrypto3 3.3.3-alt1:sisyphus+374381.40.2.1@1739299401
[x86_64] MI2a:     target SELECTED: libcrypto3 3.3.3-alt1:sisyphus+374381.40.2.1@1739299401
[x86_64] MI2a:     requesting to install libcrypto3 (unspec'd ver; inspect with Debug::pkgMark-shallow)
[x86_64] MI2a:       marked for install (shallow): libcrypto3
[x86_64] MI2a:        satisfying Depends: openssl-config >= 3.2.0-alt1
[x86_64] MI2a:         maybe install (a direct target): openssl-config 3.2.0-alt1:sisyphus+366659.140.4.1@1736956949
[x86_64] MI2a:        target SELECTED: openssl-config 3.2.0-alt1:sisyphus+366659.140.4.1@1736956949
[x86_64] MI2a:        requesting to install openssl-config (unspec'd ver; inspect with Debug::pkgMark-shallow)
[x86_64] MI2a:          marked for install (shallow): openssl-config
[x86_64] MI2a:        satisfying Depends: ca-certificates  (NULL)
[x86_64] MI2a:         maybe install (a direct target): ca-certificates 2025.02.10-alt1:sisyphus+374228.100.4.1@1739265441
[x86_64] MI2a:        target SELECTED: ca-certificates 2025.02.10-alt1:sisyphus+374228.100.4.1@1739265441
[x86_64] MI2a:        requesting to install ca-certificates (unspec'd ver; inspect with Debug::pkgMark-shallow)
[x86_64] MI2a:          marked for install (shallow): ca-certificates
[x86_64] MI2a:           satisfying Depends: ca-trust  (NULL)
[x86_64] MI2a:            maybe install (a direct target): ca-trust 0.2.0-alt1:sisyphus+344843.100.1.1@1712743326
[x86_64] MI2a:           target SELECTED: ca-trust 0.2.0-alt1:sisyphus+344843.100.1.1@1712743326
[x86_64] MI2a:           requesting to install ca-trust (unspec'd ver; inspect with Debug::pkgMark-shallow)
[x86_64] MI2a:             marked for install (shallow): ca-trust
[x86_64] MI2a:              satisfying Depends: p11-kit-trust  (NULL)
[x86_64] MI2a:               maybe install (a direct target): p11-kit-trust 1:0.25.5-alt1:sisyphus+352553.100.1.1@1720622573
[x86_64] MI2a:              target SELECTED: p11-kit-trust 1:0.25.5-alt1:sisyphus+352553.100.1.1@1720622573
[x86_64] MI2a:              requesting to install p11-kit-trust (unspec'd ver; inspect with Debug::pkgMark-shallow)
[x86_64] MI2a:                marked for install (shallow): p11-kit-trust
[x86_64] MI2a:                 satisfying Depends: /etc/alternatives/packages.d  (NULL)
[x86_64] MI2a:                  maybe install (a providing target): alternatives 0.5.3-alt1:sisyphus+371878.100.1.1@1737988822
[x86_64] MI2a:                 target SELECTED: alternatives 0.5.3-alt1:sisyphus+371878.100.1.1@1737988822
[x86_64] MI2a:                 requesting to install alternatives (unspec'd ver; inspect with Debug::pkgMark-shallow)
[x86_64] MI2a:                   marked for install (shallow): alternatives
[x86_64] MI2a:                    satisfying Depends: rpm-macros-alternatives = 0.5.3-alt1:sisyphus+371878.100.1.1
[x86_64] MI2a:                     maybe install (a direct target): rpm-macros-alternatives 0.5.3-alt1:sisyphus+371878.100.1.1@1737988822
[x86_64] MI2a:                    target SELECTED: rpm-macros-alternatives 0.5.3-alt1:sisyphus+371878.100.1.1@1737988822
[x86_64] MI2a:                    requesting to install rpm-macros-alternatives (unspec'd ver; inspect with Debug::pkgMark-shallow)
[x86_64] MI2a:                      marked for install (shallow): rpm-macros-alternatives
[x86_64] MI2a:                 satisfying Depends: libtasn1.so.6()(64bit) >= set:jfRaXblmF8mf5SLNNXDA2CDacDxCZqQOspDh1
[x86_64] MI2a:                  maybe install (a providing target): libtasn1 4.20.0-alt2:sisyphus+375829.100.1.1@1740299335
[x86_64] MI2a:                 target SELECTED: libtasn1 4.20.0-alt2:sisyphus+375829.100.1.1@1740299335
[x86_64] MI2a:                 requesting to install libtasn1 (unspec'd ver; inspect with Debug::pkgMark-shallow)
[x86_64] MI2a:                   marked for install (shallow): libtasn1
[x86_64] MI2a:                 satisfying Depends: libp11-kit = 1:0.25.5-alt1:sisyphus+352553.100.1.1
[x86_64] MI2a:                  maybe install (a direct target): libp11-kit 1:0.25.5-alt1:sisyphus+352553.100.1.1@1720622573
[x86_64] MI2a:                 target SELECTED: libp11-kit 1:0.25.5-alt1:sisyphus+352553.100.1.1@1720622573
[x86_64] MI2a:                 requesting to install libp11-kit (unspec'd ver; inspect with Debug::pkgMark-shallow)
[x86_64] MI2a:                   marked for install (shallow): libp11-kit
[x86_64] MI2a:  satisfying Depends: libcurl.so.4()(64bit) >= set:kgZtdjewuBSOM3YXjuKGePG56ZAe
[x86_64] MI2a:   maybe install (a providing target): libcurl 8.12.1-alt1:sisyphus+374517.100.1.1@1739435598
[x86_64] MI2a:  target SELECTED: libcurl 8.12.1-alt1:sisyphus+374517.100.1.1@1739435598
[x86_64] MI2a:  requesting to install libcurl (unspec'd ver; inspect with Debug::pkgMark-shallow)
[x86_64] MI2a:    marked for install (shallow): libcurl
[x86_64] MI2a:     satisfying Depends: libbrotlidec.so.1()(64bit) >= set:heroOawuYbTK8
[x86_64] MI2a:      maybe install (a providing target): libbrotlidec 1.1.0-alt1:sisyphus+328501.100.1.1@1693598419
[x86_64] MI2a:     target SELECTED: libbrotlidec 1.1.0-alt1:sisyphus+328501.100.1.1@1693598419
[x86_64] MI2a:     requesting to install libbrotlidec (unspec'd ver; inspect with Debug::pkgMark-shallow)
[x86_64] MI2a:       marked for install (shallow): libbrotlidec
[x86_64] MI2a:        satisfying Depends: libbrotlicommon = 1.1.0-alt1:sisyphus+328501.100.1.1
[x86_64] MI2a:         maybe install (a direct target): libbrotlicommon 1.1.0-alt1:sisyphus+328501.100.1.1@1693598419
[x86_64] MI2a:        target SELECTED: libbrotlicommon 1.1.0-alt1:sisyphus+328501.100.1.1@1693598419
[x86_64] MI2a:        requesting to install libbrotlicommon (unspec'd ver; inspect with Debug::pkgMark-shallow)
[x86_64] MI2a:          marked for install (shallow): libbrotlicommon
[x86_64] MI2a:     satisfying Depends: libgnutls.so.30()(64bit) >= set:ohWzKsl3gEhunQQpmsYd9i7QCtiGyfZ1Iaw1tOFZbdeEKESximCRPnIehs3AEMQXZ0e8KN9yV59f8Zeu5QHTtKkulI9mjuLg9NIizyZhpZCsx8sGEZDBhhgZvpnajdZvocWora9BdPXEcA4Z2ghEYo7SHlnQVUueZmZ3mRKhNiuOM9tTy3ea4NtLvppyZ1rbmbbGWLShwembtEyVtUcNpLjugdka8b4
[x86_64] MI2a:      maybe install (a providing target): libgnutls30 3.8.9-alt1:sisyphus+375558.200.1.1@1740142583
[x86_64] MI2a:     target SELECTED: libgnutls30 3.8.9-alt1:sisyphus+375558.200.1.1@1740142583
[x86_64] MI2a:     requesting to install libgnutls30 (unspec'd ver; inspect with Debug::pkgMark-shallow)
[x86_64] MI2a:       marked for install (shallow): libgnutls30
[x86_64] MI2a:        satisfying Depends: libhogweed.so.6()(64bit) >= set:mfnnj2ZgBdeg17M87tPneezLu1hRaAv7Mvee2P332bHTaZjeCozdeChKl8zpQyflmS6Vy6tRmgHXyW1dkybK4gSLUc4ZqST6Otwai2tAwz0231mJ0KXX1SRmE5Wv1xA3elkz1fS4ARIDtHglVAVYGsrdTpOlAk7oFZ51ji2BIsI0W6X7ePZg
[x86_64] MI2a:         maybe install (a providing target): libhogweed6 3.10.1-alt1:sisyphus+372008.100.1.1@1738078259
[x86_64] MI2a:        target SELECTED: libhogweed6 3.10.1-alt1:sisyphus+372008.100.1.1@1738078259
[x86_64] MI2a:        requesting to install libhogweed6 (unspec'd ver; inspect with Debug::pkgMark-shallow)
[x86_64] MI2a:          marked for install (shallow): libhogweed6
[x86_64] MI2a:           satisfying Depends: libnettle8 = 3.10.1-alt1:sisyphus+372008.100.1.1
[x86_64] MI2a:            maybe install (a direct target): libnettle8 3.10.1-alt1:sisyphus+372008.100.1.1@1738078259
[x86_64] MI2a:           target SELECTED: libnettle8 3.10.1-alt1:sisyphus+372008.100.1.1@1738078259
[x86_64] MI2a:           requesting to install libnettle8 (unspec'd ver; inspect with Debug::pkgMark-shallow)
[x86_64] MI2a:             marked for install (shallow): libnettle8
[x86_64] MI2a:        satisfying Depends: libidn2.so.0()(64bit) >= set:ifaFMURofX11
[x86_64] MI2a:         maybe install (a providing target): libidn2 2.3.7-alt1:sisyphus+339505.100.1.2@1706718968
[x86_64] MI2a:        target SELECTED: libidn2 2.3.7-alt1:sisyphus+339505.100.1.2@1706718968
[x86_64] MI2a:        requesting to install libidn2 (unspec'd ver; inspect with Debug::pkgMark-shallow)
[x86_64] MI2a:          marked for install (shallow): libidn2
[x86_64] MI2a:     satisfying Depends: libgsasl.so.18()(64bit) >= set:jfNMMjxjlLiKUyEAZvcPMCX3
[x86_64] MI2a:      maybe install (a providing target): libgsasl18 2.2.1-alt2:sisyphus+359713.200.2.1@1728905430
[x86_64] MI2a:     target SELECTED: libgsasl18 2.2.1-alt2:sisyphus+359713.200.2.1@1728905430
[x86_64] MI2a:     requesting to install libgsasl18 (unspec'd ver; inspect with Debug::pkgMark-shallow)
[x86_64] MI2a:       marked for install (shallow): libgsasl18
[x86_64] MI2a:        satisfying Depends: libgssapi_krb5.so.2()(64bit) >= set:lgUI5pnpbNsJUr9F0ECN6LIbSVz7j3UNHAXVG0YYmbjijMyN
[x86_64] MI2a:         maybe install (a providing target): libkrb5 1.21.3-alt2:sisyphus+351857.100.1.1@1719735141
[x86_64] MI2a:        target SELECTED: libkrb5 1.21.3-alt2:sisyphus+351857.100.1.1@1719735141
[x86_64] MI2a:        requesting to install libkrb5 (unspec'd ver; inspect with Debug::pkgMark-shallow)
[x86_64] MI2a:          marked for install (shallow): libkrb5
[x86_64] MI2a:           satisfying Depends: libcom_err.so.2()(64bit) >= set:ifPl8xIvqFmQe8JQo3
[x86_64] MI2a:            maybe install (a providing target): libcom_err 1.47.1.0.10.ad56-alt2:sisyphus+363497.200.3.1@1732729908
[x86_64] MI2a:           target SELECTED: libcom_err 1.47.1.0.10.ad56-alt2:sisyphus+363497.200.3.1@1732729908
[x86_64] MI2a:           requesting to install libcom_err (unspec'd ver; inspect with Debug::pkgMark-shallow)
[x86_64] MI2a:             marked for install (shallow): libcom_err
[x86_64] MI2a:           satisfying Depends: libkeyutils.so.1()(64bit) >= set:jfWn12U6KThBXgruPLZ68yYZt2
[x86_64] MI2a:            maybe install (a providing target): libkeyutils 1.6.3-alt1:sisyphus+346336.200.2.2@1716472658
[x86_64] MI2a:           target SELECTED: libkeyutils 1.6.3-alt1:sisyphus+346336.200.2.2@1716472658
[x86_64] MI2a:           requesting to install libkeyutils (unspec'd ver; inspect with Debug::pkgMark-shallow)
[x86_64] MI2a:             marked for install (shallow): libkeyutils
[x86_64] MI2a:           satisfying Depends: liblmdb.so.0()(64bit) >= set:kfalKd4xYAkaAG2MqeH0wB2F4kTaBEo1iv0KFpxVmqzFIV6HJ0
[x86_64] MI2a:            maybe install (a providing target): liblmdb 0.9.33-alt1:sisyphus+360625.100.1.1@1729819640
[x86_64] MI2a:           target SELECTED: liblmdb 0.9.33-alt1:sisyphus+360625.100.1.1@1729819640
[x86_64] MI2a:           requesting to install liblmdb (unspec'd ver; inspect with Debug::pkgMark-shallow)
[x86_64] MI2a:             marked for install (shallow): liblmdb
[x86_64] MI2a:           satisfying Depends: libssl.so.3()(64bit) >= set:niiRRjOfYK5wgPZ2bvml1CcuMKm8fC0YcLKKRbpcI0BcryMK5hoYIwxo3
[x86_64] MI2a:            maybe install (a providing target): libssl3 3.3.3-alt1:sisyphus+374381.40.2.1@1739299401
[x86_64] MI2a:           target SELECTED: libssl3 3.3.3-alt1:sisyphus+374381.40.2.1@1739299401
[x86_64] MI2a:           requesting to install libssl3 (unspec'd ver; inspect with Debug::pkgMark-shallow)
[x86_64] MI2a:             marked for install (shallow): libssl3
[x86_64] MI2a:           satisfying Depends: libverto.so.1()(64bit) >= set:jfI5MRvI6tmNn0zwQdb68Gk0
[x86_64] MI2a:            maybe install (a providing target): libverto 0.3.2-alt1_1:sisyphus+321176.2200.10.2@1684803947
[x86_64] MI2a:           target SELECTED: libverto 0.3.2-alt1_1:sisyphus+321176.2200.10.2@1684803947
[x86_64] MI2a:           requesting to install libverto (unspec'd ver; inspect with Debug::pkgMark-shallow)
[x86_64] MI2a:             marked for install (shallow): libverto
[x86_64] MI2a:        satisfying Depends: libidn.so.12()(64bit) >= set:kiBXars6
[x86_64] MI2a:         maybe install (a providing target): libidn 1.37-alt2:sisyphus+300849.100.1.1@1653769687
[x86_64] MI2a:        target SELECTED: libidn 1.37-alt2:sisyphus+300849.100.1.1@1653769687
[x86_64] MI2a:        requesting to install libidn (unspec'd ver; inspect with Debug::pkgMark-shallow)
[x86_64] MI2a:          marked for install (shallow): libidn
[x86_64] MI2a:        satisfying Depends: libntlm.so.0()(64bit) >= set:hfknJM1
[x86_64] MI2a:         maybe install (a providing target): libntlm 1.5-alt1:sisyphus+278100.3300.1.1@1626058899
[x86_64] MI2a:        target SELECTED: libntlm 1.5-alt1:sisyphus+278100.3300.1.1@1626058899
[x86_64] MI2a:        requesting to install libntlm (unspec'd ver; inspect with Debug::pkgMark-shallow)
[x86_64] MI2a:          marked for install (shallow): libntlm
[x86_64] MI2a:     satisfying Depends: liblber.so.2()(64bit) >= set:liRJP9c9FzZ8q5FR
[x86_64] MI2a:      maybe install (a providing target): libldap2 2.6.9-alt2:sisyphus+367501.300.4.1@1735841751
[x86_64] MI2a:     target SELECTED: libldap2 2.6.9-alt2:sisyphus+367501.300.4.1@1735841751
[x86_64] MI2a:     requesting to install libldap2 (unspec'd ver; inspect with Debug::pkgMark-shallow)
[x86_64] MI2a:       marked for install (shallow): libldap2
[x86_64] MI2a:        satisfying Depends: libsasl2.so.3()(64bit) >= set:lhKAh7QjCM36Vnr6MdFxFf8LIcZsS1kl0wH7Iyp
[x86_64] MI2a:         maybe install (a providing target): libsasl2-3 2.1.28-alt2.1:sisyphus+367419.100.1.1@1735482560
[x86_64] MI2a:        target SELECTED: libsasl2-3 2.1.28-alt2.1:sisyphus+367419.100.1.1@1735482560
[x86_64] MI2a:        requesting to install libsasl2-3 (unspec'd ver; inspect with Debug::pkgMark-shallow)
[x86_64] MI2a:          marked for install (shallow): libsasl2-3
[x86_64] MI2a:        satisfying Depends: openldap-common = 2.6.9-alt2:sisyphus+367501.300.4.1
[x86_64] MI2a:         maybe install (a direct target): openldap-common 2.6.9-alt2:sisyphus+367501.300.4.1@1735841751
[x86_64] MI2a:        target SELECTED: openldap-common 2.6.9-alt2:sisyphus+367501.300.4.1@1735841751
[x86_64] MI2a:        requesting to install openldap-common (unspec'd ver; inspect with Debug::pkgMark-shallow)
[x86_64] MI2a:          marked for install (shallow): openldap-common
[x86_64] MI2a:     satisfying Depends: libnghttp2.so.14()(64bit) >= set:lfKRgJ8UKsv8mdZbLF8UZpCjqzxjS4uXpINNNC9lNPxPEJZqw9IfpEB51C0QFeHEVpGv95xGtf4CksgxNiZbJO6CvE4RCQxaKbdf6IG29SZkOus
[x86_64] MI2a:      maybe install (a providing target): libnghttp2 1.64.0-alt1:sisyphus+363795.200.2.1@1733118555
[x86_64] MI2a:     target SELECTED: libnghttp2 1.64.0-alt1:sisyphus+363795.200.2.1@1733118555
[x86_64] MI2a:     requesting to install libnghttp2 (unspec'd ver; inspect with Debug::pkgMark-shallow)
[x86_64] MI2a:       marked for install (shallow): libnghttp2
[x86_64] MI2a:     satisfying Depends: libnghttp3.so.9()(64bit) >= set:kfOHsymuRovZfZIawj4STEmrF1Xh8iHADhCWQYMeA3u6CuDIW7ipo3
[x86_64] MI2a:      maybe install (a providing target): libnghttp3.9 1.8.0-alt1:sisyphus+375942.100.1.1@1740420759
[x86_64] MI2a:     target SELECTED: libnghttp3.9 1.8.0-alt1:sisyphus+375942.100.1.1@1740420759
[x86_64] MI2a:     requesting to install libnghttp3.9 (unspec'd ver; inspect with Debug::pkgMark-shallow)
[x86_64] MI2a:       marked for install (shallow): libnghttp3.9
[x86_64] MI2a:     satisfying Depends: libngtcp2.so.16()(64bit) >= set:keggzSiMInQoBwKw3hOFjw6C4r5lyewzRrbvfiZqFvO6xZ2fVcSxD0qyPdhyUVRzsodbhSgNzKYVngELjUy4
[x86_64] MI2a:      maybe install (a providing target): libngtcp2.16 1.11.0-alt1:sisyphus+375942.200.1.1@1740420816
[x86_64] MI2a:     target SELECTED: libngtcp2.16 1.11.0-alt1:sisyphus+375942.200.1.1@1740420816
[x86_64] MI2a:     requesting to install libngtcp2.16 (unspec'd ver; inspect with Debug::pkgMark-shallow)
[x86_64] MI2a:       marked for install (shallow): libngtcp2.16
[x86_64] MI2a:        satisfying Depends: libngtcp2_crypto_gnutls8 = 1.11.0-alt1:sisyphus+375942.200.1.1
[x86_64] MI2a:         maybe install (a direct target): libngtcp2_crypto_gnutls8 1.11.0-alt1:sisyphus+375942.200.1.1@1740420816
[x86_64] MI2a:        target SELECTED: libngtcp2_crypto_gnutls8 1.11.0-alt1:sisyphus+375942.200.1.1@1740420816
[x86_64] MI2a:        requesting to install libngtcp2_crypto_gnutls8 (unspec'd ver; inspect with Debug::pkgMark-shallow)
[x86_64] MI2a:          marked for install (shallow): libngtcp2_crypto_gnutls8
[x86_64] MI2a:     satisfying Depends: libpsl.so.5()(64bit) >= set:ifo8sG4NYozTZj0
[x86_64] MI2a:      maybe install (a providing target): libpsl 0.21.5-alt1:sisyphus+338474.100.1.1@1705684769
[x86_64] MI2a:     target SELECTED: libpsl 0.21.5-alt1:sisyphus+338474.100.1.1@1705684769
[x86_64] MI2a:     requesting to install libpsl (unspec'd ver; inspect with Debug::pkgMark-shallow)
[x86_64] MI2a:       marked for install (shallow): libpsl
[x86_64] MI2a:        satisfying Depends: publicsuffix-list-dafsa  (NULL)
[x86_64] MI2a:         maybe install (a direct target): publicsuffix-list-dafsa 20250131-alt1:sisyphus+373297.100.1.1@1738767834
[x86_64] MI2a:        target SELECTED: publicsuffix-list-dafsa 20250131-alt1:sisyphus+373297.100.1.1@1738767834
[x86_64] MI2a:        requesting to install publicsuffix-list-dafsa (unspec'd ver; inspect with Debug::pkgMark-shallow)
[x86_64] MI2a:          marked for install (shallow): publicsuffix-list-dafsa
[x86_64] MI2a:     satisfying Depends: libssh2.so.1()(64bit) >= set:lfFi2ZJdCZnNQqC7FxZHyYYVCMxI4j1759y3AVs98cSjdm6BZrMSTPA4BKYeWR49vSI0JGO8E3yldZ5j77X8z3joPyGVoiqovNAwPc5RvPDTKNRR6pS6H80qi1nxAdsxOdZERlIwndLqIyuVb
[x86_64] MI2a:      maybe install (a providing target): libssh2 1.11.0-alt2:sisyphus+339356.100.1.1@1706593137
[x86_64] MI2a:     target SELECTED: libssh2 1.11.0-alt2:sisyphus+339356.100.1.1@1706593137
[x86_64] MI2a:     requesting to install libssh2 (unspec'd ver; inspect with Debug::pkgMark-shallow)
[x86_64] MI2a:       marked for install (shallow): libssh2
[x86_64] MI2a:  satisfying Depends: libexpat.so.1()(64bit) >= set:kgE3cnblKboj81fLUjE91hdZC3R0
[x86_64] MI2a:   maybe install (a providing target): libexpat 2.6.4-alt1:sisyphus+365521.100.1.1@1734700243
[x86_64] MI2a:  target SELECTED: libexpat 2.6.4-alt1:sisyphus+365521.100.1.1@1734700243
[x86_64] MI2a:  requesting to install libexpat (unspec'd ver; inspect with Debug::pkgMark-shallow)
[x86_64] MI2a:    marked for install (shallow): libexpat
[x86_64] MI2a:  satisfying Depends: libjsoncpp.so.24()(64bit) >= set:mfWdNr9hSTEj33pgekkWiZ5gxiSrhe4i6fCrcyUrA0F5fpZ04ebvZEaLNDQoZ1XGHPAxHVDJ5aZ8J4EOS5Ph9IjMNpQdqYunbBZ41SG8ORLJvBHW7puYYi760ZFTIxHsoUGjwulnr1aj60ioshZ86OzriUK928mFrs77eRe9dru2y166FawAr1edD77euJ7rtNk5haAjh7jgSNVf
[x86_64] MI2a:   maybe install (a providing target): libjsoncpp24 1.9.4-alt2:sisyphus+346331.200.2.1@1716448551
[x86_64] MI2a:  target SELECTED: libjsoncpp24 1.9.4-alt2:sisyphus+346331.200.2.1@1716448551
[x86_64] MI2a:  requesting to install libjsoncpp24 (unspec'd ver; inspect with Debug::pkgMark-shallow)
[x86_64] MI2a:    marked for install (shallow): libjsoncpp24
[x86_64] MI2a:  satisfying Depends: librhash.so.0()(64bit) >= set:ifDyZ6eqLIBMAAMoeF3
[x86_64] MI2a:   maybe install (a providing target): librhash 1.3.5-alt3:sisyphus+286141.40.2.1@1632982456
[x86_64] MI2a:  target SELECTED: librhash 1.3.5-alt3:sisyphus+286141.40.2.1@1632982456
[x86_64] MI2a:  requesting to install librhash (unspec'd ver; inspect with Debug::pkgMark-shallow)
[x86_64] MI2a:    marked for install (shallow): librhash
[x86_64] MI2a:  satisfying Depends: libuv.so.1()(64bit) >= set:mhRqUeic58tAOj8qzoZvhgcZFirSpyDd3iNFI57V8pPeIZrSvAPv9Z9Udh8e5kJuikPvq0
[x86_64] MI2a:   maybe install (a providing target): libuv 1.49.2-alt1:sisyphus+369779.100.1.1@1737060735
[x86_64] MI2a:  target SELECTED: libuv 1.49.2-alt1:sisyphus+369779.100.1.1@1737060735
[x86_64] MI2a:  requesting to install libuv (unspec'd ver; inspect with Debug::pkgMark-shallow)
[x86_64] MI2a:    marked for install (shallow): libuv
[x86_64] MI2a:  satisfying Depends: cmake-modules = 3.31.5-alt1:sisyphus+371742.100.1.1
[x86_64] MI2a:   maybe install (a direct target): cmake-modules 3.31.5-alt1:sisyphus+371742.100.1.1@1737807519
[x86_64] MI2a:  target SELECTED: cmake-modules 3.31.5-alt1:sisyphus+371742.100.1.1@1737807519
[x86_64] MI2a:  requesting to install cmake-modules (unspec'd ver; inspect with Debug::pkgMark-shallow)
[x86_64] MI2a:    marked for install (shallow): cmake-modules
[x86_64] MI2a: marked for install (shallow): meson
[x86_64] MI2a:  satisfying Depends: python3 >= 3.7
[x86_64] MI2a:   maybe install (a direct target): python3 3.12.8-alt1:sisyphus+364336.100.1.1@1733526854
[x86_64] MI2a:  target SELECTED: python3 3.12.8-alt1:sisyphus+364336.100.1.1@1733526854
[x86_64] MI2a:  requesting to install python3 (unspec'd ver; inspect with Debug::pkgMark-shallow)
[x86_64] MI2a:    marked for install (shallow): python3
[x86_64] MI2a:     satisfying Depends: python3-base = 3.12.8-alt1:sisyphus+364336.100.1.1
[x86_64] MI2a:      maybe install (a direct target): python3-base 3.12.8-alt1:sisyphus+364336.100.1.1@1733526854
[x86_64] MI2a:     target SELECTED: python3-base 3.12.8-alt1:sisyphus+364336.100.1.1@1733526854
[x86_64] MI2a:     requesting to install python3-base (unspec'd ver; inspect with Debug::pkgMark-shallow)
[x86_64] MI2a:       marked for install (shallow): python3-base
[x86_64] MI2a:        satisfying Depends: libb2.so.1()(64bit) >= set:ifZigOjACtTxPlFd1
[x86_64] MI2a:         maybe install (a providing target): libb2 0.98.1-alt1_1:sisyphus+291614.100.1.1@1638962877
[x86_64] MI2a:        target SELECTED: libb2 0.98.1-alt1_1:sisyphus+291614.100.1.1@1638962877
[x86_64] MI2a:        requesting to install libb2 (unspec'd ver; inspect with Debug::pkgMark-shallow)
[x86_64] MI2a:          marked for install (shallow): libb2
[x86_64] MI2a:        satisfying Depends: libgdbm.so.3()(64bit) >= set:iejT6M96OmuT9HlYJ7ooGKIqQHH2
[x86_64] MI2a:         maybe install (a providing target): libgdbm 1.8.3-alt10:sisyphus+346222.200.3.2@1716468404
[x86_64] MI2a:        target SELECTED: libgdbm 1.8.3-alt10:sisyphus+346222.200.3.2@1716468404
[x86_64] MI2a:        requesting to install libgdbm (unspec'd ver; inspect with Debug::pkgMark-shallow)
[x86_64] MI2a:          marked for install (shallow): libgdbm
[x86_64] MI2a:        satisfying Depends: libmpdec.so.3()(64bit) >= set:mfKMM5WSnhLDPZvFmnT3UZzrmq8c8YrwNbOV4tWrYtxVLhVcTOCZFhcz3lEuvZcwi6sdFMWQoYneheybZqoHPamXBDDj1tDvOSZufCNoCdhGIsFsMAjgDRP3aaYZo365djtoYzTFzMebqqvYejutWDL4iBFP4DZFz95ekTiFkNlEgOfZbzZAVw77cJS8N8NLq7Xj1XrYJOufSLenVyExgbjfSYF9OtF8u2gC6g0GdyiHcFO9CztZ9gC7OBZzxibA5aSk7Oeqpq1
[x86_64] MI2a:         maybe install (a providing target): libmpdec3 2.5.1-alt3:sisyphus+314490.500.5.1@1675432004
[x86_64] MI2a:        target SELECTED: libmpdec3 2.5.1-alt3:sisyphus+314490.500.5.1@1675432004
[x86_64] MI2a:        requesting to install libmpdec3 (unspec'd ver; inspect with Debug::pkgMark-shallow)
[x86_64] MI2a:          marked for install (shallow): libmpdec3
[x86_64] MI2a:  satisfying Depends: ninja-build >= 1.7
[x86_64] MI2a:   maybe install (a direct target): ninja-build 1:1.12.1-alt1:sisyphus+373493.100.1.1@1738928096
[x86_64] MI2a:  target SELECTED: ninja-build 1:1.12.1-alt1:sisyphus+373493.100.1.1@1738928096
[x86_64] MI2a:  requesting to install ninja-build (unspec'd ver; inspect with Debug::pkgMark-shallow)
[x86_64] MI2a:    marked for install (shallow): ninja-build
[x86_64] MI2a:  satisfying Depends: python3(typing_extensions) < 0
[x86_64] MI2a:   maybe install (a providing target): python3-module-typing_extensions 4.12.2-alt1:sisyphus+351501.100.1.2@1719296652
[x86_64] MI2a:  target SELECTED: python3-module-typing_extensions 4.12.2-alt1:sisyphus+351501.100.1.2@1719296652
[x86_64] MI2a:  requesting to install python3-module-typing_extensions (unspec'd ver; inspect with Debug::pkgMark-shallow)
[x86_64] MI2a:    marked for install (shallow): python3-module-typing_extensions
[x86_64] MI2a: marked for install (shallow): git
[x86_64] MI2a:  satisfying Depends: perl-Git = 2.42.4-alt1:sisyphus+369547.100.1.1
[x86_64] MI2a:   maybe install (a direct target): perl-Git 2.42.4-alt1:sisyphus+369547.100.1.1@1736878350
[x86_64] MI2a:  target SELECTED: perl-Git 2.42.4-alt1:sisyphus+369547.100.1.1@1736878350
[x86_64] MI2a:  requesting to install perl-Git (unspec'd ver; inspect with Debug::pkgMark-shallow)
[x86_64] MI2a:    marked for install (shallow): perl-Git
[x86_64] MI2a:     satisfying Depends: perl(Error.pm)  (NULL)
[x86_64] MI2a:      maybe install (a providing target): perl-Error 0.17029-alt1:sisyphus+245975.100.1.1@1581530233
[x86_64] MI2a:     target SELECTED: perl-Error 0.17029-alt1:sisyphus+245975.100.1.1@1581530233
[x86_64] MI2a:     requesting to install perl-Error (unspec'd ver; inspect with Debug::pkgMark-shallow)
[x86_64] MI2a:       marked for install (shallow): perl-Error
[x86_64] MI2a:     satisfying Depends: perl(Locale/Messages.pm)  (NULL)
[x86_64] MI2a:      maybe install (a providing target): perl-libintl 1.33-alt1.1:sisyphus+335067.6600.2.2@1701152056
[x86_64] MI2a:     target SELECTED: perl-libintl 1.33-alt1.1:sisyphus+335067.6600.2.2@1701152056
[x86_64] MI2a:     requesting to install perl-libintl (unspec'd ver; inspect with Debug::pkgMark-shallow)
[x86_64] MI2a:       marked for install (shallow): perl-libintl
[x86_64] MI2a:        satisfying Depends: perl(Encode.pm)  (NULL)
[x86_64] MI2a:         maybe install (a providing target): perl-Encode 3.21-alt1:sisyphus+343095.100.1.1@1710875477
[x86_64] MI2a:        target SELECTED: perl-Encode 3.21-alt1:sisyphus+343095.100.1.1@1710875477
[x86_64] MI2a:        requesting to install perl-Encode (unspec'd ver; inspect with Debug::pkgMark-shallow)
[x86_64] MI2a:          marked for install (shallow): perl-Encode
[x86_64] MI2a:           satisfying Depends: perl(Filter/Util/Call.pm)  (NULL)
[x86_64] MI2a:            maybe install (a providing target): perl-Filter 1.64-alt1:sisyphus+335067.400.1.1@1700901412
[x86_64] MI2a:           target SELECTED: perl-Filter 1.64-alt1:sisyphus+335067.400.1.1@1700901412
[x86_64] MI2a:           requesting to install perl-Filter (unspec'd ver; inspect with Debug::pkgMark-shallow)
[x86_64] MI2a:             marked for install (shallow): perl-Filter
[x86_64] MI2a:     satisfying Depends: perl(Term/ReadKey.pm)  (NULL)
[x86_64] MI2a:      maybe install (a providing target): perl-TermReadKey 2.38-alt1.1:sisyphus+335067.1700.1.1@1700901696
[x86_64] MI2a:     target SELECTED: perl-TermReadKey 2.38-alt1.1:sisyphus+335067.1700.1.1@1700901696
[x86_64] MI2a:     requesting to install perl-TermReadKey (unspec'd ver; inspect with Debug::pkgMark-shallow)
[x86_64] MI2a:       marked for install (shallow): perl-TermReadKey
[x86_64] MI2a:     satisfying Depends: git-core = 2.42.4-alt1:sisyphus+369547.100.1.1
[x86_64] MI2a:      maybe install (a direct target): git-core 2.42.4-alt1:sisyphus+369547.100.1.1@1736878350
[x86_64] MI2a:     target SELECTED: git-core 2.42.4-alt1:sisyphus+369547.100.1.1@1736878350
[x86_64] MI2a:     requesting to install git-core (unspec'd ver; inspect with Debug::pkgMark-shallow)
[x86_64] MI2a:       marked for install (shallow): git-core
[x86_64] MI2a:        satisfying Depends: diffstat  (NULL)
[x86_64] MI2a:         maybe install (a direct target): diffstat 1.64-alt1:sisyphus+346132.200.3.2@1716466240
[x86_64] MI2a:        target SELECTED: diffstat 1.64-alt1:sisyphus+346132.200.3.2@1716466240
[x86_64] MI2a:        requesting to install diffstat (unspec'd ver; inspect with Debug::pkgMark-shallow)
[x86_64] MI2a:          marked for install (shallow): diffstat
[x86_64] MI2a:        satisfying Depends: less  (NULL)
[x86_64] MI2a:         maybe install (a direct target): less 633-alt1:sisyphus+328181.300.2.1@1693321749
[x86_64] MI2a:        target SELECTED: less 633-alt1:sisyphus+328181.300.2.1@1693321749
[x86_64] MI2a:        requesting to install less (unspec'd ver; inspect with Debug::pkgMark-shallow)
[x86_64] MI2a:          marked for install (shallow): less
[x86_64] MI2a:        satisfying Depends: openssh-clients  (NULL)
[x86_64] MI2a:         maybe install (a direct target): openssh-clients 9.6p1-alt3:sisyphus+375192.100.1.1@1739876264
[x86_64] MI2a:        target SELECTED: openssh-clients 9.6p1-alt3:sisyphus+375192.100.1.1@1739876264
[x86_64] MI2a:        requesting to install openssh-clients (unspec'd ver; inspect with Debug::pkgMark-shallow)
[x86_64] MI2a:          marked for install (shallow): openssh-clients
[x86_64] MI2a:           satisfying Depends: libedit.so.3()(64bit) >= set:lhWGuYssHIHdrdUMkCSKehhHZ5VJp
[x86_64] MI2a:            maybe install (a providing target): libedit3 3.1.20230828-alt1:sisyphus+330914.200.3.1@1696922743
[x86_64] MI2a:           target SELECTED: libedit3 3.1.20230828-alt1:sisyphus+330914.200.3.1@1696922743
[x86_64] MI2a:           requesting to install libedit3 (unspec'd ver; inspect with Debug::pkgMark-shallow)
[x86_64] MI2a:             marked for install (shallow): libedit3
[x86_64] MI2a:           satisfying Depends: openssh-common = 9.6p1-alt3:sisyphus+375192.100.1.1
[x86_64] MI2a:            maybe install (a direct target): openssh-common 9.6p1-alt3:sisyphus+375192.100.1.1@1739876264
[x86_64] MI2a:           target SELECTED: openssh-common 9.6p1-alt3:sisyphus+375192.100.1.1@1739876264
[x86_64] MI2a:           requesting to install openssh-common (unspec'd ver; inspect with Debug::pkgMark-shallow)
[x86_64] MI2a:             marked for install (shallow): openssh-common
[x86_64] MI2a:        satisfying Depends: rsync  (NULL)
[x86_64] MI2a:         maybe install (a direct target): rsync 3.2.7-alt3:sisyphus+372266.100.1.1@1738342240
[x86_64] MI2a:        target SELECTED: rsync 3.2.7-alt3:sisyphus+372266.100.1.1@1738342240
[x86_64] MI2a:        requesting to install rsync (unspec'd ver; inspect with Debug::pkgMark-shallow)
[x86_64] MI2a:          marked for install (shallow): rsync
[x86_64] MI2a:           satisfying Depends: liblz4.so.1()(64bit) >= set:kiCcQyocph1
[x86_64] MI2a:            maybe install (a providing target): liblz4 1:1.9.4-alt1:sisyphus+309416.100.1.1@1667412981
[x86_64] MI2a:           target SELECTED: liblz4 1:1.9.4-alt1:sisyphus+309416.100.1.1@1667412981
[x86_64] MI2a:           requesting to install liblz4 (unspec'd ver; inspect with Debug::pkgMark-shallow)
[x86_64] MI2a:             marked for install (shallow): liblz4
[x86_64] MI2a:           satisfying Depends: libxxhash.so.0()(64bit) >= set:jfZBMUbEvmMOgpHZd1XHq1GRAcBUVS9HGd0
[x86_64] MI2a:            maybe install (a providing target): libxxhash 0.8.2-alt1:sisyphus+336514.200.7.1@1702672118
[x86_64] MI2a:           target SELECTED: libxxhash 0.8.2-alt1:sisyphus+336514.200.7.1@1702672118
[x86_64] MI2a:           requesting to install libxxhash (unspec'd ver; inspect with Debug::pkgMark-shallow)
[x86_64] MI2a:             marked for install (shallow): libxxhash
[x86_64] MI2a: marked for install (shallow): boost-devel
[x86_64] MI2a:  satisfying Depends: libquadmath-devel  (NULL)
[x86_64] MI2a:   maybe install (a direct target): libquadmath-devel 14-alt1:sisyphus+360995.300.1.1@1730139222
[x86_64] MI2a:  target SELECTED: libquadmath-devel 14-alt1:sisyphus+360995.300.1.1@1730139222
[x86_64] MI2a:  requesting to install libquadmath-devel (unspec'd ver; inspect with Debug::pkgMark-shallow)
[x86_64] MI2a:    marked for install (shallow): libquadmath-devel
[x86_64] MI2a:     satisfying Depends: libquadmath14-devel  (NULL)
[x86_64] MI2a:      maybe install (a direct target): libquadmath14-devel 14.2.1-alt1:sisyphus+360995.100.1.1@1730131018
[x86_64] MI2a:     target SELECTED: libquadmath14-devel 14.2.1-alt1:sisyphus+360995.100.1.1@1730131018
[x86_64] MI2a:     requesting to install libquadmath14-devel (unspec'd ver; inspect with Debug::pkgMark-shallow)
[x86_64] MI2a:       marked for install (shallow): libquadmath14-devel
[x86_64] MI2a:        satisfying Depends: libquadmath0 = 14.2.1-alt1:sisyphus+360995.100.1.1
[x86_64] MI2a:         maybe install (a direct target): libquadmath0 14.2.1-alt1:sisyphus+360995.100.1.1@1730131018
[x86_64] MI2a:        target SELECTED: libquadmath0 14.2.1-alt1:sisyphus+360995.100.1.1@1730131018
[x86_64] MI2a:        requesting to install libquadmath0 (unspec'd ver; inspect with Debug::pkgMark-shallow)
[x86_64] MI2a:          marked for install (shallow): libquadmath0
[x86_64] MI2a:  satisfying PreDepends: boost-devel-headers = 1:1.86.0-alt2:sisyphus+375553.1040.4.1
[x86_64] MI2a:   maybe install (a direct target): boost-devel-headers 1:1.86.0-alt2:sisyphus+375553.1040.4.1@1740170417
[x86_64] MI2a:  target SELECTED: boost-devel-headers 1:1.86.0-alt2:sisyphus+375553.1040.4.1@1740170417
[x86_64] MI2a:  requesting to install boost-devel-headers (unspec'd ver; inspect with Debug::pkgMark-shallow)
[x86_64] MI2a:    marked for install (shallow): boost-devel-headers
[x86_64] MI2a:  satisfying Depends: libboost_atomic1.86.0 = 1:1.86.0-alt2:sisyphus+375553.1040.4.1
[x86_64] MI2a:   maybe install (a direct target): libboost_atomic1.86.0 1:1.86.0-alt2:sisyphus+375553.1040.4.1@1740170417
[x86_64] MI2a:  target SELECTED: libboost_atomic1.86.0 1:1.86.0-alt2:sisyphus+375553.1040.4.1@1740170417
[x86_64] MI2a:  requesting to install libboost_atomic1.86.0 (unspec'd ver; inspect with Debug::pkgMark-shallow)
[x86_64] MI2a:    marked for install (shallow): libboost_atomic1.86.0
[x86_64] MI2a:     satisfying Depends: libboost_system1.86.0 = 1:1.86.0-alt2:sisyphus+375553.1040.4.1
[x86_64] MI2a:      maybe install (a direct target): libboost_system1.86.0 1:1.86.0-alt2:sisyphus+375553.1040.4.1@1740170417
[x86_64] MI2a:     target SELECTED: libboost_system1.86.0 1:1.86.0-alt2:sisyphus+375553.1040.4.1@1740170417
[x86_64] MI2a:     requesting to install libboost_system1.86.0 (unspec'd ver; inspect with Debug::pkgMark-shallow)
[x86_64] MI2a:       marked for install (shallow): libboost_system1.86.0
[x86_64] MI2a:  satisfying Depends: libboost_charconv1.86.0 = 1:1.86.0-alt2:sisyphus+375553.1040.4.1
[x86_64] MI2a:   maybe install (a direct target): libboost_charconv1.86.0 1:1.86.0-alt2:sisyphus+375553.1040.4.1@1740170417
[x86_64] MI2a:  target SELECTED: libboost_charconv1.86.0 1:1.86.0-alt2:sisyphus+375553.1040.4.1@1740170417
[x86_64] MI2a:  requesting to install libboost_charconv1.86.0 (unspec'd ver; inspect with Debug::pkgMark-shallow)
[x86_64] MI2a:    marked for install (shallow): libboost_charconv1.86.0
[x86_64] MI2a:  satisfying Depends: libboost_container1.86.0 = 1:1.86.0-alt2:sisyphus+375553.1040.4.1
[x86_64] MI2a:   maybe install (a direct target): libboost_container1.86.0 1:1.86.0-alt2:sisyphus+375553.1040.4.1@1740170417
[x86_64] MI2a:  target SELECTED: libboost_container1.86.0 1:1.86.0-alt2:sisyphus+375553.1040.4.1@1740170417
[x86_64] MI2a:  requesting to install libboost_container1.86.0 (unspec'd ver; inspect with Debug::pkgMark-shallow)
[x86_64] MI2a:    marked for install (shallow): libboost_container1.86.0
[x86_64] MI2a:  satisfying Depends: libboost_contract1.86.0 = 1:1.86.0-alt2:sisyphus+375553.1040.4.1
[x86_64] MI2a:   maybe install (a direct target): libboost_contract1.86.0 1:1.86.0-alt2:sisyphus+375553.1040.4.1@1740170417
[x86_64] MI2a:  target SELECTED: libboost_contract1.86.0 1:1.86.0-alt2:sisyphus+375553.1040.4.1@1740170417
[x86_64] MI2a:  requesting to install libboost_contract1.86.0 (unspec'd ver; inspect with Debug::pkgMark-shallow)
[x86_64] MI2a:    marked for install (shallow): libboost_contract1.86.0
[x86_64] MI2a:  satisfying Depends: libboost_date_time1.86.0 = 1:1.86.0-alt2:sisyphus+375553.1040.4.1
[x86_64] MI2a:   maybe install (a direct target): libboost_date_time1.86.0 1:1.86.0-alt2:sisyphus+375553.1040.4.1@1740170417
[x86_64] MI2a:  target SELECTED: libboost_date_time1.86.0 1:1.86.0-alt2:sisyphus+375553.1040.4.1@1740170417
[x86_64] MI2a:  requesting to install libboost_date_time1.86.0 (unspec'd ver; inspect with Debug::pkgMark-shallow)
[x86_64] MI2a:    marked for install (shallow): libboost_date_time1.86.0
[x86_64] MI2a:  satisfying Depends: libboost_graph1.86.0 = 1:1.86.0-alt2:sisyphus+375553.1040.4.1
[x86_64] MI2a:   maybe install (a direct target): libboost_graph1.86.0 1:1.86.0-alt2:sisyphus+375553.1040.4.1@1740170417
[x86_64] MI2a:  target SELECTED: libboost_graph1.86.0 1:1.86.0-alt2:sisyphus+375553.1040.4.1@1740170417
[x86_64] MI2a:  requesting to install libboost_graph1.86.0 (unspec'd ver; inspect with Debug::pkgMark-shallow)
[x86_64] MI2a:    marked for install (shallow): libboost_graph1.86.0
[x86_64] MI2a:     satisfying Depends: libboost_regex1.86.0 = 1:1.86.0-alt2:sisyphus+375553.1040.4.1
[x86_64] MI2a:      maybe install (a direct target): libboost_regex1.86.0 1:1.86.0-alt2:sisyphus+375553.1040.4.1@1740170417
[x86_64] MI2a:     target SELECTED: libboost_regex1.86.0 1:1.86.0-alt2:sisyphus+375553.1040.4.1@1740170417
[x86_64] MI2a:     requesting to install libboost_regex1.86.0 (unspec'd ver; inspect with Debug::pkgMark-shallow)
[x86_64] MI2a:       marked for install (shallow): libboost_regex1.86.0
[x86_64] MI2a:  satisfying Depends: libboost_json1.86.0 = 1:1.86.0-alt2:sisyphus+375553.1040.4.1
[x86_64] MI2a:   maybe install (a direct target): libboost_json1.86.0 1:1.86.0-alt2:sisyphus+375553.1040.4.1@1740170417
[x86_64] MI2a:  target SELECTED: libboost_json1.86.0 1:1.86.0-alt2:sisyphus+375553.1040.4.1@1740170417
[x86_64] MI2a:  requesting to install libboost_json1.86.0 (unspec'd ver; inspect with Debug::pkgMark-shallow)
[x86_64] MI2a:    marked for install (shallow): libboost_json1.86.0
[x86_64] MI2a:  satisfying Depends: libboost_iostreams1.86.0 = 1:1.86.0-alt2:sisyphus+375553.1040.4.1
[x86_64] MI2a:   maybe install (a direct target): libboost_iostreams1.86.0 1:1.86.0-alt2:sisyphus+375553.1040.4.1@1740170417
[x86_64] MI2a:  target SELECTED: libboost_iostreams1.86.0 1:1.86.0-alt2:sisyphus+375553.1040.4.1@1740170417
[x86_64] MI2a:  requesting to install libboost_iostreams1.86.0 (unspec'd ver; inspect with Debug::pkgMark-shallow)
[x86_64] MI2a:    marked for install (shallow): libboost_iostreams1.86.0
[x86_64] MI2a:  satisfying Depends: libboost_process1.86.0 = 1:1.86.0-alt2:sisyphus+375553.1040.4.1
[x86_64] MI2a:   maybe install (a direct target): libboost_process1.86.0 1:1.86.0-alt2:sisyphus+375553.1040.4.1@1740170417
[x86_64] MI2a:  target SELECTED: libboost_process1.86.0 1:1.86.0-alt2:sisyphus+375553.1040.4.1@1740170417
[x86_64] MI2a:  requesting to install libboost_process1.86.0 (unspec'd ver; inspect with Debug::pkgMark-shallow)
[x86_64] MI2a:    marked for install (shallow): libboost_process1.86.0
[x86_64] MI2a:     satisfying Depends: libboost_filesystem1.86.0 = 1:1.86.0-alt2:sisyphus+375553.1040.4.1
[x86_64] MI2a:      maybe install (a direct target): libboost_filesystem1.86.0 1:1.86.0-alt2:sisyphus+375553.1040.4.1@1740170417
[x86_64] MI2a:     target SELECTED: libboost_filesystem1.86.0 1:1.86.0-alt2:sisyphus+375553.1040.4.1@1740170417
[x86_64] MI2a:     requesting to install libboost_filesystem1.86.0 (unspec'd ver; inspect with Debug::pkgMark-shallow)
[x86_64] MI2a:       marked for install (shallow): libboost_filesystem1.86.0
[x86_64] MI2a:  satisfying Depends: libboost_random1.86.0 = 1:1.86.0-alt2:sisyphus+375553.1040.4.1
[x86_64] MI2a:   maybe install (a direct target): libboost_random1.86.0 1:1.86.0-alt2:sisyphus+375553.1040.4.1@1740170417
[x86_64] MI2a:  target SELECTED: libboost_random1.86.0 1:1.86.0-alt2:sisyphus+375553.1040.4.1@1740170417
[x86_64] MI2a:  requesting to install libboost_random1.86.0 (unspec'd ver; inspect with Debug::pkgMark-shallow)
[x86_64] MI2a:    marked for install (shallow): libboost_random1.86.0
[x86_64] MI2a:  satisfying Depends: libboost_serialization1.86.0 = 1:1.86.0-alt2:sisyphus+375553.1040.4.1
[x86_64] MI2a:   maybe install (a direct target): libboost_serialization1.86.0 1:1.86.0-alt2:sisyphus+375553.1040.4.1@1740170417
[x86_64] MI2a:  target SELECTED: libboost_serialization1.86.0 1:1.86.0-alt2:sisyphus+375553.1040.4.1@1740170417
[x86_64] MI2a:  requesting to install libboost_serialization1.86.0 (unspec'd ver; inspect with Debug::pkgMark-shallow)
[x86_64] MI2a:    marked for install (shallow): libboost_serialization1.86.0
[x86_64] MI2a:  satisfying Depends: libboost_test1.86.0 = 1:1.86.0-alt2:sisyphus+375553.1040.4.1
[x86_64] MI2a:   maybe install (a direct target): libboost_test1.86.0 1:1.86.0-alt2:sisyphus+375553.1040.4.1@1740170417
[x86_64] MI2a:  target SELECTED: libboost_test1.86.0 1:1.86.0-alt2:sisyphus+375553.1040.4.1@1740170417
[x86_64] MI2a:  requesting to install libboost_test1.86.0 (unspec'd ver; inspect with Debug::pkgMark-shallow)
[x86_64] MI2a:    marked for install (shallow): libboost_test1.86.0
[x86_64] MI2a:  satisfying Depends: libboost_timer1.86.0 = 1:1.86.0-alt2:sisyphus+375553.1040.4.1
[x86_64] MI2a:   maybe install (a direct target): libboost_timer1.86.0 1:1.86.0-alt2:sisyphus+375553.1040.4.1@1740170417
[x86_64] MI2a:  target SELECTED: libboost_timer1.86.0 1:1.86.0-alt2:sisyphus+375553.1040.4.1@1740170417
[x86_64] MI2a:  requesting to install libboost_timer1.86.0 (unspec'd ver; inspect with Debug::pkgMark-shallow)
[x86_64] MI2a:    marked for install (shallow): libboost_timer1.86.0
[x86_64] MI2a:     satisfying Depends: libboost_chrono1.86.0 = 1:1.86.0-alt2:sisyphus+375553.1040.4.1
[x86_64] MI2a:      maybe install (a direct target): libboost_chrono1.86.0 1:1.86.0-alt2:sisyphus+375553.1040.4.1@1740170417
[x86_64] MI2a:     target SELECTED: libboost_chrono1.86.0 1:1.86.0-alt2:sisyphus+375553.1040.4.1@1740170417
[x86_64] MI2a:     requesting to install libboost_chrono1.86.0 (unspec'd ver; inspect with Debug::pkgMark-shallow)
[x86_64] MI2a:       marked for install (shallow): libboost_chrono1.86.0
[x86_64] MI2a:  satisfying Depends: libboost_url1.86.0 = 1:1.86.0-alt2:sisyphus+375553.1040.4.1
[x86_64] MI2a:   maybe install (a direct target): libboost_url1.86.0 1:1.86.0-alt2:sisyphus+375553.1040.4.1@1740170417
[x86_64] MI2a:  target SELECTED: libboost_url1.86.0 1:1.86.0-alt2:sisyphus+375553.1040.4.1@1740170417
[x86_64] MI2a:  requesting to install libboost_url1.86.0 (unspec'd ver; inspect with Debug::pkgMark-shallow)
[x86_64] MI2a:    marked for install (shallow): libboost_url1.86.0
[x86_64] MI2a:  satisfying Depends: libboost_nowide1.86.0 = 1:1.86.0-alt2:sisyphus+375553.1040.4.1
[x86_64] MI2a:   maybe install (a direct target): libboost_nowide1.86.0 1:1.86.0-alt2:sisyphus+375553.1040.4.1@1740170417
[x86_64] MI2a:  target SELECTED: libboost_nowide1.86.0 1:1.86.0-alt2:sisyphus+375553.1040.4.1@1740170417
[x86_64] MI2a:  requesting to install libboost_nowide1.86.0 (unspec'd ver; inspect with Debug::pkgMark-shallow)
[x86_64] MI2a:    marked for install (shallow): libboost_nowide1.86.0
[x86_64] MI2a:  satisfying Depends: libboost_stacktrace1.86.0 = 1:1.86.0-alt2:sisyphus+375553.1040.4.1
[x86_64] MI2a:   maybe install (a direct target): libboost_stacktrace1.86.0 1:1.86.0-alt2:sisyphus+375553.1040.4.1@1740170417
[x86_64] MI2a:  target SELECTED: libboost_stacktrace1.86.0 1:1.86.0-alt2:sisyphus+375553.1040.4.1@1740170417
[x86_64] MI2a:  requesting to install libboost_stacktrace1.86.0 (unspec'd ver; inspect with Debug::pkgMark-shallow)
[x86_64] MI2a:    marked for install (shallow): libboost_stacktrace1.86.0
[x86_64] MI2a:  satisfying Depends: libboost_fiber1.86.0 = 1:1.86.0-alt2:sisyphus+375553.1040.4.1
[x86_64] MI2a:   maybe install (a direct target): libboost_fiber1.86.0 1:1.86.0-alt2:sisyphus+375553.1040.4.1@1740170417
[x86_64] MI2a:  target SELECTED: libboost_fiber1.86.0 1:1.86.0-alt2:sisyphus+375553.1040.4.1@1740170417
[x86_64] MI2a:  requesting to install libboost_fiber1.86.0 (unspec'd ver; inspect with Debug::pkgMark-shallow)
[x86_64] MI2a:    marked for install (shallow): libboost_fiber1.86.0
[x86_64] MI2a:     satisfying Depends: libboost_context1.86.0 = 1:1.86.0-alt2:sisyphus+375553.1040.4.1
[x86_64] MI2a:      maybe install (a direct target): libboost_context1.86.0 1:1.86.0-alt2:sisyphus+375553.1040.4.1@1740170417
[x86_64] MI2a:     target SELECTED: libboost_context1.86.0 1:1.86.0-alt2:sisyphus+375553.1040.4.1@1740170417
[x86_64] MI2a:     requesting to install libboost_context1.86.0 (unspec'd ver; inspect with Debug::pkgMark-shallow)
[x86_64] MI2a:       marked for install (shallow): libboost_context1.86.0
[x86_64] MI2a:  satisfying Depends: libboost_type_erasure1.86.0 = 1:1.86.0-alt2:sisyphus+375553.1040.4.1
[x86_64] MI2a:   maybe install (a direct target): libboost_type_erasure1.86.0 1:1.86.0-alt2:sisyphus+375553.1040.4.1@1740170417
[x86_64] MI2a:  target SELECTED: libboost_type_erasure1.86.0 1:1.86.0-alt2:sisyphus+375553.1040.4.1@1740170417
[x86_64] MI2a:  requesting to install libboost_type_erasure1.86.0 (unspec'd ver; inspect with Debug::pkgMark-shallow)
[x86_64] MI2a:    marked for install (shallow): libboost_type_erasure1.86.0
[x86_64] MI2a:     satisfying Depends: libboost_thread1.86.0 = 1:1.86.0-alt2:sisyphus+375553.1040.4.1
[x86_64] MI2a:      maybe install (a direct target): libboost_thread1.86.0 1:1.86.0-alt2:sisyphus+375553.1040.4.1@1740170417
[x86_64] MI2a:     target SELECTED: libboost_thread1.86.0 1:1.86.0-alt2:sisyphus+375553.1040.4.1@1740170417
[x86_64] MI2a:     requesting to install libboost_thread1.86.0 (unspec'd ver; inspect with Debug::pkgMark-shallow)
[x86_64] MI2a:       marked for install (shallow): libboost_thread1.86.0
[x86_64] MI2a: marked for install (shallow): libdrm-devel
[x86_64] MI2a:  satisfying Depends: libdrm = 1:2.4.124-alt1:sisyphus+364215.100.1.1
[x86_64] MI2a:   maybe install (a direct target): libdrm 1:2.4.124-alt1:sisyphus+364215.100.1.1@1733469813
[x86_64] MI2a:  target SELECTED: libdrm 1:2.4.124-alt1:sisyphus+364215.100.1.1@1733469813
[x86_64] MI2a:  requesting to install libdrm (unspec'd ver; inspect with Debug::pkgMark-shallow)
[x86_64] MI2a:    marked for install (shallow): libdrm
[x86_64] MI2a:     satisfying Depends: libpciaccess.so.0()(64bit) >= set:jg2mIoosst4k
[x86_64] MI2a:      maybe install (a providing target): libpciaccess 1:0.18.1-alt1:sisyphus+343583.300.1.1@1711440789
[x86_64] MI2a:     target SELECTED: libpciaccess 1:0.18.1-alt1:sisyphus+343583.300.1.1@1711440789
[x86_64] MI2a:     requesting to install libpciaccess (unspec'd ver; inspect with Debug::pkgMark-shallow)
[x86_64] MI2a:       marked for install (shallow): libpciaccess
[x86_64] MI2a: marked for install (shallow): hwdata-devel
[x86_64] MI2a:  satisfying Depends: hwdata = 0.384-alt1:sisyphus+354460.100.1.1
[x86_64] MI2a:   maybe install (a direct target): hwdata 0.384-alt1:sisyphus+354460.100.1.1@1722898493
[x86_64] MI2a:  target SELECTED: hwdata 0.384-alt1:sisyphus+354460.100.1.1@1722898493
[x86_64] MI2a:  requesting to install hwdata (unspec'd ver; inspect with Debug::pkgMark-shallow)
[x86_64] MI2a:    marked for install (shallow): hwdata
[x86_64] MI2a:     satisfying Depends: pciids  (NULL)
[x86_64] MI2a:      maybe install (a direct target): pciids 20250217-alt1:sisyphus+375008.100.1.1@1739903499
[x86_64] MI2a:     target SELECTED: pciids 20250217-alt1:sisyphus+375008.100.1.1@1739903499
[x86_64] MI2a:     requesting to install pciids (unspec'd ver; inspect with Debug::pkgMark-shallow)
[x86_64] MI2a:       marked for install (shallow): pciids
[x86_64] MI2a:     satisfying Depends: usbids  (NULL)
[x86_64] MI2a:      maybe install (a direct target): usbids 20240206-alt1:sisyphus+339943.100.1.1@1707270512
[x86_64] MI2a:     target SELECTED: usbids 20240206-alt1:sisyphus+339943.100.1.1@1707270512
[x86_64] MI2a:     requesting to install usbids (unspec'd ver; inspect with Debug::pkgMark-shallow)
[x86_64] MI2a:       marked for install (shallow): usbids
[x86_64] rpm-macros-meson is already the newest version.
[x86_64] E: Couldn't find package python3-module-hwdata
[x86_64] hsh-install: Failed to calculate package file list.
[x86_64] hsh-install: Failed to generate package file list.
2025-Feb-26 09:12:51 :: [x86_64] tuxclocker.git 1.5.1-alt1: remote: cannot build src.rpm
2025-Feb-26 09:12:51 :: [x86_64] #100 tuxclocker.git 1.5.1-alt1: build FAILED
2025-Feb-26 09:12:51 :: [x86_64] requesting cancellation of task processing
2025-Feb-26 09:12:57 :: [aarch64] #100 tuxclocker.git 1.5.1-alt1: build SKIPPED
2025-Feb-26 09:12:59 :: [ppc64le] #100 tuxclocker.git 1.5.1-alt1: build SKIPPED
2025-Feb-26 09:12:51 :: [x86_64] build FAILED
2025-Feb-26 09:12:59 :: task #376155 for sisyphus FAILED


^ permalink raw reply	[flat|nested] only message in thread

only message in thread, other threads:[~2025-02-26  9:12 UTC | newest]

Thread overview: (only message) (download: mbox.gz / follow: Atom feed)
-- links below jump to the message on this page --
2025-02-26  9:12 [#376155] [test-only] FAILED tuxclocker.git=1.5.1-alt1 Girar awaiter (minergenon)

ALT Linux Girar Builder robot reports

This inbox may be cloned and mirrored by anyone:

	git clone --mirror http://lore.altlinux.org/sisyphus-incominger/0 sisyphus-incominger/git/0.git

	# If you have public-inbox 1.1+ installed, you may
	# initialize and index your mirror using the following commands:
	public-inbox-init -V2 sisyphus-incominger sisyphus-incominger/ http://lore.altlinux.org/sisyphus-incominger \
		sisyphus-incominger@lists.altlinux.org sisyphus-incominger@lists.altlinux.ru sisyphus-incominger@lists.altlinux.com
	public-inbox-index sisyphus-incominger

Example config snippet for mirrors.
Newsgroup available over NNTP:
	nntp://lore.altlinux.org/org.altlinux.lists.sisyphus-incominger


AGPL code for this site: git clone https://public-inbox.org/public-inbox.git