ALT Linux Girar Builder robot reports
 help / color / mirror / Atom feed
From: "Girar awaiter (alton)" <girar-builder@altlinux.org>
To: Anton Meleshnikov <alton@altlinux.org>
Cc: girar-builder-p10@altlinux.org,
	sisyphus-incominger@lists.altlinux.org,
	girar-builder-p10@lists.altlinux.org
Subject: [#376146] [test-only] p10 FAILED (try 3) python3-module-setuptools_rust.git=1.9.0-alt1 ...
Date: Wed, 26 Feb 2025 10:07:21 +0000
Message-ID: <girar.task.376146.3.1@gyle.mskdc.altlinux.org> (raw)
In-Reply-To: <girar.task.376146.1.1@gyle.mskdc.altlinux.org>

https://git.altlinux.org/tasks/376146/logs/events.3.1.log
https://packages.altlinux.org/tasks/376146

subtask  name                            aarch64    armh    i586  x86_64
    #10  python3-module-setuptools_rust   failed  failed  failed  failed

2025-Feb-26 10:06:28 :: test-only task #376146 for p10 resumed by alton:
2025-Feb-26 10:06:28 :: message: new_package
#10 build 1.9.0-alt1 from /gears/p/python3-module-setuptools_rust.git fetched at 2025-Feb-26 10:05:21 from p11
#20 build python3-module-maturin-1.5.1-alt1.src.rpm from p11
#40 build python3-module-watchfiles-0.21.0-alt2.src.rpm from p11
#100 build 0.4.6-alt1 from /gears/p/python3-module-colorama.git fetched at 2025-Feb-26 08:17:00 from p11
#200 build 2024.4.16-alt1 from /gears/p/python3-module-sphinx-autobuild.git fetched at 2025-Feb-26 08:17:58 from p11
#300 build 2021.13.0-alt1.1 from /gears/t/tbb.git fetched at 2025-Feb-26 08:18:53 from p11
#400 build 2.31.0-alt1 from /gears/m/mold.git fetched at 2025-Feb-26 08:19:53 from p11
#500 build 0.8.0-alt1 from /gears/p/python3-module-pyproject-metadata.git fetched at 2025-Feb-26 08:20:59 from p11
#600 build 1.8.0-alt1 from /gears/p/python3-module-nodeenv.git fetched at 2025-Feb-26 08:21:54 from p11
#700 build 0.2.0b2-alt1 from /gears/p/python3-module-sphinx-theme-builder.git fetched at 2025-Feb-26 08:22:40 from p11
#1000 build 2024.01.29-alt1 from /gears/p/python3-module-furo.git fetched at 2025-Feb-26 08:23:23 from p11
#1100 build 18.1.8-alt0.2 from /gears/l/llvm18.1.git fetched at 2025-Feb-26 08:24:26 from p11
#1200 build 18.1.0-alt2 from /gears/l/llvm-common.git fetched at 2025-Feb-26 08:25:03 from p11
#1300 build 10.2.1-alt1 from /gears/l/libfmt.git fetched at 2025-Feb-26 08:25:42 from p11
#1400 build 2.0.1-alt1 from /gears/c/cmrc.git fetched at 2025-Feb-26 08:26:26 from p11
#1500 build 2023.09.15-alt1 from /gears/v/vcpkg.git fetched at 2025-Feb-26 08:27:12 from p11
#1600 build 1.84.1-alt1 from /gears/r/rust.git fetched at 2025-Feb-26 08:30:09 from p11
#1700 build 1.3.7-alt1 from /gears/r/rustdesk.git fetched at 2025-Feb-26 08:31:57 from p11
2025-Feb-26 10:06:28 :: created build repo
2025-Feb-26 10:06:29 :: #20: force rebuild
2025-Feb-26 10:06:29 :: [armh] #10 python3-module-setuptools_rust.git 1.9.0-alt1: build start
2025-Feb-26 10:06:29 :: [aarch64] #10 python3-module-setuptools_rust.git 1.9.0-alt1: build start
2025-Feb-26 10:06:29 :: [x86_64] #10 python3-module-setuptools_rust.git 1.9.0-alt1: build start
2025-Feb-26 10:06:29 :: [i586] #10 python3-module-setuptools_rust.git 1.9.0-alt1: build start
[x86_64] Processing files: python3-module-setuptools_rust-1.9.0-alt1
[x86_64] error: No such file or directory: /usr/src/tmp/python3-module-setuptools_rust-buildroot/usr/lib/python3/site-packages/setuptools_rust
[x86_64] error: No such file or directory: /usr/src/tmp/python3-module-setuptools_rust-buildroot/usr/lib/python3/site-packages/setuptools_rust-1.9.0.dist-info
[x86_64] RPM build errors:
[x86_64]     No such file or directory: /usr/src/tmp/python3-module-setuptools_rust-buildroot/usr/lib/python3/site-packages/setuptools_rust
[x86_64]     No such file or directory: /usr/src/tmp/python3-module-setuptools_rust-buildroot/usr/lib/python3/site-packages/setuptools_rust-1.9.0.dist-info
2025-Feb-26 10:06:51 :: [x86_64] python3-module-setuptools_rust.git 1.9.0-alt1: remote: build failed
2025-Feb-26 10:06:51 :: [x86_64] #10 python3-module-setuptools_rust.git 1.9.0-alt1: build FAILED
2025-Feb-26 10:06:51 :: [x86_64] requesting cancellation of task processing
[i586] Processing files: python3-module-setuptools_rust-1.9.0-alt1
[i586] error: No such file or directory: /usr/src/tmp/python3-module-setuptools_rust-buildroot/usr/lib/python3/site-packages/setuptools_rust
[i586] error: No such file or directory: /usr/src/tmp/python3-module-setuptools_rust-buildroot/usr/lib/python3/site-packages/setuptools_rust-1.9.0.dist-info
[i586] RPM build errors:
[i586]     No such file or directory: /usr/src/tmp/python3-module-setuptools_rust-buildroot/usr/lib/python3/site-packages/setuptools_rust
[i586]     No such file or directory: /usr/src/tmp/python3-module-setuptools_rust-buildroot/usr/lib/python3/site-packages/setuptools_rust-1.9.0.dist-info
2025-Feb-26 10:06:51 :: [i586] python3-module-setuptools_rust.git 1.9.0-alt1: remote: build failed
2025-Feb-26 10:06:51 :: [i586] #10 python3-module-setuptools_rust.git 1.9.0-alt1: build FAILED
[aarch64] Processing files: python3-module-setuptools_rust-1.9.0-alt1
[aarch64] error: No such file or directory: /usr/src/tmp/python3-module-setuptools_rust-buildroot/usr/lib/python3/site-packages/setuptools_rust
[aarch64] error: No such file or directory: /usr/src/tmp/python3-module-setuptools_rust-buildroot/usr/lib/python3/site-packages/setuptools_rust-1.9.0.dist-info
[aarch64] RPM build errors:
[aarch64]     No such file or directory: /usr/src/tmp/python3-module-setuptools_rust-buildroot/usr/lib/python3/site-packages/setuptools_rust
[aarch64]     No such file or directory: /usr/src/tmp/python3-module-setuptools_rust-buildroot/usr/lib/python3/site-packages/setuptools_rust-1.9.0.dist-info
2025-Feb-26 10:07:09 :: [aarch64] python3-module-setuptools_rust.git 1.9.0-alt1: remote: build failed
2025-Feb-26 10:07:09 :: [aarch64] #10 python3-module-setuptools_rust.git 1.9.0-alt1: build FAILED
[armh] Processing files: python3-module-setuptools_rust-1.9.0-alt1
[armh] error: No such file or directory: /usr/src/tmp/python3-module-setuptools_rust-buildroot/usr/lib/python3/site-packages/setuptools_rust
[armh] error: No such file or directory: /usr/src/tmp/python3-module-setuptools_rust-buildroot/usr/lib/python3/site-packages/setuptools_rust-1.9.0.dist-info
[armh] RPM build errors:
[armh]     No such file or directory: /usr/src/tmp/python3-module-setuptools_rust-buildroot/usr/lib/python3/site-packages/setuptools_rust
[armh]     No such file or directory: /usr/src/tmp/python3-module-setuptools_rust-buildroot/usr/lib/python3/site-packages/setuptools_rust-1.9.0.dist-info
2025-Feb-26 10:07:20 :: [armh] python3-module-setuptools_rust.git 1.9.0-alt1: remote: build failed
2025-Feb-26 10:07:20 :: [armh] #10 python3-module-setuptools_rust.git 1.9.0-alt1: build FAILED
2025-Feb-26 10:06:51 :: [x86_64] build FAILED
2025-Feb-26 10:06:51 :: [i586] build FAILED
2025-Feb-26 10:07:09 :: [aarch64] build FAILED
2025-Feb-26 10:07:21 :: [armh] build FAILED
2025-Feb-26 10:07:21 :: task #376146 for p10 FAILED


      parent reply	other threads:[~2025-02-26 10:07 UTC|newest]

Thread overview: 3+ messages / expand[flat|nested]  mbox.gz  Atom feed  top
2025-02-26  8:36 [#376146] [test-only] p10 FAILED python3-module-colorama.git=0.4.6-alt1 Girar awaiter (alton)
2025-02-26  9:34 ` [#376146] [test-only] p10 FAILED (try 2) srpm=python3-module-maturin-1.5.1-alt1.src.rpm Girar awaiter (alton)
2025-02-26 10:07 ` Girar awaiter (alton) [this message]

Reply instructions:

You may reply publicly to this message via plain-text email
using any one of the following methods:

* Save the following mbox file, import it into your mail client,
  and reply-to-all from there: mbox

  Avoid top-posting and favor interleaved quoting:
  https://en.wikipedia.org/wiki/Posting_style#Interleaved_style

* Reply using the --to, --cc, and --in-reply-to
  switches of git-send-email(1):

  git send-email \
    --in-reply-to=girar.task.376146.3.1@gyle.mskdc.altlinux.org \
    --to=girar-builder@altlinux.org \
    --cc=alton@altlinux.org \
    --cc=devel@lists.altlinux.org \
    --cc=girar-builder-p10@altlinux.org \
    --cc=girar-builder-p10@lists.altlinux.org \
    --cc=sisyphus-incominger@lists.altlinux.org \
    /path/to/YOUR_REPLY

  https://kernel.org/pub/software/scm/git/docs/git-send-email.html

* If your mail client supports setting the In-Reply-To header
  via mailto: links, try the mailto: link

ALT Linux Girar Builder robot reports

This inbox may be cloned and mirrored by anyone:

	git clone --mirror http://lore.altlinux.org/sisyphus-incominger/0 sisyphus-incominger/git/0.git

	# If you have public-inbox 1.1+ installed, you may
	# initialize and index your mirror using the following commands:
	public-inbox-init -V2 sisyphus-incominger sisyphus-incominger/ http://lore.altlinux.org/sisyphus-incominger \
		sisyphus-incominger@lists.altlinux.org sisyphus-incominger@lists.altlinux.ru sisyphus-incominger@lists.altlinux.com
	public-inbox-index sisyphus-incominger

Example config snippet for mirrors.
Newsgroup available over NNTP:
	nntp://lore.altlinux.org/org.altlinux.lists.sisyphus-incominger


AGPL code for this site: git clone https://public-inbox.org/public-inbox.git