ALT Linux Girar Builder robot reports
 help / color / mirror / Atom feed
* [#376146] [test-only] p10 FAILED python3-module-colorama.git=0.4.6-alt1 ...
@ 2025-02-26  8:36 Girar awaiter (alton)
  2025-02-26  9:34 ` [#376146] [test-only] p10 FAILED (try 2) srpm=python3-module-maturin-1.5.1-alt1.src.rpm Girar awaiter (alton)
  2025-02-26 10:07 ` [#376146] [test-only] p10 FAILED (try 3) python3-module-setuptools_rust.git=1.9.0-alt1 Girar awaiter (alton)
  0 siblings, 2 replies; 3+ messages in thread
From: Girar awaiter (alton) @ 2025-02-26  8:36 UTC (permalink / raw)
  To: Anton Meleshnikov
  Cc: girar-builder-p10, sisyphus-incominger, girar-builder-p10

https://git.altlinux.org/tasks/376146/logs/events.1.1.log
https://packages.altlinux.org/tasks/376146

subtask  name                             aarch64  armh    i586  x86_64
   #100  python3-module-colorama               39    52      24      24
   #200  python3-module-sphinx-autobuild   failed     ?  failed  failed

2025-Feb-26 08:35:01 :: test-only task #376146 for p10 started by alton:
2025-Feb-26 08:35:01 :: message: new_package
#100 build 0.4.6-alt1 from /gears/p/python3-module-colorama.git fetched at 2025-Feb-26 08:17:00 from p11
#200 build 2024.4.16-alt1 from /gears/p/python3-module-sphinx-autobuild.git fetched at 2025-Feb-26 08:17:58 from p11
#300 build 2021.13.0-alt1.1 from /gears/t/tbb.git fetched at 2025-Feb-26 08:18:53 from p11
#400 build 2.31.0-alt1 from /gears/m/mold.git fetched at 2025-Feb-26 08:19:53 from p11
#500 build 0.8.0-alt1 from /gears/p/python3-module-pyproject-metadata.git fetched at 2025-Feb-26 08:20:59 from p11
#600 build 1.8.0-alt1 from /gears/p/python3-module-nodeenv.git fetched at 2025-Feb-26 08:21:54 from p11
#700 build 0.2.0b2-alt1 from /gears/p/python3-module-sphinx-theme-builder.git fetched at 2025-Feb-26 08:22:40 from p11
#1000 build 2024.01.29-alt1 from /gears/p/python3-module-furo.git fetched at 2025-Feb-26 08:23:23 from p11
#1100 build 18.1.8-alt0.2 from /gears/l/llvm18.1.git fetched at 2025-Feb-26 08:24:26 from p11
#1200 build 18.1.0-alt2 from /gears/l/llvm-common.git fetched at 2025-Feb-26 08:25:03 from p11
#1300 build 10.2.1-alt1 from /gears/l/libfmt.git fetched at 2025-Feb-26 08:25:42 from p11
#1400 build 2.0.1-alt1 from /gears/c/cmrc.git fetched at 2025-Feb-26 08:26:26 from p11
#1500 build 2023.09.15-alt1 from /gears/v/vcpkg.git fetched at 2025-Feb-26 08:27:12 from p11
#1600 build 1.84.1-alt1 from /gears/r/rust.git fetched at 2025-Feb-26 08:30:09 from p11
#1700 build 1.3.7-alt1 from /gears/r/rustdesk.git fetched at 2025-Feb-26 08:31:57 from p11
2025-Feb-26 08:35:01 :: created build repo
2025-Feb-26 08:35:02 :: [i586] #100 python3-module-colorama.git 0.4.6-alt1: build start
2025-Feb-26 08:35:02 :: [armh] #100 python3-module-colorama.git 0.4.6-alt1: build start
2025-Feb-26 08:35:02 :: [aarch64] #100 python3-module-colorama.git 0.4.6-alt1: build start
2025-Feb-26 08:35:02 :: [x86_64] #100 python3-module-colorama.git 0.4.6-alt1: build start
2025-Feb-26 08:35:26 :: [i586] #100 python3-module-colorama.git 0.4.6-alt1: build OK
2025-Feb-26 08:35:26 :: [x86_64] #100 python3-module-colorama.git 0.4.6-alt1: build OK
2025-Feb-26 08:35:26 :: [i586] #200 python3-module-sphinx-autobuild.git 2024.4.16-alt1: build start
2025-Feb-26 08:35:26 :: [x86_64] #200 python3-module-sphinx-autobuild.git 2024.4.16-alt1: build start
2025-Feb-26 08:35:41 :: [aarch64] #100 python3-module-colorama.git 0.4.6-alt1: build OK
2025-Feb-26 08:35:41 :: [aarch64] #200 python3-module-sphinx-autobuild.git 2024.4.16-alt1: build start
[x86_64] Requirement already satisfied: sphinx in /usr/lib/python3/site-packages (from sphinx-autobuild==2024.4.16) (4.0.2)
[x86_64] ERROR: Could not find a version that satisfies the requirement watchfiles>=0.20 (from sphinx-autobuild) (from versions: none)
[x86_64] ERROR: No matching distribution found for watchfiles>=0.20
[x86_64] ERROR: invocation failed (exit code 1)
[x86_64] py3 finish: installpkg /usr/src/RPM/BUILD/python3-module-sphinx-autobuild-2024.4.16/.tox/.tmp/package/1/sphinx_autobuild-2024.4.16-py3-none-any.whl after 0.71 seconds
[x86_64] ___________________________________ summary ____________________________________
[x86_64] ERROR:   py3: InvocationError for command /usr/src/RPM/BUILD/python3-module-sphinx-autobuild-2024.4.16/.tox/py3/bin/python -m pip install --exists-action w .tox/.tmp/package/1/sphinx_autobuild-2024.4.16-py3-none-any.whl (exited with code 1)
[x86_64] cleanup /usr/src/RPM/BUILD/python3-module-sphinx-autobuild-2024.4.16/.tox/.tmp/package/1/sphinx_autobuild-2024.4.16-py3-none-any.whl
2025-Feb-26 08:35:49 :: [x86_64] python3-module-sphinx-autobuild.git 2024.4.16-alt1: remote: build failed
2025-Feb-26 08:35:49 :: [x86_64] #200 python3-module-sphinx-autobuild.git 2024.4.16-alt1: build FAILED
2025-Feb-26 08:35:49 :: [x86_64] requesting cancellation of task processing
[i586] Processing ./.tox/.tmp/package/1/sphinx_autobuild-2024.4.16-py3-none-any.whl
[i586] ERROR: Could not find a version that satisfies the requirement watchfiles>=0.20 (from sphinx-autobuild) (from versions: none)
[i586] ERROR: No matching distribution found for watchfiles>=0.20
[i586] ERROR: invocation failed (exit code 1)
[i586] py3 finish: installpkg /usr/src/RPM/BUILD/python3-module-sphinx-autobuild-2024.4.16/.tox/.tmp/package/1/sphinx_autobuild-2024.4.16-py3-none-any.whl after 0.80 seconds
[i586] ___________________________________ summary ____________________________________
[i586] ERROR:   py3: InvocationError for command /usr/src/RPM/BUILD/python3-module-sphinx-autobuild-2024.4.16/.tox/py3/bin/python -m pip install --exists-action w .tox/.tmp/package/1/sphinx_autobuild-2024.4.16-py3-none-any.whl (exited with code 1)
[i586] cleanup /usr/src/RPM/BUILD/python3-module-sphinx-autobuild-2024.4.16/.tox/.tmp/package/1/sphinx_autobuild-2024.4.16-py3-none-any.whl
2025-Feb-26 08:35:50 :: [i586] python3-module-sphinx-autobuild.git 2024.4.16-alt1: remote: build failed
2025-Feb-26 08:35:50 :: [i586] #200 python3-module-sphinx-autobuild.git 2024.4.16-alt1: build FAILED
2025-Feb-26 08:35:54 :: [armh] #100 python3-module-colorama.git 0.4.6-alt1: build OK
2025-Feb-26 08:35:54 :: [armh] task processing CANCELLED
[aarch64] Processing ./.tox/.tmp/package/1/sphinx_autobuild-2024.4.16-py3-none-any.whl
[aarch64] ERROR: Could not find a version that satisfies the requirement uvicorn>=0.25 (from sphinx-autobuild) (from versions: none)
[aarch64] ERROR: No matching distribution found for uvicorn>=0.25
[aarch64] ERROR: invocation failed (exit code 1)
[aarch64] py3 finish: installpkg /usr/src/RPM/BUILD/python3-module-sphinx-autobuild-2024.4.16/.tox/.tmp/package/1/sphinx_autobuild-2024.4.16-py3-none-any.whl after 1.39 seconds
[aarch64] ___________________________________ summary ____________________________________
[aarch64] ERROR:   py3: InvocationError for command /usr/src/RPM/BUILD/python3-module-sphinx-autobuild-2024.4.16/.tox/py3/bin/python -m pip install --exists-action w .tox/.tmp/package/1/sphinx_autobuild-2024.4.16-py3-none-any.whl (exited with code 1)
[aarch64] cleanup /usr/src/RPM/BUILD/python3-module-sphinx-autobuild-2024.4.16/.tox/.tmp/package/1/sphinx_autobuild-2024.4.16-py3-none-any.whl
2025-Feb-26 08:36:20 :: [aarch64] python3-module-sphinx-autobuild.git 2024.4.16-alt1: remote: build failed
2025-Feb-26 08:36:20 :: [aarch64] #200 python3-module-sphinx-autobuild.git 2024.4.16-alt1: build FAILED
2025-Feb-26 08:35:49 :: [x86_64] build FAILED
2025-Feb-26 08:35:50 :: [i586] build FAILED
2025-Feb-26 08:35:55 :: [armh] build FAILED
2025-Feb-26 08:36:20 :: [aarch64] build FAILED
2025-Feb-26 08:36:20 :: task #376146 for p10 FAILED


^ permalink raw reply	[flat|nested] 3+ messages in thread

end of thread, other threads:[~2025-02-26 10:07 UTC | newest]

Thread overview: 3+ messages (download: mbox.gz / follow: Atom feed)
-- links below jump to the message on this page --
2025-02-26  8:36 [#376146] [test-only] p10 FAILED python3-module-colorama.git=0.4.6-alt1 Girar awaiter (alton)
2025-02-26  9:34 ` [#376146] [test-only] p10 FAILED (try 2) srpm=python3-module-maturin-1.5.1-alt1.src.rpm Girar awaiter (alton)
2025-02-26 10:07 ` [#376146] [test-only] p10 FAILED (try 3) python3-module-setuptools_rust.git=1.9.0-alt1 Girar awaiter (alton)

ALT Linux Girar Builder robot reports

This inbox may be cloned and mirrored by anyone:

	git clone --mirror http://lore.altlinux.org/sisyphus-incominger/0 sisyphus-incominger/git/0.git

	# If you have public-inbox 1.1+ installed, you may
	# initialize and index your mirror using the following commands:
	public-inbox-init -V2 sisyphus-incominger sisyphus-incominger/ http://lore.altlinux.org/sisyphus-incominger \
		sisyphus-incominger@lists.altlinux.org sisyphus-incominger@lists.altlinux.ru sisyphus-incominger@lists.altlinux.com
	public-inbox-index sisyphus-incominger

Example config snippet for mirrors.
Newsgroup available over NNTP:
	nntp://lore.altlinux.org/org.altlinux.lists.sisyphus-incominger


AGPL code for this site: git clone https://public-inbox.org/public-inbox.git