ALT Linux Girar Builder robot reports
 help / color / mirror / Atom feed
* [#375938] p11 FAILED librime.git=1.13.1-alt1
@ 2025-02-24 20:46 Girar awaiter (rider)
  2025-02-26 12:08 ` [#375938] p11 FAILED (try 2) glog.git=0.7.1-alt1 librime.git=1.13.1-alt1 Girar awaiter (rider)
  2025-02-26 12:34 ` [#375938] p11 FAILED (try 3) glog.git=0.7.1-alt1 librime.git=1.13.1-alt1 libopencv.git=4.10.0-alt2 Girar awaiter (rider)
  0 siblings, 2 replies; 3+ messages in thread
From: Girar awaiter (rider) @ 2025-02-24 20:46 UTC (permalink / raw)
  To: Anton Farygin; +Cc: sisyphus-incominger, girar-builder-p11, girar-builder-p11

https://git.altlinux.org/tasks/375938/logs/events.1.1.log
https://packages.altlinux.org/tasks/375938

subtask  name     aarch64    i586  x86_64
   #100  librime   failed  failed  failed

2025-Feb-24 20:45:12 :: task #375938 for p11 started by rider:
2025-Feb-24 20:45:12 :: message: version update
#100 build 1.13.1-alt1 from /people/rider/packages/librime.git fetched at 2025-Feb-24 16:40:12
2025-Feb-24 20:45:14 :: [i586] #100 librime.git 1.13.1-alt1: build start
2025-Feb-24 20:45:14 :: [x86_64] #100 librime.git 1.13.1-alt1: build start
2025-Feb-24 20:45:14 :: [aarch64] #100 librime.git 1.13.1-alt1: build start
[x86_64] /usr/src/RPM/BUILD/librime-1.13.1/src/rime/setup.cc: In function 'void rime::SetupLogging(const char*, int, const char*)':
[x86_64] /usr/src/RPM/BUILD/librime-1.13.1/src/rime/setup.cc:90:15: error: 'IsGoogleLoggingInitialized' is not a member of 'google'
[x86_64]    90 |   if (google::IsGoogleLoggingInitialized()) {
2025-Feb-24 20:45:46 :: [x86_64] librime.git 1.13.1-alt1: remote: build failed
2025-Feb-24 20:45:46 :: [x86_64] #100 librime.git 1.13.1-alt1: build FAILED
2025-Feb-24 20:45:46 :: [x86_64] requesting cancellation of task processing
[i586] /usr/src/RPM/BUILD/librime-1.13.1/src/rime/setup.cc: In function 'void rime::SetupLogging(const char*, int, const char*)':
[i586] /usr/src/RPM/BUILD/librime-1.13.1/src/rime/setup.cc:90:15: error: 'IsGoogleLoggingInitialized' is not a member of 'google'
[i586]    90 |   if (google::IsGoogleLoggingInitialized()) {
2025-Feb-24 20:45:48 :: [i586] librime.git 1.13.1-alt1: remote: build failed
2025-Feb-24 20:45:48 :: [i586] #100 librime.git 1.13.1-alt1: build FAILED
[aarch64] /usr/src/RPM/BUILD/librime-1.13.1/src/rime/setup.cc: In function 'void rime::SetupLogging(const char*, int, const char*)':
[aarch64] /usr/src/RPM/BUILD/librime-1.13.1/src/rime/setup.cc:90:15: error: 'IsGoogleLoggingInitialized' is not a member of 'google'
[aarch64]    90 |   if (google::IsGoogleLoggingInitialized()) {
2025-Feb-24 20:46:03 :: [aarch64] librime.git 1.13.1-alt1: remote: build failed
2025-Feb-24 20:46:03 :: [aarch64] #100 librime.git 1.13.1-alt1: build FAILED
2025-Feb-24 20:45:46 :: [x86_64] build FAILED
2025-Feb-24 20:45:48 :: [i586] build FAILED
2025-Feb-24 20:46:03 :: [aarch64] build FAILED
2025-Feb-24 20:46:03 :: task #375938 for p11 FAILED


^ permalink raw reply	[flat|nested] 3+ messages in thread

* [#375938] p11 FAILED (try 2) glog.git=0.7.1-alt1 librime.git=1.13.1-alt1
  2025-02-24 20:46 [#375938] p11 FAILED librime.git=1.13.1-alt1 Girar awaiter (rider)
@ 2025-02-26 12:08 ` Girar awaiter (rider)
  2025-02-26 12:34 ` [#375938] p11 FAILED (try 3) glog.git=0.7.1-alt1 librime.git=1.13.1-alt1 libopencv.git=4.10.0-alt2 Girar awaiter (rider)
  1 sibling, 0 replies; 3+ messages in thread
From: Girar awaiter (rider) @ 2025-02-26 12:08 UTC (permalink / raw)
  To: Anton Farygin; +Cc: sisyphus-incominger, girar-builder-p11, girar-builder-p11

https://git.altlinux.org/tasks/375938/logs/events.2.1.log
https://packages.altlinux.org/tasks/375938

subtask  name     aarch64  i586  x86_64
    #40  glog        1:29    58      55
   #100  librime     2:12  1:31    1:24

2025-Feb-26 12:01:50 :: task #375938 for p11 resumed by rider:
2025-Feb-26 12:01:51 :: message: version update
#40 build 0.7.1-alt1 from /gears/g/glog.git fetched at 2025-Feb-26 12:01:42 from sisyphus
#100 build 1.13.1-alt1 from /people/rider/packages/librime.git fetched at 2025-Feb-24 16:40:12
2025-Feb-26 12:01:51 :: created build repo
2025-Feb-26 12:01:52 :: [aarch64] #40 glog.git 0.7.1-alt1: build start
2025-Feb-26 12:01:52 :: [x86_64] #40 glog.git 0.7.1-alt1: build start
2025-Feb-26 12:01:52 :: [i586] #40 glog.git 0.7.1-alt1: build start
2025-Feb-26 12:02:47 :: [x86_64] #40 glog.git 0.7.1-alt1: build OK
2025-Feb-26 12:02:47 :: [x86_64] #100 librime.git 1.13.1-alt1: build start
2025-Feb-26 12:02:50 :: [i586] #40 glog.git 0.7.1-alt1: build OK
2025-Feb-26 12:02:50 :: [i586] #100 librime.git 1.13.1-alt1: build start
2025-Feb-26 12:03:21 :: [aarch64] #40 glog.git 0.7.1-alt1: build OK
2025-Feb-26 12:03:22 :: [aarch64] #100 librime.git 1.13.1-alt1: build start
2025-Feb-26 12:04:11 :: [x86_64] #100 librime.git 1.13.1-alt1: build OK
2025-Feb-26 12:04:21 :: [i586] #100 librime.git 1.13.1-alt1: build OK
2025-Feb-26 12:05:34 :: [aarch64] #100 librime.git 1.13.1-alt1: build OK
2025-Feb-26 12:05:46 :: #40: glog.git 0.7.1-alt1: build check OK
2025-Feb-26 12:06:03 :: #100: librime.git 1.13.1-alt1: build check OK
2025-Feb-26 12:06:04 :: build check OK
2025-Feb-26 12:06:13 :: noarch check OK
2025-Feb-26 12:06:15 :: plan: src +2 -2 =19747, aarch64 +8 -8 =34104, i586 +8 -8 =33252, x86_64 +8 -8 =34896
#40 glog 0.5.0-alt1 -> 0.7.1-alt1
 Fri Aug 16 2024 Anton Farygin <rider@altlinux.ru> 0.7.1-alt1
 - 0.7.0 -> 0.7.1
 Mon Jun 03 2024 Anton Farygin <rider@altlinux.ru> 0.7.0-alt1
 - 0.6.0 -> 0.7.0
 - relaxed check on ppc64le
 Wed Apr 06 2022 Anton Farygin <rider@altlinux.ru> 0.6.0-alt1
 - 0.5.0 -> 0.6.0
#100 librime 1.11.2-alt1 -> 1.13.1-alt1
 Mon Feb 24 2025 Anton Farygin <rider@altlinux.ru> 1.13.1-alt1
 - 1.11.2 -> 1.13.1
2025-Feb-26 12:07:05 :: patched apt indices
2025-Feb-26 12:07:15 :: created next repo
2025-Feb-26 12:07:25 :: duplicate provides check OK
	x86_64: NEW unmet dependencies detected:
 blender#4.3.0-alt4:p11+373225.200.3.1@1738918588                     libglog.so.0()(64bit) >= set:lhKTg4j6VbFqA2iB4ahLPldvVjgT4sIcRrw8iH5
 blender-debuginfo#4.3.0-alt4:p11+373225.200.3.1@1738918588           debug64(libglog.so.0)
 libceres4#2.2.0-alt1:sisyphus+348506.700.4.1@1716296161              libglog.so.0()(64bit) >= set:lhKTg4j6VbFqA2iB4ahLPldvVjgT4sIcRrw8iH5
 libceres4-debuginfo#2.2.0-alt1:sisyphus+348506.700.4.1@1716296161    debug64(libglog.so.0)
 libopencv4.10#1:4.10.0-alt2:p11+363618.100.4.1@1733414313            libglog.so.0()(64bit) >= set:li7E9fXITyZ5ZowKhmIcgA
 libopencv4.10-debuginfo#1:4.10.0-alt2:p11+363618.100.4.1@1733414313  debug64(libglog.so.0)
	i586: NEW unmet dependencies detected:
 libceres4#2.2.0-alt1:sisyphus+348506.700.4.1@1716296158              libglog.so.0 >= set:lhKTg4j6VbFqA2iB4ahLPldvVjgT4sIcRrw8iH5
 libceres4-debuginfo#2.2.0-alt1:sisyphus+348506.700.4.1@1716296158    debug(libglog.so.0)
 libopencv4.10#1:4.10.0-alt2:p11+363618.100.4.1@1733414435            libglog.so.0 >= set:li7E9fXITyZ5ZowKhmIcgA
 libopencv4.10-debuginfo#1:4.10.0-alt2:p11+363618.100.4.1@1733414435  debug(libglog.so.0)
	aarch64: NEW unmet dependencies detected:
 blender#4.3.0-alt4:p11+373225.200.2.1@1738835724                   libglog.so.0()(64bit) >= set:lhKTg4j6VbFqA2iB4ahLPldvVjgT4sIcRrw8iH5
 blender-debuginfo#4.3.0-alt4:p11+373225.200.2.1@1738835724         debug64(libglog.so.0)
 libceres4#2.2.0-alt1:sisyphus+348506.700.4.1@1716296864            libglog.so.0()(64bit) >= set:lhKTg4j6VbFqA2iB4ahLPldvVjgT4sIcRrw8iH5
 libceres4-debuginfo#2.2.0-alt1:sisyphus+348506.700.4.1@1716296864  debug64(libglog.so.0)
	ACLs of affected packages (3):
 blender
 ceres-solver
 libopencv
2025-Feb-26 12:08:05 :: unmets: x86_64 +6 -0 =6, i586 +4 -0 =4, aarch64 +4 -0 =7
2025-Feb-26 12:08:05 :: dependencies check FAILED
2025-Feb-26 12:08:05 :: task #375938 for p11 FAILED


^ permalink raw reply	[flat|nested] 3+ messages in thread

* [#375938] p11 FAILED (try 3) glog.git=0.7.1-alt1 librime.git=1.13.1-alt1 libopencv.git=4.10.0-alt2 ...
  2025-02-24 20:46 [#375938] p11 FAILED librime.git=1.13.1-alt1 Girar awaiter (rider)
  2025-02-26 12:08 ` [#375938] p11 FAILED (try 2) glog.git=0.7.1-alt1 librime.git=1.13.1-alt1 Girar awaiter (rider)
@ 2025-02-26 12:34 ` Girar awaiter (rider)
  1 sibling, 0 replies; 3+ messages in thread
From: Girar awaiter (rider) @ 2025-02-26 12:34 UTC (permalink / raw)
  To: Anton Farygin; +Cc: sisyphus-incominger, girar-builder-p11, girar-builder-p11

https://git.altlinux.org/tasks/375938/logs/events.3.1.log
https://packages.altlinux.org/tasks/375938

subtask  name          aarch64   i586  x86_64
   #200  libopencv       23:10  18:17   15:47
   #300  ceres-solver        ?      ?  failed

2025-Feb-26 12:10:30 :: task #375938 for p11 resumed by rider:
2025-Feb-26 12:10:30 :: message: version update
#40 build 0.7.1-alt1 from /gears/g/glog.git fetched at 2025-Feb-26 12:01:42 from sisyphus
#100 build 1.13.1-alt1 from /people/rider/packages/librime.git fetched at 2025-Feb-24 16:40:12
#200 build 4.10.0-alt2 from /gears/l/libopencv.git fetched at 2025-Feb-26 12:09:47 from p11
#300 build 2.2.0-alt1 from /gears/c/ceres-solver.git fetched at 2025-Feb-26 12:10:05 from p11
#400 build 4.3.0-alt4 from /gears/b/blender.git fetched at 2025-Feb-26 12:10:14 from p11
2025-Feb-26 12:10:31 :: created build repo
2025-Feb-26 12:10:32 :: [aarch64] #40 glog.git 0.7.1-alt1: build start
2025-Feb-26 12:10:32 :: [i586] #40 glog.git 0.7.1-alt1: build start
2025-Feb-26 12:10:32 :: [x86_64] #40 glog.git 0.7.1-alt1: build start
2025-Feb-26 12:10:45 :: [i586] #40 glog.git 0.7.1-alt1: build OK (cached)
2025-Feb-26 12:10:45 :: [i586] #100 librime.git 1.13.1-alt1: build start
2025-Feb-26 12:10:45 :: [x86_64] #40 glog.git 0.7.1-alt1: build OK (cached)
2025-Feb-26 12:10:45 :: [x86_64] #100 librime.git 1.13.1-alt1: build start
2025-Feb-26 12:10:57 :: [aarch64] #40 glog.git 0.7.1-alt1: build OK (cached)
2025-Feb-26 12:10:57 :: [aarch64] #100 librime.git 1.13.1-alt1: build start
2025-Feb-26 12:10:57 :: [i586] #100 librime.git 1.13.1-alt1: build OK (cached)
2025-Feb-26 12:10:58 :: [i586] #200 libopencv.git 4.10.0-alt2: build start
2025-Feb-26 12:10:59 :: [x86_64] #100 librime.git 1.13.1-alt1: build OK (cached)
2025-Feb-26 12:10:59 :: [x86_64] #200 libopencv.git 4.10.0-alt2: build start
2025-Feb-26 12:11:21 :: [aarch64] #100 librime.git 1.13.1-alt1: build OK (cached)
2025-Feb-26 12:11:21 :: [aarch64] #200 libopencv.git 4.10.0-alt2: build start
2025-Feb-26 12:26:46 :: [x86_64] #200 libopencv.git 4.10.0-alt2: build OK
2025-Feb-26 12:26:46 :: [x86_64] #300 ceres-solver.git 2.2.0-alt1: build start
[x86_64] /usr/src/RPM/BUILD/ceres-solver-2.2.0/internal/ceres/small_blas.h:287:3: error: 'LogMessageFatal' is not a member of 'google'; did you mean 'LogMessageTime'?
[x86_64]   287 |   DCHECK_LE(start_col_c + NUM_COL_C, col_stride_c);
[x86_64] /usr/src/RPM/BUILD/ceres-solver-2.2.0/internal/ceres/small_blas.h: In function 'void ceres::internal::MatrixVectorMultiply(const double*, int, int, const double*, double*)':
[x86_64] /usr/src/RPM/BUILD/ceres-solver-2.2.0/internal/ceres/small_blas.h:407:3: error: 'Check_GTImpl' is not a member of 'google::logging::internal'; did you mean 'google::logging::Check_GTImpl'?
[x86_64]   407 |   DCHECK_GT(num_row_a, 0);
[x86_64] --
[x86_64]   742 | DEFINE_CHECK_OP_IMPL(Check_GT, >)
[x86_64] /usr/src/RPM/BUILD/ceres-solver-2.2.0/internal/ceres/small_blas.h:407:3: error: 'LogMessageFatal' is not a member of 'google'; did you mean 'LogMessageTime'?
[x86_64]   407 |   DCHECK_GT(num_row_a, 0);
[x86_64] /usr/src/RPM/BUILD/ceres-solver-2.2.0/internal/ceres/small_blas.h:408:3: error: 'Check_GTImpl' is not a member of 'google::logging::internal'; did you mean 'google::logging::Check_GTImpl'?
[x86_64]   408 |   DCHECK_GT(num_col_a, 0);
[x86_64] --
[x86_64]   742 | DEFINE_CHECK_OP_IMPL(Check_GT, >)
[x86_64] /usr/src/RPM/BUILD/ceres-solver-2.2.0/internal/ceres/small_blas.h:408:3: error: 'LogMessageFatal' is not a member of 'google'; did you mean 'LogMessageTime'?
[x86_64]   408 |   DCHECK_GT(num_col_a, 0);
[x86_64] /usr/src/RPM/BUILD/ceres-solver-2.2.0/internal/ceres/small_blas.h:409:3: error: 'LogMessageVoidify' is not a member of 'google::logging::internal'; did you mean 'logging::internal::LogMessageVoidify'?
[x86_64]   409 |   DCHECK((kRowA == Eigen::Dynamic) || (kRowA == num_row_a));
[x86_64] --
[x86_64]  1473 | struct LogMessageVoidify {
[x86_64] /usr/src/RPM/BUILD/ceres-solver-2.2.0/internal/ceres/small_blas.h:409:3: error: 'LogMessageFatal' is not a member of 'google'; did you mean 'LogMessageTime'?
[x86_64]   409 |   DCHECK((kRowA == Eigen::Dynamic) || (kRowA == num_row_a));
[x86_64] /usr/src/RPM/BUILD/ceres-solver-2.2.0/internal/ceres/small_blas.h:410:3: error: 'LogMessageVoidify' is not a member of 'google::logging::internal'; did you mean 'logging::internal::LogMessageVoidify'?
[x86_64]   410 |   DCHECK((kColA == Eigen::Dynamic) || (kColA == num_col_a));
[x86_64] --
[x86_64]  1473 | struct LogMessageVoidify {
[x86_64] /usr/src/RPM/BUILD/ceres-solver-2.2.0/internal/ceres/small_blas.h:410:3: error: 'LogMessageFatal' is not a member of 'google'; did you mean 'LogMessageTime'?
[x86_64]   410 |   DCHECK((kColA == Eigen::Dynamic) || (kColA == num_col_a));
[x86_64] /usr/src/RPM/BUILD/ceres-solver-2.2.0/internal/ceres/small_blas.h: In function 'void ceres::internal::MatrixTransposeVectorMultiply(const double*, int, int, const double*, double*)':
[x86_64] /usr/src/RPM/BUILD/ceres-solver-2.2.0/internal/ceres/small_blas.h:493:3: error: 'Check_GTImpl' is not a member of 'google::logging::internal'; did you mean 'google::logging::Check_GTImpl'?
[x86_64]   493 |   DCHECK_GT(num_row_a, 0);
2025-Feb-26 12:27:26 :: [x86_64] ceres-solver.git 2.2.0-alt1: remote: build failed
2025-Feb-26 12:27:26 :: [x86_64] #300 ceres-solver.git 2.2.0-alt1: build FAILED
2025-Feb-26 12:27:26 :: [x86_64] requesting cancellation of task processing
2025-Feb-26 12:29:15 :: [i586] #200 libopencv.git 4.10.0-alt2: build OK
2025-Feb-26 12:29:15 :: [i586] task processing CANCELLED
2025-Feb-26 12:34:31 :: [aarch64] #200 libopencv.git 4.10.0-alt2: build OK
2025-Feb-26 12:34:31 :: [aarch64] task processing CANCELLED
2025-Feb-26 12:27:26 :: [x86_64] build FAILED
2025-Feb-26 12:29:15 :: [i586] build FAILED
2025-Feb-26 12:34:32 :: [aarch64] build FAILED
2025-Feb-26 12:34:32 :: task #375938 for p11 FAILED


^ permalink raw reply	[flat|nested] 3+ messages in thread

end of thread, other threads:[~2025-02-26 12:34 UTC | newest]

Thread overview: 3+ messages (download: mbox.gz / follow: Atom feed)
-- links below jump to the message on this page --
2025-02-24 20:46 [#375938] p11 FAILED librime.git=1.13.1-alt1 Girar awaiter (rider)
2025-02-26 12:08 ` [#375938] p11 FAILED (try 2) glog.git=0.7.1-alt1 librime.git=1.13.1-alt1 Girar awaiter (rider)
2025-02-26 12:34 ` [#375938] p11 FAILED (try 3) glog.git=0.7.1-alt1 librime.git=1.13.1-alt1 libopencv.git=4.10.0-alt2 Girar awaiter (rider)

ALT Linux Girar Builder robot reports

This inbox may be cloned and mirrored by anyone:

	git clone --mirror http://lore.altlinux.org/sisyphus-incominger/0 sisyphus-incominger/git/0.git

	# If you have public-inbox 1.1+ installed, you may
	# initialize and index your mirror using the following commands:
	public-inbox-init -V2 sisyphus-incominger sisyphus-incominger/ http://lore.altlinux.org/sisyphus-incominger \
		sisyphus-incominger@lists.altlinux.org sisyphus-incominger@lists.altlinux.ru sisyphus-incominger@lists.altlinux.com
	public-inbox-index sisyphus-incominger

Example config snippet for mirrors.
Newsgroup available over NNTP:
	nntp://lore.altlinux.org/org.altlinux.lists.sisyphus-incominger


AGPL code for this site: git clone https://public-inbox.org/public-inbox.git