ALT Linux Girar Builder robot reports
 help / color / mirror / Atom feed
* [#375909] [test-only] FAILED python3-module-hypothesis.git=6.127.1-alt1
@ 2025-02-24 13:26 Girar awaiter (dutyrok)
  2025-02-24 13:48 ` [#375909] [test-only] FAILED (try 2) python3-module-hypothesis.git=6.127.1-alt1 Girar awaiter (dutyrok)
                   ` (4 more replies)
  0 siblings, 5 replies; 6+ messages in thread
From: Girar awaiter (dutyrok) @ 2025-02-24 13:26 UTC (permalink / raw)
  To: Alexandr Shashkin; +Cc: sisyphus-incominger, girar-builder-sisyphus

https://git.altlinux.org/tasks/375909/logs/events.1.1.log
https://packages.altlinux.org/tasks/375909

subtask  name                       aarch64  i586  ppc64le  x86_64
   #100  python3-module-hypothesis   failed  2:45     5:38  failed

2025-Feb-24 13:21:06 :: test-only task #375909 for sisyphus started by dutyrok:
#100 build 6.127.1-alt1 from /people/dutyrok/packages/python3-module-hypothesis.git fetched at 2025-Feb-24 13:21:04
2025-Feb-24 13:21:08 :: [i586] #100 python3-module-hypothesis.git 6.127.1-alt1: build start
2025-Feb-24 13:21:08 :: [aarch64] #100 python3-module-hypothesis.git 6.127.1-alt1: build start
2025-Feb-24 13:21:08 :: [x86_64] #100 python3-module-hypothesis.git 6.127.1-alt1: build start
2025-Feb-24 13:21:08 :: [ppc64le] #100 python3-module-hypothesis.git 6.127.1-alt1: build start
[x86_64] XPASS tests/datetime/test_zoneinfo_timezones.py::test_can_generate_prefixes_if_allowed_and_available - newly failing on GitHub Actions
[x86_64] FAILED tests/watchdog/test_database.py::test_database_listener_directory_explicit
[x86_64] = 1 failed, 6980 passed, 18 skipped, 7 xfailed, 1 xpassed in 98.35s (0:01:38) ==
[x86_64] INFO     : Command's result: FAILURE
[x86_64] INFO     : Command's error: Command '['python3', '-m', 'pytest', '-ra', '-nauto', '-Wignore::UserWarning:dateutil.zoneinfo', '--ignore=tests/crosshair', 'tests']' returned non-zero exit status 1.
2025-Feb-24 13:23:25 :: [x86_64] python3-module-hypothesis.git 6.127.1-alt1: remote: build failed
2025-Feb-24 13:23:25 :: [x86_64] #100 python3-module-hypothesis.git 6.127.1-alt1: build FAILED
2025-Feb-24 13:23:26 :: [x86_64] requesting cancellation of task processing
2025-Feb-24 13:23:53 :: [i586] #100 python3-module-hypothesis.git 6.127.1-alt1: build OK
[aarch64] XPASS tests/datetime/test_zoneinfo_timezones.py::test_can_generate_prefixes_if_allowed_and_available - newly failing on GitHub Actions
[aarch64] FAILED tests/watchdog/test_database.py::test_database_listener_directory_explicit
[aarch64] = 1 failed, 6980 passed, 18 skipped, 7 xfailed, 1 xpassed in 211.64s (0:03:31) =
[aarch64] INFO     : Command's result: FAILURE
[aarch64] INFO     : Command's error: Command '['python3', '-m', 'pytest', '-ra', '-nauto', '-Wignore::UserWarning:dateutil.zoneinfo', '--ignore=tests/crosshair', 'tests']' returned non-zero exit status 1.
2025-Feb-24 13:25:45 :: [aarch64] python3-module-hypothesis.git 6.127.1-alt1: remote: build failed
2025-Feb-24 13:25:45 :: [aarch64] #100 python3-module-hypothesis.git 6.127.1-alt1: build FAILED
2025-Feb-24 13:26:46 :: [ppc64le] #100 python3-module-hypothesis.git 6.127.1-alt1: build OK
2025-Feb-24 13:23:26 :: [x86_64] build FAILED
2025-Feb-24 13:25:45 :: [aarch64] build FAILED
2025-Feb-24 13:26:46 :: task #375909 for sisyphus FAILED


^ permalink raw reply	[flat|nested] 6+ messages in thread

* [#375909] [test-only] FAILED (try 2) python3-module-hypothesis.git=6.127.1-alt1
  2025-02-24 13:26 [#375909] [test-only] FAILED python3-module-hypothesis.git=6.127.1-alt1 Girar awaiter (dutyrok)
@ 2025-02-24 13:48 ` Girar awaiter (dutyrok)
  2025-02-24 17:43 ` [#375909] [test-only] FAILED (try 3) python3-module-hypothesis.git=6.127.1-alt1 Girar awaiter (dutyrok)
                   ` (3 subsequent siblings)
  4 siblings, 0 replies; 6+ messages in thread
From: Girar awaiter (dutyrok) @ 2025-02-24 13:48 UTC (permalink / raw)
  To: Alexandr Shashkin; +Cc: sisyphus-incominger, girar-builder-sisyphus

https://git.altlinux.org/tasks/375909/logs/events.2.1.log
https://packages.altlinux.org/tasks/375909

subtask  name                       aarch64    i586  ppc64le  x86_64
   #200  python3-module-hypothesis   failed  failed     5:56  failed

2025-Feb-24 13:42:23 :: test-only task #375909 for sisyphus resumed by dutyrok:
#100 removed
#200 build 6.127.1-alt1 from /people/dutyrok/packages/python3-module-hypothesis.git fetched at 2025-Feb-24 13:41:26
2025-Feb-24 13:42:25 :: [i586] #200 python3-module-hypothesis.git 6.127.1-alt1: build start
2025-Feb-24 13:42:25 :: [aarch64] #200 python3-module-hypothesis.git 6.127.1-alt1: build start
2025-Feb-24 13:42:25 :: [ppc64le] #200 python3-module-hypothesis.git 6.127.1-alt1: build start
2025-Feb-24 13:42:25 :: [x86_64] #200 python3-module-hypothesis.git 6.127.1-alt1: build start
[i586]     assert events == [("save", (b"a", b"a"))] * 2
[i586] AssertionError: assert [('save', (b'...(b'a', b'a'))] == [('save', (b'...(b'a', b'a'))]
[i586]   Left contains one more item: ('save', (b'a', b'a'))
[i586] --
[i586] XPASS tests/datetime/test_zoneinfo_timezones.py::test_can_generate_prefixes_if_allowed_and_available - newly failing on GitHub Actions
[i586] FAILED tests/watchdog/test_database.py::test_database_listener_multiplexed - ...
[i586] FAILED tests/watchdog/test_database.py::test_database_listener_directory_explicit
[i586] = 2 failed, 6979 passed, 18 skipped, 7 xfailed, 1 xpassed in 117.35s (0:01:57) =
[i586] INFO     : Command's result: FAILURE
[i586] INFO     : Command's error: Command '['python3', '-m', 'pytest', '-ra', '-nauto', '-Wignore::UserWarning:dateutil.zoneinfo', '--ignore=tests/crosshair', 'tests']' returned non-zero exit status 1.
2025-Feb-24 13:45:04 :: [i586] python3-module-hypothesis.git 6.127.1-alt1: remote: build failed
2025-Feb-24 13:45:04 :: [i586] #200 python3-module-hypothesis.git 6.127.1-alt1: build FAILED
2025-Feb-24 13:45:04 :: [i586] requesting cancellation of task processing
[x86_64] XPASS tests/datetime/test_zoneinfo_timezones.py::test_can_generate_prefixes_if_allowed_and_available - newly failing on GitHub Actions
[x86_64] FAILED tests/watchdog/test_database.py::test_database_listener_directory_explicit
[x86_64] = 1 failed, 6980 passed, 18 skipped, 7 xfailed, 1 xpassed in 136.76s (0:02:16) =
[x86_64] INFO     : Command's result: FAILURE
[x86_64] INFO     : Command's error: Command '['python3', '-m', 'pytest', '-ra', '-nauto', '-Wignore::UserWarning:dateutil.zoneinfo', '--ignore=tests/crosshair', 'tests']' returned non-zero exit status 1.
2025-Feb-24 13:45:32 :: [x86_64] python3-module-hypothesis.git 6.127.1-alt1: remote: build failed
2025-Feb-24 13:45:32 :: [x86_64] #200 python3-module-hypothesis.git 6.127.1-alt1: build FAILED
[aarch64] XPASS tests/datetime/test_zoneinfo_timezones.py::test_can_generate_prefixes_if_allowed_and_available - newly failing on GitHub Actions
[aarch64] FAILED tests/watchdog/test_database.py::test_database_listener_directory_explicit
[aarch64] = 1 failed, 6980 passed, 18 skipped, 7 xfailed, 1 xpassed in 174.84s (0:02:54) =
[aarch64] INFO     : Command's result: FAILURE
[aarch64] INFO     : Command's error: Command '['python3', '-m', 'pytest', '-ra', '-nauto', '-Wignore::UserWarning:dateutil.zoneinfo', '--ignore=tests/crosshair', 'tests']' returned non-zero exit status 1.
2025-Feb-24 13:46:34 :: [aarch64] python3-module-hypothesis.git 6.127.1-alt1: remote: build failed
2025-Feb-24 13:46:34 :: [aarch64] #200 python3-module-hypothesis.git 6.127.1-alt1: build FAILED
2025-Feb-24 13:48:21 :: [ppc64le] #200 python3-module-hypothesis.git 6.127.1-alt1: build OK
2025-Feb-24 13:45:05 :: [i586] build FAILED
2025-Feb-24 13:45:33 :: [x86_64] build FAILED
2025-Feb-24 13:46:34 :: [aarch64] build FAILED
2025-Feb-24 13:48:21 :: task #375909 for sisyphus FAILED


^ permalink raw reply	[flat|nested] 6+ messages in thread

* [#375909] [test-only] FAILED (try 3) python3-module-hypothesis.git=6.127.1-alt1
  2025-02-24 13:26 [#375909] [test-only] FAILED python3-module-hypothesis.git=6.127.1-alt1 Girar awaiter (dutyrok)
  2025-02-24 13:48 ` [#375909] [test-only] FAILED (try 2) python3-module-hypothesis.git=6.127.1-alt1 Girar awaiter (dutyrok)
@ 2025-02-24 17:43 ` Girar awaiter (dutyrok)
  2025-02-26  8:44 ` [#375909] [test-only] FAILED (try 4) python3-module-hypothesis.git=6.127.2-alt1 Girar awaiter (dutyrok)
                   ` (2 subsequent siblings)
  4 siblings, 0 replies; 6+ messages in thread
From: Girar awaiter (dutyrok) @ 2025-02-24 17:43 UTC (permalink / raw)
  To: Alexandr Shashkin; +Cc: sisyphus-incominger, girar-builder-sisyphus

https://git.altlinux.org/tasks/375909/logs/events.3.1.log
https://packages.altlinux.org/tasks/375909

subtask  name                       aarch64    i586  ppc64le  x86_64
   #300  python3-module-hypothesis     4:25  failed     7:21    2:31

2025-Feb-24 17:35:57 :: test-only task #375909 for sisyphus resumed by dutyrok:
#100 removed
#200 removed
#300 build 6.127.1-alt1 from /people/dutyrok/packages/python3-module-hypothesis.git fetched at 2025-Feb-24 13:58:13
2025-Feb-24 17:36:00 :: [i586] #300 python3-module-hypothesis.git 6.127.1-alt1: build start
2025-Feb-24 17:36:00 :: [x86_64] #300 python3-module-hypothesis.git 6.127.1-alt1: build start
2025-Feb-24 17:36:00 :: [aarch64] #300 python3-module-hypothesis.git 6.127.1-alt1: build start
2025-Feb-24 17:36:00 :: [ppc64le] #300 python3-module-hypothesis.git 6.127.1-alt1: build start
2025-Feb-24 17:38:31 :: [x86_64] #300 python3-module-hypothesis.git 6.127.1-alt1: build OK
[i586]     assert self.expected_events == self.actual_events
[i586] AssertionError: assert [('save', (b'... (b'', None))] == [('save', (b'...\xca\n\xf5'))]
[i586]   At index 2 diff: ('delete', (b'', None)) != ('delete', (b'', b'\xb7#j\x8e\x04\x88\xca\n\xf5'))
[i586] --
[i586] XPASS tests/watchdog/test_database.py::test_database_listener_directory_explicit - The test fails on ALT Sisyphus periodically.
[i586] FAILED tests/watchdog/test_database.py::test_database_listener_directory - as...
[i586] = 1 failed, 6979 passed, 18 skipped, 7 xfailed, 2 xpassed in 111.99s (0:01:51) =
[i586] INFO     : Command's result: FAILURE
[i586] INFO     : Command's error: Command '['python3', '-m', 'pytest', '-ra', '-nauto', '-Wignore::UserWarning:dateutil.zoneinfo', '--ignore=tests/crosshair', 'tests']' returned non-zero exit status 1.
2025-Feb-24 17:38:34 :: [i586] python3-module-hypothesis.git 6.127.1-alt1: remote: build failed
2025-Feb-24 17:38:34 :: [i586] #300 python3-module-hypothesis.git 6.127.1-alt1: build FAILED
2025-Feb-24 17:38:34 :: [i586] requesting cancellation of task processing
2025-Feb-24 17:40:25 :: [aarch64] #300 python3-module-hypothesis.git 6.127.1-alt1: build OK
2025-Feb-24 17:43:21 :: [ppc64le] #300 python3-module-hypothesis.git 6.127.1-alt1: build OK
2025-Feb-24 17:38:34 :: [i586] build FAILED
2025-Feb-24 17:43:21 :: task #375909 for sisyphus FAILED


^ permalink raw reply	[flat|nested] 6+ messages in thread

* [#375909] [test-only] FAILED (try 4) python3-module-hypothesis.git=6.127.2-alt1
  2025-02-24 13:26 [#375909] [test-only] FAILED python3-module-hypothesis.git=6.127.1-alt1 Girar awaiter (dutyrok)
  2025-02-24 13:48 ` [#375909] [test-only] FAILED (try 2) python3-module-hypothesis.git=6.127.1-alt1 Girar awaiter (dutyrok)
  2025-02-24 17:43 ` [#375909] [test-only] FAILED (try 3) python3-module-hypothesis.git=6.127.1-alt1 Girar awaiter (dutyrok)
@ 2025-02-26  8:44 ` Girar awaiter (dutyrok)
  2025-02-26  8:56 ` [#375909] TESTED (try 5) python3-module-hypothesis.git=6.127.2-alt1 Girar awaiter (dutyrok)
  2025-02-26 11:46 ` [#375909] DONE (try 6) python3-module-hypothesis.git=6.127.2-alt1 Girar pender (dutyrok)
  4 siblings, 0 replies; 6+ messages in thread
From: Girar awaiter (dutyrok) @ 2025-02-26  8:44 UTC (permalink / raw)
  To: Alexandr Shashkin; +Cc: sisyphus-incominger, girar-builder-sisyphus

https://git.altlinux.org/tasks/375909/logs/events.4.1.log
https://packages.altlinux.org/tasks/375909

subtask  name                       aarch64    i586  ppc64le  x86_64
   #400  python3-module-hypothesis     4:19  failed     6:17    2:19

2025-Feb-26 08:38:07 :: test-only task #375909 for sisyphus resumed by dutyrok:
#100 removed
#200 removed
#300 removed
#400 build 6.127.2-alt1 from /people/dutyrok/packages/python3-module-hypothesis.git fetched at 2025-Feb-26 08:35:25
2025-Feb-26 08:38:09 :: [aarch64] #400 python3-module-hypothesis.git 6.127.2-alt1: build start
2025-Feb-26 08:38:09 :: [i586] #400 python3-module-hypothesis.git 6.127.2-alt1: build start
2025-Feb-26 08:38:09 :: [x86_64] #400 python3-module-hypothesis.git 6.127.2-alt1: build start
2025-Feb-26 08:38:09 :: [ppc64le] #400 python3-module-hypothesis.git 6.127.2-alt1: build start
2025-Feb-26 08:40:28 :: [x86_64] #400 python3-module-hypothesis.git 6.127.2-alt1: build OK
[i586] XPASS tests/watchdog/test_database.py::test_database_listener_directory
[i586] FAILED tests/nocover/test_strategy_state.py::TestHypothesis::runTest - hypoth...
[i586] = 1 failed, 6978 passed, 18 skipped, 8 xfailed, 2 xpassed in 129.28s (0:02:09) =
[i586] INFO     : Command's result: FAILURE
[i586] INFO     : Command's error: Command '['python3', '-m', 'pytest', '-ra', '-nauto', '-Wignore::UserWarning:dateutil.zoneinfo', '--ignore=tests/crosshair', 'tests']' returned non-zero exit status 1.
2025-Feb-26 08:41:02 :: [i586] python3-module-hypothesis.git 6.127.2-alt1: remote: build failed
2025-Feb-26 08:41:02 :: [i586] #400 python3-module-hypothesis.git 6.127.2-alt1: build FAILED
2025-Feb-26 08:41:02 :: [i586] requesting cancellation of task processing
2025-Feb-26 08:42:28 :: [aarch64] #400 python3-module-hypothesis.git 6.127.2-alt1: build OK
2025-Feb-26 08:44:26 :: [ppc64le] #400 python3-module-hypothesis.git 6.127.2-alt1: build OK
2025-Feb-26 08:41:02 :: [i586] build FAILED
2025-Feb-26 08:44:27 :: task #375909 for sisyphus FAILED


^ permalink raw reply	[flat|nested] 6+ messages in thread

* [#375909] TESTED (try 5) python3-module-hypothesis.git=6.127.2-alt1
  2025-02-24 13:26 [#375909] [test-only] FAILED python3-module-hypothesis.git=6.127.1-alt1 Girar awaiter (dutyrok)
                   ` (2 preceding siblings ...)
  2025-02-26  8:44 ` [#375909] [test-only] FAILED (try 4) python3-module-hypothesis.git=6.127.2-alt1 Girar awaiter (dutyrok)
@ 2025-02-26  8:56 ` Girar awaiter (dutyrok)
  2025-02-26 11:46 ` [#375909] DONE (try 6) python3-module-hypothesis.git=6.127.2-alt1 Girar pender (dutyrok)
  4 siblings, 0 replies; 6+ messages in thread
From: Girar awaiter (dutyrok) @ 2025-02-26  8:56 UTC (permalink / raw)
  To: Alexandr Shashkin
  Cc: sisyphus-incominger, Vitaly Lipatov, girar-builder-sisyphus

https://git.altlinux.org/tasks/375909/logs/events.5.1.log
https://packages.altlinux.org/tasks/375909

subtask  name                       aarch64  i586  ppc64le  x86_64
   #400  python3-module-hypothesis     4:23  2:38     6:33    2:29

2025-Feb-26 08:47:10 :: test-only task #375909 for sisyphus resumed by dutyrok:
#100 removed
#200 removed
#300 removed
#400 build 6.127.2-alt1 from /people/dutyrok/packages/python3-module-hypothesis.git fetched at 2025-Feb-26 08:35:25
2025-Feb-26 08:47:12 :: #400: force rebuild
2025-Feb-26 08:47:12 :: [x86_64] #400 python3-module-hypothesis.git 6.127.2-alt1: build start
2025-Feb-26 08:47:12 :: [i586] #400 python3-module-hypothesis.git 6.127.2-alt1: build start
2025-Feb-26 08:47:12 :: [aarch64] #400 python3-module-hypothesis.git 6.127.2-alt1: build start
2025-Feb-26 08:47:12 :: [ppc64le] #400 python3-module-hypothesis.git 6.127.2-alt1: build start
2025-Feb-26 08:49:41 :: [x86_64] #400 python3-module-hypothesis.git 6.127.2-alt1: build OK
2025-Feb-26 08:49:50 :: [i586] #400 python3-module-hypothesis.git 6.127.2-alt1: build OK
2025-Feb-26 08:51:35 :: [aarch64] #400 python3-module-hypothesis.git 6.127.2-alt1: build OK
2025-Feb-26 08:53:45 :: [ppc64le] #400 python3-module-hypothesis.git 6.127.2-alt1: build OK
2025-Feb-26 08:53:54 :: #400: python3-module-hypothesis.git 6.127.2-alt1: build check OK
2025-Feb-26 08:53:55 :: build check OK
2025-Feb-26 08:53:57 :: noarch check OK
2025-Feb-26 08:53:59 :: plan: src +1 -1 =19874, noarch +1 -1 =21036
#400 python3-module-hypothesis 6.125.3-alt1 -> 6.127.2-alt1
 Wed Feb 26 2025 Alexandr Shashkin <dutyrok@altlinux> 6.127.2-alt1
 - Updated to 6.127.2.
2025-Feb-26 08:54:28 :: patched apt indices
2025-Feb-26 08:54:39 :: created next repo
2025-Feb-26 08:54:49 :: duplicate provides check OK
2025-Feb-26 08:55:28 :: dependencies check OK
2025-Feb-26 08:55:47 :: [x86_64] #400 python3-module-hypothesis: install check OK
2025-Feb-26 08:55:47 :: [i586] #400 python3-module-hypothesis: install check OK
2025-Feb-26 08:55:58 :: [aarch64] #400 python3-module-hypothesis: install check OK
2025-Feb-26 08:56:02 :: [ppc64le] #400 python3-module-hypothesis: install check OK
2025-Feb-26 08:56:03 :: gears inheritance check OK
2025-Feb-26 08:56:03 :: srpm inheritance check OK
girar-check-perms: access to python3-module-hypothesis ALLOWED for dutyrok: project leader
check-subtask-perms: #400: python3-module-hypothesis: allowed for dutyrok
2025-Feb-26 08:56:04 :: acl check OK
2025-Feb-26 08:56:24 :: created contents_index files
2025-Feb-26 08:56:31 :: created hash files: noarch src
2025-Feb-26 08:56:35 :: task #375909 for sisyphus TESTED


^ permalink raw reply	[flat|nested] 6+ messages in thread

* [#375909] DONE (try 6) python3-module-hypothesis.git=6.127.2-alt1
  2025-02-24 13:26 [#375909] [test-only] FAILED python3-module-hypothesis.git=6.127.1-alt1 Girar awaiter (dutyrok)
                   ` (3 preceding siblings ...)
  2025-02-26  8:56 ` [#375909] TESTED (try 5) python3-module-hypothesis.git=6.127.2-alt1 Girar awaiter (dutyrok)
@ 2025-02-26 11:46 ` Girar pender (dutyrok)
  4 siblings, 0 replies; 6+ messages in thread
From: Girar pender (dutyrok) @ 2025-02-26 11:46 UTC (permalink / raw)
  To: Alexandr Shashkin
  Cc: sisyphus-incominger, Vitaly Lipatov, girar-builder-sisyphus

https://git.altlinux.org/tasks/archive/done/_367/375909/logs/events.6.3.log
https://packages.altlinux.org/tasks/375909

2025-Feb-26 11:42:03 :: task #375909 for sisyphus resumed by dutyrok:
#100 removed
#200 removed
#300 removed
#400 build 6.127.2-alt1 from /people/dutyrok/packages/python3-module-hypothesis.git fetched at 2025-Feb-26 08:35:25
2025-Feb-26 11:42:06 :: [i586] #400 python3-module-hypothesis.git 6.127.2-alt1: build start
2025-Feb-26 11:42:06 :: [aarch64] #400 python3-module-hypothesis.git 6.127.2-alt1: build start
2025-Feb-26 11:42:06 :: [ppc64le] #400 python3-module-hypothesis.git 6.127.2-alt1: build start
2025-Feb-26 11:42:06 :: [x86_64] #400 python3-module-hypothesis.git 6.127.2-alt1: build start
2025-Feb-26 11:42:17 :: [i586] #400 python3-module-hypothesis.git 6.127.2-alt1: build OK (cached)
2025-Feb-26 11:42:19 :: [x86_64] #400 python3-module-hypothesis.git 6.127.2-alt1: build OK (cached)
2025-Feb-26 11:42:25 :: [aarch64] #400 python3-module-hypothesis.git 6.127.2-alt1: build OK (cached)
2025-Feb-26 11:42:27 :: [ppc64le] #400 python3-module-hypothesis.git 6.127.2-alt1: build OK (cached)
2025-Feb-26 11:42:37 :: #400: python3-module-hypothesis.git 6.127.2-alt1: build check OK
2025-Feb-26 11:42:38 :: build check OK
2025-Feb-26 11:42:40 :: noarch check OK
2025-Feb-26 11:42:42 :: plan: src +1 -1 =19876, noarch +1 -1 =21037
#400 python3-module-hypothesis 6.125.3-alt1 -> 6.127.2-alt1
 Wed Feb 26 2025 Alexandr Shashkin <dutyrok@altlinux> 6.127.2-alt1
 - Updated to 6.127.2.
2025-Feb-26 11:43:14 :: patched apt indices
2025-Feb-26 11:43:29 :: created next repo
2025-Feb-26 11:43:40 :: duplicate provides check OK
2025-Feb-26 11:44:24 :: dependencies check OK
2025-Feb-26 11:44:37 :: [i586] #400 python3-module-hypothesis: install check OK (cached)
2025-Feb-26 11:44:37 :: [x86_64] #400 python3-module-hypothesis: install check OK (cached)
2025-Feb-26 11:44:44 :: [aarch64] #400 python3-module-hypothesis: install check OK (cached)
2025-Feb-26 11:44:45 :: [ppc64le] #400 python3-module-hypothesis: install check OK (cached)
2025-Feb-26 11:44:46 :: gears inheritance check OK
2025-Feb-26 11:44:46 :: srpm inheritance check OK
girar-check-perms: access to python3-module-hypothesis ALLOWED for dutyrok: project leader
check-subtask-perms: #400: python3-module-hypothesis: allowed for dutyrok
2025-Feb-26 11:44:47 :: acl check OK
2025-Feb-26 11:45:11 :: created contents_index files
2025-Feb-26 11:45:20 :: created hash files: noarch src
2025-Feb-26 11:45:23 :: task #375909 for sisyphus TESTED
2025-Feb-26 11:45:24 :: task is ready for commit
2025-Feb-26 11:45:30 :: repo clone OK
2025-Feb-26 11:45:30 :: packages update OK
2025-Feb-26 11:45:33 :: [noarch] update OK
2025-Feb-26 11:45:33 :: repo update OK
2025-Feb-26 11:45:44 :: repo save OK
2025-Feb-26 11:45:44 :: src index update OK
2025-Feb-26 11:45:44 :: updated /gears/p/python3-module-hypothesis.git branch `sisyphus'
2025-Feb-26 11:46:42 :: gears update OK
2025-Feb-26 11:46:42 :: task #375909 for sisyphus DONE


^ permalink raw reply	[flat|nested] 6+ messages in thread

end of thread, other threads:[~2025-02-26 11:46 UTC | newest]

Thread overview: 6+ messages (download: mbox.gz / follow: Atom feed)
-- links below jump to the message on this page --
2025-02-24 13:26 [#375909] [test-only] FAILED python3-module-hypothesis.git=6.127.1-alt1 Girar awaiter (dutyrok)
2025-02-24 13:48 ` [#375909] [test-only] FAILED (try 2) python3-module-hypothesis.git=6.127.1-alt1 Girar awaiter (dutyrok)
2025-02-24 17:43 ` [#375909] [test-only] FAILED (try 3) python3-module-hypothesis.git=6.127.1-alt1 Girar awaiter (dutyrok)
2025-02-26  8:44 ` [#375909] [test-only] FAILED (try 4) python3-module-hypothesis.git=6.127.2-alt1 Girar awaiter (dutyrok)
2025-02-26  8:56 ` [#375909] TESTED (try 5) python3-module-hypothesis.git=6.127.2-alt1 Girar awaiter (dutyrok)
2025-02-26 11:46 ` [#375909] DONE (try 6) python3-module-hypothesis.git=6.127.2-alt1 Girar pender (dutyrok)

ALT Linux Girar Builder robot reports

This inbox may be cloned and mirrored by anyone:

	git clone --mirror http://lore.altlinux.org/sisyphus-incominger/0 sisyphus-incominger/git/0.git

	# If you have public-inbox 1.1+ installed, you may
	# initialize and index your mirror using the following commands:
	public-inbox-init -V2 sisyphus-incominger sisyphus-incominger/ http://lore.altlinux.org/sisyphus-incominger \
		sisyphus-incominger@lists.altlinux.org sisyphus-incominger@lists.altlinux.ru sisyphus-incominger@lists.altlinux.com
	public-inbox-index sisyphus-incominger

Example config snippet for mirrors.
Newsgroup available over NNTP:
	nntp://lore.altlinux.org/org.altlinux.lists.sisyphus-incominger


AGPL code for this site: git clone https://public-inbox.org/public-inbox.git