ALT Linux Girar Builder robot reports
 help / color / mirror / Atom feed
From: "Girar awaiter (toni)" <girar-builder@altlinux.org>
To: Anton Vyatkin <toni@altlinux.org>
Cc: girar-builder-p10@altlinux.org,
	sisyphus-incominger@lists.altlinux.org,
	girar-builder-p10@lists.altlinux.org
Subject: [#375460] [test-only] p10 FAILED (try 9) python3-module-strict-rfc3339.git=0.7-alt1 ...
Date: Thu, 27 Feb 2025 18:58:19 +0000
Message-ID: <girar.task.375460.9.1@gyle.mskdc.altlinux.org> (raw)
In-Reply-To: <girar.task.375460.1.1@gyle.mskdc.altlinux.org>

https://git.altlinux.org/tasks/375460/logs/events.9.1.log
https://packages.altlinux.org/tasks/375460

subtask  name                                   aarch64  armh    i586  x86_64
   #500  python3-module-pytest-console-scripts       43  1:02      28      27
   #540  python3-module-python-json-logger            ?     ?  failed  failed

2025-Feb-27 18:56:06 :: test-only task #375460 for p10 resumed by toni:
#100 removed
#200 removed
#240 build 0.7-alt1 from /gears/p/python3-module-strict-rfc3339.git fetched at 2025-Feb-20 14:38:19 from sisyphus
#300 build 0.1.4-alt1 from /gears/p/python3-module-rfc3339-validator.git fetched at 2025-Feb-20 12:11:02 from sisyphus
#400 removed
#500 build 1.4.1-alt0.p10.1 from /people/toni/packages/python3-module-pytest-console-scripts.git fetched at 2025-Feb-21 14:07:30
#540 build 3.2.1-alt1 from /gears/p/python3-module-python-json-logger.git fetched at 2025-Feb-27 18:55:47 from sisyphus
#600 build 0.12.0-alt1 from /gears/p/python3-module-jupyter-events.git fetched at 2025-Feb-21 14:16:41 from sisyphus
2025-Feb-27 18:56:07 :: created build repo
2025-Feb-27 18:56:07 :: #500: force rebuild
2025-Feb-27 18:56:08 :: [i586] #240 python3-module-strict-rfc3339.git 0.7-alt1: build start
2025-Feb-27 18:56:08 :: [x86_64] #240 python3-module-strict-rfc3339.git 0.7-alt1: build start
2025-Feb-27 18:56:08 :: [armh] #240 python3-module-strict-rfc3339.git 0.7-alt1: build start
2025-Feb-27 18:56:08 :: [aarch64] #240 python3-module-strict-rfc3339.git 0.7-alt1: build start
2025-Feb-27 18:56:22 :: [i586] #240 python3-module-strict-rfc3339.git 0.7-alt1: build OK (cached)
2025-Feb-27 18:56:23 :: [i586] #300 python3-module-rfc3339-validator.git 0.1.4-alt1: build start
2025-Feb-27 18:56:23 :: [x86_64] #240 python3-module-strict-rfc3339.git 0.7-alt1: build OK (cached)
2025-Feb-27 18:56:24 :: [x86_64] #300 python3-module-rfc3339-validator.git 0.1.4-alt1: build start
2025-Feb-27 18:56:34 :: [i586] #300 python3-module-rfc3339-validator.git 0.1.4-alt1: build OK (cached)
2025-Feb-27 18:56:34 :: [i586] #500 python3-module-pytest-console-scripts.git 1.4.1-alt0.p10.1: build start
2025-Feb-27 18:56:35 :: [x86_64] #300 python3-module-rfc3339-validator.git 0.1.4-alt1: build OK (cached)
2025-Feb-27 18:56:35 :: [x86_64] #500 python3-module-pytest-console-scripts.git 1.4.1-alt0.p10.1: build start
2025-Feb-27 18:56:36 :: [aarch64] #240 python3-module-strict-rfc3339.git 0.7-alt1: build OK (cached)
2025-Feb-27 18:56:36 :: [aarch64] #300 python3-module-rfc3339-validator.git 0.1.4-alt1: build start
2025-Feb-27 18:56:46 :: [armh] #240 python3-module-strict-rfc3339.git 0.7-alt1: build OK (cached)
2025-Feb-27 18:56:47 :: [armh] #300 python3-module-rfc3339-validator.git 0.1.4-alt1: build start
2025-Feb-27 18:56:57 :: [aarch64] #300 python3-module-rfc3339-validator.git 0.1.4-alt1: build OK (cached)
2025-Feb-27 18:56:57 :: [aarch64] #500 python3-module-pytest-console-scripts.git 1.4.1-alt0.p10.1: build start
2025-Feb-27 18:57:02 :: [i586] #500 python3-module-pytest-console-scripts.git 1.4.1-alt0.p10.1: build OK
2025-Feb-27 18:57:02 :: [x86_64] #500 python3-module-pytest-console-scripts.git 1.4.1-alt0.p10.1: build OK
2025-Feb-27 18:57:02 :: [i586] #540 python3-module-python-json-logger.git 3.2.1-alt1: build start
2025-Feb-27 18:57:02 :: [x86_64] #540 python3-module-python-json-logger.git 3.2.1-alt1: build start
2025-Feb-27 18:57:16 :: [armh] #300 python3-module-rfc3339-validator.git 0.1.4-alt1: build OK (cached)
2025-Feb-27 18:57:16 :: [armh] #500 python3-module-pytest-console-scripts.git 1.4.1-alt0.p10.1: build start
[x86_64] ==================================== ERRORS ====================================
[x86_64] __________________ ERROR collecting tests/test_deprecation.py __________________
[x86_64] ImportError while importing test module '/usr/src/RPM/BUILD/python3-module-python-json-logger-3.2.1/tests/test_deprecation.py'.
[x86_64] --
[x86_64]     import pythonjsonlogger
[x86_64] E   ModuleNotFoundError: No module named 'pythonjsonlogger'
[x86_64] __________________ ERROR collecting tests/test_formatters.py ___________________
[x86_64] ImportError while importing test module '/usr/src/RPM/BUILD/python3-module-python-json-logger-3.2.1/tests/test_formatters.py'.
[x86_64] --
[x86_64]     import pythonjsonlogger
[x86_64] E   ModuleNotFoundError: No module named 'pythonjsonlogger'
[x86_64] ____________________ ERROR collecting tests/test_missing.py ____________________
[x86_64] ImportError while importing test module '/usr/src/RPM/BUILD/python3-module-python-json-logger-3.2.1/tests/test_missing.py'.
[x86_64] --
[x86_64]     import pythonjsonlogger
[x86_64] E   ModuleNotFoundError: No module named 'pythonjsonlogger'
[x86_64] =========================== short test summary info ============================
[x86_64] ERROR tests/test_deprecation.py
[x86_64] ERROR tests/test_formatters.py
[x86_64] ERROR tests/test_missing.py
[x86_64] !!!!!!!!!!!!!!!!!!! Interrupted: 3 errors during collection !!!!!!!!!!!!!!!!!!!!
[x86_64] --
[x86_64] INFO     : Command's result: FAILURE
[x86_64] INFO     : Command's error: Command '['python3', '-m', 'pytest', '-v']' returned non-zero exit status 2.
2025-Feb-27 18:57:23 :: [x86_64] python3-module-python-json-logger.git 3.2.1-alt1: remote: build failed
2025-Feb-27 18:57:23 :: [x86_64] #540 python3-module-python-json-logger.git 3.2.1-alt1: build FAILED
2025-Feb-27 18:57:23 :: [x86_64] requesting cancellation of task processing
[i586] ==================================== ERRORS ====================================
[i586] __________________ ERROR collecting tests/test_deprecation.py __________________
[i586] ImportError while importing test module '/usr/src/RPM/BUILD/python3-module-python-json-logger-3.2.1/tests/test_deprecation.py'.
[i586] --
[i586]     import pythonjsonlogger
[i586] E   ModuleNotFoundError: No module named 'pythonjsonlogger'
[i586] __________________ ERROR collecting tests/test_formatters.py ___________________
[i586] ImportError while importing test module '/usr/src/RPM/BUILD/python3-module-python-json-logger-3.2.1/tests/test_formatters.py'.
[i586] --
[i586]     import pythonjsonlogger
[i586] E   ModuleNotFoundError: No module named 'pythonjsonlogger'
[i586] ____________________ ERROR collecting tests/test_missing.py ____________________
[i586] ImportError while importing test module '/usr/src/RPM/BUILD/python3-module-python-json-logger-3.2.1/tests/test_missing.py'.
[i586] --
[i586]     import pythonjsonlogger
[i586] E   ModuleNotFoundError: No module named 'pythonjsonlogger'
[i586] =========================== short test summary info ============================
[i586] ERROR tests/test_deprecation.py
[i586] ERROR tests/test_formatters.py
[i586] ERROR tests/test_missing.py
[i586] !!!!!!!!!!!!!!!!!!! Interrupted: 3 errors during collection !!!!!!!!!!!!!!!!!!!!
[i586] --
[i586] INFO     : Command's result: FAILURE
[i586] INFO     : Command's error: Command '['python3', '-m', 'pytest', '-v']' returned non-zero exit status 2.
2025-Feb-27 18:57:23 :: [i586] python3-module-python-json-logger.git 3.2.1-alt1: remote: build failed
2025-Feb-27 18:57:23 :: [i586] #540 python3-module-python-json-logger.git 3.2.1-alt1: build FAILED
2025-Feb-27 18:57:40 :: [aarch64] #500 python3-module-pytest-console-scripts.git 1.4.1-alt0.p10.1: build OK
2025-Feb-27 18:57:40 :: [aarch64] task processing CANCELLED
2025-Feb-27 18:58:18 :: [armh] #500 python3-module-pytest-console-scripts.git 1.4.1-alt0.p10.1: build OK
2025-Feb-27 18:58:18 :: [armh] task processing CANCELLED
2025-Feb-27 18:57:23 :: [x86_64] build FAILED
2025-Feb-27 18:57:23 :: [i586] build FAILED
2025-Feb-27 18:57:40 :: [aarch64] build FAILED
2025-Feb-27 18:58:18 :: [armh] build FAILED
2025-Feb-27 18:58:18 :: task #375460 for p10 FAILED


      parent reply	other threads:[~2025-02-27 18:58 UTC|newest]

Thread overview: 9+ messages / expand[flat|nested]  mbox.gz  Atom feed  top
2025-02-20 12:07 [#375460] [test-only] p10 FAILED python3-module-jupyter-events.git=0.12.0-alt1 Girar awaiter (toni)
2025-02-20 12:12 ` [#375460] [test-only] p10 FAILED (try 2) python3-module-jupyter-events.git=0.12.0-alt1 Girar awaiter (toni)
2025-02-20 14:05 ` [#375460] [test-only] p10 FAILED (try 3) python3-module-pytest-console-scripts.git=1.4.1-alt1 Girar awaiter (toni)
2025-02-20 14:35 ` [#375460] [test-only] p10 FAILED (try 4) python3-module-rfc3339-validator.git=0.1.4-alt1 Girar awaiter (toni)
2025-02-20 14:45 ` [#375460] p10 TESTED (try 5) python3-module-strict-rfc3339.git=0.7-alt1 Girar awaiter (toni)
2025-02-21 14:01 ` [#375460] [test-only] p10 FAILED (try 6) python3-module-strict-rfc3339.git=0.7-alt1 Girar awaiter (toni)
2025-02-21 14:13 ` [#375460] p10 TESTED (try 7) python3-module-strict-rfc3339.git=0.7-alt1 Girar awaiter (toni)
2025-02-21 14:18 ` [#375460] [test-only] p10 FAILED (try 8) python3-module-strict-rfc3339.git=0.7-alt1 Girar awaiter (toni)
2025-02-27 18:58 ` Girar awaiter (toni) [this message]

Reply instructions:

You may reply publicly to this message via plain-text email
using any one of the following methods:

* Save the following mbox file, import it into your mail client,
  and reply-to-all from there: mbox

  Avoid top-posting and favor interleaved quoting:
  https://en.wikipedia.org/wiki/Posting_style#Interleaved_style

* Reply using the --to, --cc, and --in-reply-to
  switches of git-send-email(1):

  git send-email \
    --in-reply-to=girar.task.375460.9.1@gyle.mskdc.altlinux.org \
    --to=girar-builder@altlinux.org \
    --cc=devel@lists.altlinux.org \
    --cc=girar-builder-p10@altlinux.org \
    --cc=girar-builder-p10@lists.altlinux.org \
    --cc=sisyphus-incominger@lists.altlinux.org \
    --cc=toni@altlinux.org \
    /path/to/YOUR_REPLY

  https://kernel.org/pub/software/scm/git/docs/git-send-email.html

* If your mail client supports setting the In-Reply-To header
  via mailto: links, try the mailto: link

ALT Linux Girar Builder robot reports

This inbox may be cloned and mirrored by anyone:

	git clone --mirror http://lore.altlinux.org/sisyphus-incominger/0 sisyphus-incominger/git/0.git

	# If you have public-inbox 1.1+ installed, you may
	# initialize and index your mirror using the following commands:
	public-inbox-init -V2 sisyphus-incominger sisyphus-incominger/ http://lore.altlinux.org/sisyphus-incominger \
		sisyphus-incominger@lists.altlinux.org sisyphus-incominger@lists.altlinux.ru sisyphus-incominger@lists.altlinux.com
	public-inbox-index sisyphus-incominger

Example config snippet for mirrors.
Newsgroup available over NNTP:
	nntp://lore.altlinux.org/org.altlinux.lists.sisyphus-incominger


AGPL code for this site: git clone https://public-inbox.org/public-inbox.git