* [#375009] [test-only] FAILED (try 2) radamsa.git=0.7-alt1
2025-02-17 7:04 [#375009] [test-only] FAILED radamsa.git=0.7-alt1 Girar awaiter (swaggyglice)
@ 2025-02-17 7:17 ` Girar awaiter (swaggyglice)
2025-02-17 7:30 ` [#375009] TESTED (try 3) radamsa.git=0.7-alt1 Girar awaiter (swaggyglice)
` (5 subsequent siblings)
6 siblings, 0 replies; 8+ messages in thread
From: Girar awaiter (swaggyglice) @ 2025-02-17 7:17 UTC (permalink / raw)
To: Anastasia Doronina; +Cc: sisyphus-incominger, girar-builder-sisyphus
https://git.altlinux.org/tasks/375009/logs/events.2.1.log
https://packages.altlinux.org/tasks/375009
subtask name aarch64 i586 ppc64le x86_64
#100 radamsa failed failed failed failed
2025-Feb-17 07:17:16 :: test-only task #375009 for sisyphus resumed by swaggyglice:
#100 build 0.7-alt1 from /people/swaggyglice/packages/radamsa.git fetched at 2025-Feb-17 07:03:28
2025-Feb-17 07:17:18 :: [aarch64] #100 radamsa.git 0.7-alt1: build start
2025-Feb-17 07:17:18 :: [x86_64] #100 radamsa.git 0.7-alt1: build start
2025-Feb-17 07:17:18 :: [ppc64le] #100 radamsa.git 0.7-alt1: build start
2025-Feb-17 07:17:18 :: [i586] #100 radamsa.git 0.7-alt1: build start
[i586] Reading Package Lists...
[i586] Building Dependency Tree...
[i586] E: Couldn't find package owl-lisp
[i586] hsh-install: Failed to calculate package file list.
[i586] hsh-install: Failed to generate package file list.
2025-Feb-17 07:17:28 :: [i586] radamsa.git 0.7-alt1: remote: cannot build src.rpm
2025-Feb-17 07:17:28 :: [i586] #100 radamsa.git 0.7-alt1: build FAILED
2025-Feb-17 07:17:28 :: [i586] requesting cancellation of task processing
[x86_64] Reading Package Lists...
[x86_64] Building Dependency Tree...
[x86_64] E: Couldn't find package owl-lisp
[x86_64] hsh-install: Failed to calculate package file list.
[x86_64] hsh-install: Failed to generate package file list.
2025-Feb-17 07:17:28 :: [x86_64] radamsa.git 0.7-alt1: remote: cannot build src.rpm
2025-Feb-17 07:17:28 :: [x86_64] #100 radamsa.git 0.7-alt1: build FAILED
[aarch64] Reading Package Lists...
[aarch64] Building Dependency Tree...
[aarch64] E: Couldn't find package owl-lisp
[aarch64] hsh-install: Failed to calculate package file list.
[aarch64] hsh-install: Failed to generate package file list.
2025-Feb-17 07:17:35 :: [aarch64] radamsa.git 0.7-alt1: remote: cannot build src.rpm
2025-Feb-17 07:17:35 :: [aarch64] #100 radamsa.git 0.7-alt1: build FAILED
[ppc64le] Reading Package Lists...
[ppc64le] Building Dependency Tree...
[ppc64le] E: Couldn't find package owl-lisp
[ppc64le] hsh-install: Failed to calculate package file list.
[ppc64le] hsh-install: Failed to generate package file list.
2025-Feb-17 07:17:37 :: [ppc64le] radamsa.git 0.7-alt1: remote: cannot build src.rpm
2025-Feb-17 07:17:37 :: [ppc64le] #100 radamsa.git 0.7-alt1: build FAILED
2025-Feb-17 07:17:28 :: [i586] build FAILED
2025-Feb-17 07:17:29 :: [x86_64] build FAILED
2025-Feb-17 07:17:35 :: [aarch64] build FAILED
2025-Feb-17 07:17:37 :: [ppc64le] build FAILED
2025-Feb-17 07:17:37 :: task #375009 for sisyphus FAILED
^ permalink raw reply [flat|nested] 8+ messages in thread
* [#375009] TESTED (try 3) radamsa.git=0.7-alt1
2025-02-17 7:04 [#375009] [test-only] FAILED radamsa.git=0.7-alt1 Girar awaiter (swaggyglice)
2025-02-17 7:17 ` [#375009] [test-only] FAILED (try 2) radamsa.git=0.7-alt1 Girar awaiter (swaggyglice)
@ 2025-02-17 7:30 ` Girar awaiter (swaggyglice)
2025-02-28 7:52 ` [#375009] TESTED (try 4) radamsa.git=0.7-alt1 Girar awaiter (swaggyglice)
` (4 subsequent siblings)
6 siblings, 0 replies; 8+ messages in thread
From: Girar awaiter (swaggyglice) @ 2025-02-17 7:30 UTC (permalink / raw)
To: Anastasia Doronina; +Cc: sisyphus-incominger, girar-builder-sisyphus
https://git.altlinux.org/tasks/375009/logs/events.3.1.log
https://packages.altlinux.org/tasks/375009
subtask name aarch64 i586 ppc64le x86_64
#200 radamsa 54 31 1:20 30
2025-Feb-17 07:25:02 :: test-only task #375009 for sisyphus resumed by swaggyglice:
#100 removed
#200 build 0.7-alt1 from /people/swaggyglice/packages/radamsa.git fetched at 2025-Feb-17 07:24:43
2025-Feb-17 07:25:03 :: [i586] #200 radamsa.git 0.7-alt1: build start
2025-Feb-17 07:25:03 :: [aarch64] #200 radamsa.git 0.7-alt1: build start
2025-Feb-17 07:25:03 :: [x86_64] #200 radamsa.git 0.7-alt1: build start
2025-Feb-17 07:25:03 :: [ppc64le] #200 radamsa.git 0.7-alt1: build start
2025-Feb-17 07:25:33 :: [x86_64] #200 radamsa.git 0.7-alt1: build OK
2025-Feb-17 07:25:34 :: [i586] #200 radamsa.git 0.7-alt1: build OK
2025-Feb-17 07:25:57 :: [aarch64] #200 radamsa.git 0.7-alt1: build OK
2025-Feb-17 07:26:23 :: [ppc64le] #200 radamsa.git 0.7-alt1: build OK
2025-Feb-17 07:26:36 :: #200: radamsa.git 0.7-alt1: build check OK
2025-Feb-17 07:26:37 :: build check OK
2025-Feb-17 07:26:39 :: noarch check OK
2025-Feb-17 07:26:41 :: plan: src +1 -0 =19851, aarch64 +2 -0 =34065, i586 +2 -0 =32979, ppc64le +2 -0 =32579, x86_64 +2 -0 =34852
2025-Feb-17 07:27:35 :: patched apt indices
2025-Feb-17 07:27:47 :: created next repo
2025-Feb-17 07:27:58 :: duplicate provides check OK
2025-Feb-17 07:28:35 :: dependencies check OK
2025-Feb-17 07:29:03 :: [x86_64 i586 aarch64 ppc64le] ELF symbols check OK
2025-Feb-17 07:29:16 :: [i586] #200 radamsa: install check OK
2025-Feb-17 07:29:17 :: [x86_64] #200 radamsa: install check OK
2025-Feb-17 07:29:23 :: [i586] #200 radamsa-debuginfo: install check OK
2025-Feb-17 07:29:24 :: [x86_64] #200 radamsa-debuginfo: install check OK
2025-Feb-17 07:29:26 :: [aarch64] #200 radamsa: install check OK
2025-Feb-17 07:29:26 :: [ppc64le] #200 radamsa: install check OK
2025-Feb-17 07:29:38 :: [aarch64] #200 radamsa-debuginfo: install check OK
2025-Feb-17 07:29:39 :: [ppc64le] #200 radamsa-debuginfo: install check OK
2025-Feb-17 07:29:56 :: [x86_64-i586] generated apt indices
2025-Feb-17 07:29:56 :: [x86_64-i586] created next repo
2025-Feb-17 07:30:07 :: [x86_64-i586] dependencies check OK
2025-Feb-17 07:30:08 :: gears inheritance check OK
2025-Feb-17 07:30:08 :: srpm inheritance check OK
girar-check-perms: access to radamsa DENIED for swaggyglice: does not belong to maintainers list yet
check-subtask-perms: #200: radamsa: Operation not permitted
2025-Feb-17 07:30:09 :: acl check IGNORED
2025-Feb-17 07:30:21 :: created contents_index files
2025-Feb-17 07:30:30 :: created hash files: aarch64 i586 ppc64le src x86_64
2025-Feb-17 07:30:33 :: task #375009 for sisyphus TESTED
^ permalink raw reply [flat|nested] 8+ messages in thread
* [#375009] TESTED (try 4) radamsa.git=0.7-alt1
2025-02-17 7:04 [#375009] [test-only] FAILED radamsa.git=0.7-alt1 Girar awaiter (swaggyglice)
2025-02-17 7:17 ` [#375009] [test-only] FAILED (try 2) radamsa.git=0.7-alt1 Girar awaiter (swaggyglice)
2025-02-17 7:30 ` [#375009] TESTED (try 3) radamsa.git=0.7-alt1 Girar awaiter (swaggyglice)
@ 2025-02-28 7:52 ` Girar awaiter (swaggyglice)
2025-02-28 14:05 ` [#375009] TESTED (try 5) radamsa.git=0.7-alt1 Girar awaiter (swaggyglice)
` (3 subsequent siblings)
6 siblings, 0 replies; 8+ messages in thread
From: Girar awaiter (swaggyglice) @ 2025-02-28 7:52 UTC (permalink / raw)
To: Anastasia Doronina; +Cc: sisyphus-incominger, girar-builder-sisyphus
https://git.altlinux.org/tasks/375009/logs/events.4.1.log
https://packages.altlinux.org/tasks/375009
subtask name aarch64 i586 ppc64le x86_64
#300 radamsa 51 31 1:16 30
2025-Feb-28 07:46:43 :: test-only task #375009 for sisyphus resumed by swaggyglice:
#100 removed
#200 removed
#300 build 0.7-alt1 from /people/swaggyglice/packages/radamsa.git fetched at 2025-Feb-28 07:46:19
2025-Feb-28 07:46:44 :: [i586] #300 radamsa.git 0.7-alt1: build start
2025-Feb-28 07:46:44 :: [aarch64] #300 radamsa.git 0.7-alt1: build start
2025-Feb-28 07:46:44 :: [ppc64le] #300 radamsa.git 0.7-alt1: build start
2025-Feb-28 07:46:44 :: [x86_64] #300 radamsa.git 0.7-alt1: build start
2025-Feb-28 07:47:14 :: [x86_64] #300 radamsa.git 0.7-alt1: build OK
2025-Feb-28 07:47:15 :: [i586] #300 radamsa.git 0.7-alt1: build OK
2025-Feb-28 07:47:35 :: [aarch64] #300 radamsa.git 0.7-alt1: build OK
2025-Feb-28 07:48:00 :: [ppc64le] #300 radamsa.git 0.7-alt1: build OK
2025-Feb-28 07:48:13 :: #300: radamsa.git 0.7-alt1: build check OK
2025-Feb-28 07:48:14 :: build check OK
2025-Feb-28 07:48:16 :: noarch check OK
2025-Feb-28 07:48:18 :: plan: src +1 -0 =19881, aarch64 +2 -0 =34530, i586 +2 -0 =33435, ppc64le +2 -0 =33041, x86_64 +2 -0 =35338
2025-Feb-28 07:49:02 :: patched apt indices
2025-Feb-28 07:49:13 :: created next repo
2025-Feb-28 07:49:24 :: duplicate provides check OK
2025-Feb-28 07:50:04 :: dependencies check OK
2025-Feb-28 07:50:40 :: [x86_64 i586 aarch64 ppc64le] ELF symbols check OK
2025-Feb-28 07:50:54 :: [i586] #300 radamsa: install check OK
2025-Feb-28 07:50:54 :: [x86_64] #300 radamsa: install check OK
2025-Feb-28 07:51:00 :: [i586] #300 radamsa-debuginfo: install check OK
2025-Feb-28 07:51:02 :: [x86_64] #300 radamsa-debuginfo: install check OK
2025-Feb-28 07:51:02 :: [aarch64] #300 radamsa: install check OK
2025-Feb-28 07:51:03 :: [ppc64le] #300 radamsa: install check OK
2025-Feb-28 07:51:14 :: [aarch64] #300 radamsa-debuginfo: install check OK
2025-Feb-28 07:51:16 :: [ppc64le] #300 radamsa-debuginfo: install check OK
2025-Feb-28 07:51:38 :: [x86_64-i586] generated apt indices
2025-Feb-28 07:51:38 :: [x86_64-i586] created next repo
2025-Feb-28 07:51:51 :: [x86_64-i586] dependencies check OK
2025-Feb-28 07:51:51 :: gears inheritance check OK
2025-Feb-28 07:51:52 :: srpm inheritance check OK
girar-check-perms: access to radamsa DENIED for swaggyglice: does not belong to maintainers list yet
check-subtask-perms: #300: radamsa: Operation not permitted
2025-Feb-28 07:51:52 :: acl check IGNORED
2025-Feb-28 07:52:06 :: created contents_index files
2025-Feb-28 07:52:17 :: created hash files: aarch64 i586 ppc64le src x86_64
2025-Feb-28 07:52:20 :: task #375009 for sisyphus TESTED
^ permalink raw reply [flat|nested] 8+ messages in thread
* [#375009] TESTED (try 5) radamsa.git=0.7-alt1
2025-02-17 7:04 [#375009] [test-only] FAILED radamsa.git=0.7-alt1 Girar awaiter (swaggyglice)
` (2 preceding siblings ...)
2025-02-28 7:52 ` [#375009] TESTED (try 4) radamsa.git=0.7-alt1 Girar awaiter (swaggyglice)
@ 2025-02-28 14:05 ` Girar awaiter (swaggyglice)
2025-02-28 14:16 ` [#375009] [test-only] FAILED (try 6) radamsa.git=0.7-alt1 Girar awaiter (swaggyglice)
` (2 subsequent siblings)
6 siblings, 0 replies; 8+ messages in thread
From: Girar awaiter (swaggyglice) @ 2025-02-28 14:05 UTC (permalink / raw)
To: Anastasia Doronina; +Cc: sisyphus-incominger, girar-builder-sisyphus
https://git.altlinux.org/tasks/375009/logs/events.5.1.log
https://packages.altlinux.org/tasks/375009
subtask name aarch64 i586 ppc64le x86_64
#400 radamsa 53 32 1:18 30
2025-Feb-28 13:59:15 :: test-only task #375009 for sisyphus resumed by swaggyglice:
#100 removed
#200 removed
#300 removed
#400 build 0.7-alt1 from /people/swaggyglice/packages/radamsa.git fetched at 2025-Feb-28 13:59:00
2025-Feb-28 13:59:18 :: [x86_64] #400 radamsa.git 0.7-alt1: build start
2025-Feb-28 13:59:18 :: [ppc64le] #400 radamsa.git 0.7-alt1: build start
2025-Feb-28 13:59:18 :: [i586] #400 radamsa.git 0.7-alt1: build start
2025-Feb-28 13:59:18 :: [aarch64] #400 radamsa.git 0.7-alt1: build start
2025-Feb-28 13:59:48 :: [x86_64] #400 radamsa.git 0.7-alt1: build OK
2025-Feb-28 13:59:50 :: [i586] #400 radamsa.git 0.7-alt1: build OK
2025-Feb-28 14:00:11 :: [aarch64] #400 radamsa.git 0.7-alt1: build OK
2025-Feb-28 14:00:36 :: [ppc64le] #400 radamsa.git 0.7-alt1: build OK
2025-Feb-28 14:00:49 :: #400: radamsa.git 0.7-alt1: build check OK
2025-Feb-28 14:00:50 :: build check OK
2025-Feb-28 14:00:52 :: noarch check OK
2025-Feb-28 14:00:54 :: plan: src +1 -0 =19884, aarch64 +2 -0 =34532, i586 +2 -0 =33437, ppc64le +2 -0 =33043, x86_64 +2 -0 =35340
2025-Feb-28 14:01:55 :: patched apt indices
2025-Feb-28 14:02:09 :: created next repo
2025-Feb-28 14:02:21 :: duplicate provides check OK
2025-Feb-28 14:03:10 :: dependencies check OK
2025-Feb-28 14:03:47 :: [x86_64 i586 aarch64 ppc64le] ELF symbols check OK
2025-Feb-28 14:04:00 :: [i586] #400 radamsa: install check OK
2025-Feb-28 14:04:01 :: [x86_64] #400 radamsa: install check OK
2025-Feb-28 14:04:06 :: [i586] #400 radamsa-debuginfo: install check OK
2025-Feb-28 14:04:08 :: [x86_64] #400 radamsa-debuginfo: install check OK
2025-Feb-28 14:04:09 :: [aarch64] #400 radamsa: install check OK
2025-Feb-28 14:04:10 :: [ppc64le] #400 radamsa: install check OK
2025-Feb-28 14:04:21 :: [aarch64] #400 radamsa-debuginfo: install check OK
2025-Feb-28 14:04:23 :: [ppc64le] #400 radamsa-debuginfo: install check OK
2025-Feb-28 14:04:41 :: [x86_64-i586] generated apt indices
2025-Feb-28 14:04:41 :: [x86_64-i586] created next repo
2025-Feb-28 14:04:52 :: [x86_64-i586] dependencies check OK
2025-Feb-28 14:04:53 :: gears inheritance check OK
2025-Feb-28 14:04:54 :: srpm inheritance check OK
girar-check-perms: access to radamsa DENIED for swaggyglice: does not belong to maintainers list yet
check-subtask-perms: #400: radamsa: Operation not permitted
2025-Feb-28 14:04:54 :: acl check IGNORED
2025-Feb-28 14:05:07 :: created contents_index files
2025-Feb-28 14:05:17 :: created hash files: aarch64 i586 ppc64le src x86_64
2025-Feb-28 14:05:20 :: task #375009 for sisyphus TESTED
^ permalink raw reply [flat|nested] 8+ messages in thread
* [#375009] [test-only] FAILED (try 6) radamsa.git=0.7-alt1
2025-02-17 7:04 [#375009] [test-only] FAILED radamsa.git=0.7-alt1 Girar awaiter (swaggyglice)
` (3 preceding siblings ...)
2025-02-28 14:05 ` [#375009] TESTED (try 5) radamsa.git=0.7-alt1 Girar awaiter (swaggyglice)
@ 2025-02-28 14:16 ` Girar awaiter (swaggyglice)
2025-02-28 14:29 ` [#375009] TESTED (try 7) radamsa.git=0.7-alt1 Girar awaiter (swaggyglice)
2025-02-28 14:51 ` [#375009] DONE (try 8) radamsa.git=0.7-alt1 Girar pender (swaggyglice)
6 siblings, 0 replies; 8+ messages in thread
From: Girar awaiter (swaggyglice) @ 2025-02-28 14:16 UTC (permalink / raw)
To: Anastasia Doronina; +Cc: sisyphus-incominger, girar-builder-sisyphus
https://git.altlinux.org/tasks/375009/logs/events.6.1.log
https://packages.altlinux.org/tasks/375009
subtask name aarch64 i586 ppc64le x86_64
#500 radamsa 55 32 1:15 31
2025-Feb-28 14:15:23 :: test-only task #375009 for sisyphus resumed by swaggyglice:
#100 removed
#200 removed
#300 removed
#400 removed
#500 build 0.7-alt1 from /people/swaggyglice/packages/radamsa.git fetched at 2025-Feb-28 14:15:17
2025-Feb-28 14:15:25 :: [ppc64le] #500 radamsa.git 0.7-alt1: build start
2025-Feb-28 14:15:25 :: [x86_64] #500 radamsa.git 0.7-alt1: build start
2025-Feb-28 14:15:25 :: [aarch64] #500 radamsa.git 0.7-alt1: build start
2025-Feb-28 14:15:25 :: [i586] #500 radamsa.git 0.7-alt1: build start
2025-Feb-28 14:15:56 :: [x86_64] #500 radamsa.git 0.7-alt1: build OK
2025-Feb-28 14:15:57 :: [i586] #500 radamsa.git 0.7-alt1: build OK
2025-Feb-28 14:16:20 :: [aarch64] #500 radamsa.git 0.7-alt1: build OK
2025-Feb-28 14:16:30 :: task abort requested by swaggyglice.
2025-Feb-28 14:16:40 :: [ppc64le] #500 radamsa.git 0.7-alt1: build OK
2025-Feb-28 14:16:40 :: task processing CANCELLED
2025-Feb-28 14:16:40 :: task #375009 for sisyphus FAILED
^ permalink raw reply [flat|nested] 8+ messages in thread
* [#375009] TESTED (try 7) radamsa.git=0.7-alt1
2025-02-17 7:04 [#375009] [test-only] FAILED radamsa.git=0.7-alt1 Girar awaiter (swaggyglice)
` (4 preceding siblings ...)
2025-02-28 14:16 ` [#375009] [test-only] FAILED (try 6) radamsa.git=0.7-alt1 Girar awaiter (swaggyglice)
@ 2025-02-28 14:29 ` Girar awaiter (swaggyglice)
2025-02-28 14:51 ` [#375009] DONE (try 8) radamsa.git=0.7-alt1 Girar pender (swaggyglice)
6 siblings, 0 replies; 8+ messages in thread
From: Girar awaiter (swaggyglice) @ 2025-02-28 14:29 UTC (permalink / raw)
To: Anastasia Doronina; +Cc: sisyphus-incominger, girar-builder-sisyphus
https://git.altlinux.org/tasks/375009/logs/events.7.1.log
https://packages.altlinux.org/tasks/375009
subtask name aarch64 i586 ppc64le x86_64
#600 radamsa 53 32 1:16 32
2025-Feb-28 14:23:54 :: test-only task #375009 for sisyphus resumed by swaggyglice:
#100 removed
#200 removed
#300 removed
#400 removed
#500 removed
#600 build 0.7-alt1 from /people/swaggyglice/packages/radamsa.git fetched at 2025-Feb-28 14:23:46
2025-Feb-28 14:23:56 :: [i586] #600 radamsa.git 0.7-alt1: build start
2025-Feb-28 14:23:56 :: [x86_64] #600 radamsa.git 0.7-alt1: build start
2025-Feb-28 14:23:56 :: [aarch64] #600 radamsa.git 0.7-alt1: build start
2025-Feb-28 14:23:56 :: [ppc64le] #600 radamsa.git 0.7-alt1: build start
2025-Feb-28 14:24:28 :: [x86_64] #600 radamsa.git 0.7-alt1: build OK
2025-Feb-28 14:24:28 :: [i586] #600 radamsa.git 0.7-alt1: build OK
2025-Feb-28 14:24:49 :: [aarch64] #600 radamsa.git 0.7-alt1: build OK
2025-Feb-28 14:25:12 :: [ppc64le] #600 radamsa.git 0.7-alt1: build OK
2025-Feb-28 14:25:23 :: #600: radamsa.git 0.7-alt1: build check OK
2025-Feb-28 14:25:25 :: build check OK
2025-Feb-28 14:25:26 :: noarch check OK
2025-Feb-28 14:25:28 :: plan: src +1 -0 =19884, aarch64 +2 -0 =34532, i586 +2 -0 =33437, ppc64le +2 -0 =33043, x86_64 +2 -0 =35340
2025-Feb-28 14:26:18 :: patched apt indices
2025-Feb-28 14:26:30 :: created next repo
2025-Feb-28 14:26:41 :: duplicate provides check OK
2025-Feb-28 14:27:23 :: dependencies check OK
2025-Feb-28 14:27:56 :: [x86_64 i586 aarch64 ppc64le] ELF symbols check OK
2025-Feb-28 14:28:09 :: [i586] #600 radamsa: install check OK
2025-Feb-28 14:28:09 :: [x86_64] #600 radamsa: install check OK
2025-Feb-28 14:28:16 :: [i586] #600 radamsa-debuginfo: install check OK
2025-Feb-28 14:28:17 :: [x86_64] #600 radamsa-debuginfo: install check OK
2025-Feb-28 14:28:17 :: [aarch64] #600 radamsa: install check OK
2025-Feb-28 14:28:18 :: [ppc64le] #600 radamsa: install check OK
2025-Feb-28 14:28:29 :: [aarch64] #600 radamsa-debuginfo: install check OK
2025-Feb-28 14:28:32 :: [ppc64le] #600 radamsa-debuginfo: install check OK
2025-Feb-28 14:28:55 :: [x86_64-i586] generated apt indices
2025-Feb-28 14:28:55 :: [x86_64-i586] created next repo
2025-Feb-28 14:29:08 :: [x86_64-i586] dependencies check OK
2025-Feb-28 14:29:09 :: gears inheritance check OK
2025-Feb-28 14:29:09 :: srpm inheritance check OK
girar-check-perms: access to radamsa DENIED for swaggyglice: does not belong to maintainers list yet
check-subtask-perms: #600: radamsa: Operation not permitted
2025-Feb-28 14:29:09 :: acl check IGNORED
2025-Feb-28 14:29:24 :: created contents_index files
2025-Feb-28 14:29:36 :: created hash files: aarch64 i586 ppc64le src x86_64
2025-Feb-28 14:29:39 :: task #375009 for sisyphus TESTED
^ permalink raw reply [flat|nested] 8+ messages in thread
* [#375009] DONE (try 8) radamsa.git=0.7-alt1
2025-02-17 7:04 [#375009] [test-only] FAILED radamsa.git=0.7-alt1 Girar awaiter (swaggyglice)
` (5 preceding siblings ...)
2025-02-28 14:29 ` [#375009] TESTED (try 7) radamsa.git=0.7-alt1 Girar awaiter (swaggyglice)
@ 2025-02-28 14:51 ` Girar pender (swaggyglice)
6 siblings, 0 replies; 8+ messages in thread
From: Girar pender (swaggyglice) @ 2025-02-28 14:51 UTC (permalink / raw)
To: Anastasia Doronina; +Cc: sisyphus-incominger, girar-builder-sisyphus
https://git.altlinux.org/tasks/archive/done/_366/375009/logs/events.8.2.log
https://packages.altlinux.org/tasks/375009
2025-Feb-28 14:46:48 :: task #375009 for sisyphus resumed by swaggyglice:
#100 removed
#200 removed
#300 removed
#400 removed
#500 removed
#600 build 0.7-alt1 from /people/swaggyglice/packages/radamsa.git fetched at 2025-Feb-28 14:23:46
2025-Feb-28 14:46:50 :: [i586] #600 radamsa.git 0.7-alt1: build start
2025-Feb-28 14:46:50 :: [ppc64le] #600 radamsa.git 0.7-alt1: build start
2025-Feb-28 14:46:50 :: [aarch64] #600 radamsa.git 0.7-alt1: build start
2025-Feb-28 14:46:50 :: [x86_64] #600 radamsa.git 0.7-alt1: build start
2025-Feb-28 14:47:00 :: [i586] #600 radamsa.git 0.7-alt1: build OK (cached)
2025-Feb-28 14:47:01 :: [x86_64] #600 radamsa.git 0.7-alt1: build OK (cached)
2025-Feb-28 14:47:08 :: [aarch64] #600 radamsa.git 0.7-alt1: build OK (cached)
2025-Feb-28 14:47:09 :: [ppc64le] #600 radamsa.git 0.7-alt1: build OK (cached)
2025-Feb-28 14:47:22 :: #600: radamsa.git 0.7-alt1: build check OK
2025-Feb-28 14:47:23 :: build check OK
2025-Feb-28 14:47:25 :: noarch check OK
2025-Feb-28 14:47:27 :: plan: src +1 -0 =19885, aarch64 +2 -0 =34534, i586 +2 -0 =33439, ppc64le +2 -0 =33045, x86_64 +2 -0 =35342
2025-Feb-28 14:48:16 :: patched apt indices
2025-Feb-28 14:48:27 :: created next repo
2025-Feb-28 14:48:37 :: duplicate provides check OK
2025-Feb-28 14:49:17 :: dependencies check OK
2025-Feb-28 14:49:18 :: [x86_64 i586 aarch64 ppc64le] no need to repeat ELF symbols check
2025-Feb-28 14:49:18 :: [x86_64 i586 aarch64 ppc64le] ELF symbols check OK
2025-Feb-28 14:49:29 :: [i586] #600 radamsa: install check OK (cached)
2025-Feb-28 14:49:30 :: [x86_64] #600 radamsa: install check OK (cached)
2025-Feb-28 14:49:33 :: [i586] #600 radamsa-debuginfo: install check OK (cached)
2025-Feb-28 14:49:34 :: [x86_64] #600 radamsa-debuginfo: install check OK (cached)
2025-Feb-28 14:49:37 :: [aarch64] #600 radamsa: install check OK (cached)
2025-Feb-28 14:49:38 :: [ppc64le] #600 radamsa: install check OK (cached)
2025-Feb-28 14:49:45 :: [aarch64] #600 radamsa-debuginfo: install check OK (cached)
2025-Feb-28 14:49:46 :: [ppc64le] #600 radamsa-debuginfo: install check OK (cached)
2025-Feb-28 14:50:06 :: [x86_64-i586] generated apt indices
2025-Feb-28 14:50:06 :: [x86_64-i586] created next repo
2025-Feb-28 14:50:20 :: [x86_64-i586] dependencies check OK
2025-Feb-28 14:50:21 :: gears inheritance check OK
2025-Feb-28 14:50:21 :: srpm inheritance check OK
girar-check-perms: access to radamsa ALLOWED for ancieg: project `radamsa' is not listed in the acl file for repository `sisyphus', and the policy for such projects in `sisyphus' is to allow
check-subtask-perms: #600: radamsa: approved by ancieg
2025-Feb-28 14:50:21 :: acl check OK
2025-Feb-28 14:50:37 :: created contents_index files
2025-Feb-28 14:50:49 :: created hash files: aarch64 i586 ppc64le src x86_64
2025-Feb-28 14:50:52 :: task #375009 for sisyphus TESTED
2025-Feb-28 14:50:52 :: task is ready for commit
2025-Feb-28 14:50:58 :: repo clone OK
2025-Feb-28 14:50:58 :: packages update OK
2025-Feb-28 14:51:08 :: [x86_64 i586 aarch64 ppc64le] update OK
2025-Feb-28 14:51:08 :: repo update OK
2025-Feb-28 14:51:22 :: repo save OK
2025-Feb-28 14:51:22 :: src index update OK
2025-Feb-28 14:51:22 :: created /gears/r/radamsa.git branch `sisyphus'
2025-Feb-28 14:51:28 :: gears update OK
2025-Feb-28 14:51:28 :: ACL for new project `radamsa' assigned to user `swaggyglice'
2025-Feb-28 14:51:28 :: task #375009 for sisyphus DONE
^ permalink raw reply [flat|nested] 8+ messages in thread