From mboxrd@z Thu Jan  1 00:00:00 1970
Return-Path: <girar-builder@altlinux.org>
X-Spam-Checker-Version: SpamAssassin 3.4.1 (2015-04-28) on
 sa.local.altlinux.org
X-Spam-Level: 
X-Spam-Status: No, score=-3.3 required=5.0 tests=BAYES_00,RP_MATCHES_RCVD
 autolearn=ham autolearn_force=no version=3.4.1
Date: Wed, 12 Feb 2025 05:16:05 +0000
From: "Girar awaiter (minergenon)" <girar-builder@altlinux.org>
To: Sergey Palcheh <minergenon@altlinux.org>
Subject: [#374405] [test-only] FAILED librealsense.git=2.56.3-alt1
Message-ID: <girar.task.374405.1.1@gyle.mskdc.altlinux.org>
Mail-Followup-To: Girar awaiter robot <girar-builder@altlinux.org>
MIME-Version: 1.0
Content-Type: text/plain; charset=us-ascii
Content-Disposition: inline
X-girar-task-id: 374405
X-girar-task-owner: minergenon
X-girar-task-repo: sisyphus
X-girar-task-try: 1
X-girar-task-iter: 1
X-girar-task-status: FAILED
X-girar-task-URL: https://git.altlinux.org/tasks/374405/
X-girar-task-log: logs/events.1.1.log
X-girar-task-summary: [#374405] [test-only] FAILED librealsense.git=2.56.3-alt1
User-Agent: Mutt/1.10.1 (2018-07-13)
Cc: sisyphus-incominger@lists.altlinux.org, girar-builder-sisyphus@altlinux.org
X-BeenThere: sisyphus-incominger@lists.altlinux.org
X-Mailman-Version: 2.1.12
Precedence: list
Reply-To: ALT Devel discussion list <devel@lists.altlinux.org>
List-Id: ALT Linux Girar Builder robot reports
 <sisyphus-incominger.lists.altlinux.org>
List-Unsubscribe: <https://lists.altlinux.org/mailman/options/sisyphus-incominger>, 
 <mailto:sisyphus-incominger-request@lists.altlinux.org?subject=unsubscribe>
List-Archive: <http://lists.altlinux.org/pipermail/sisyphus-incominger>
List-Post: <mailto:sisyphus-incominger@lists.altlinux.org>
List-Help: <mailto:sisyphus-incominger-request@lists.altlinux.org?subject=help>
List-Subscribe: <https://lists.altlinux.org/mailman/listinfo/sisyphus-incominger>, 
 <mailto:sisyphus-incominger-request@lists.altlinux.org?subject=subscribe>
X-List-Received-Date: Wed, 12 Feb 2025 05:16:08 -0000
Archived-At: <http://lore.altlinux.org/sisyphus-incominger/girar.task.374405.1.1@gyle.mskdc.altlinux.org/>
List-Archive: <http://lore.altlinux.org/sisyphus-incominger/>

https://git.altlinux.org/tasks/374405/logs/events.1.1.log
https://packages.altlinux.org/tasks/374405

subtask  name          aarch64  i586  ppc64le  x86_64
   #100  librealsense     7:04  5:37   failed    5:07

2025-Feb-12 05:08:59 :: test-only task #374405 for sisyphus started by minergenon:
#100 build 2.56.3-alt1 from /people/minergenon/packages/librealsense.git fetched at 2025-Feb-12 05:08:57
2025-Feb-12 05:09:01 :: [x86_64] #100 librealsense.git 2.56.3-alt1: build start
2025-Feb-12 05:09:01 :: [aarch64] #100 librealsense.git 2.56.3-alt1: build start
2025-Feb-12 05:09:01 :: [i586] #100 librealsense.git 2.56.3-alt1: build start
2025-Feb-12 05:09:01 :: [ppc64le] #100 librealsense.git 2.56.3-alt1: build start
[ppc64le]   Update the VERSION argument <min> value.  Or, use the <min>...<max> syntax
[ppc64le]   to tell CMake that the project requires at least <min> but has been updated
[ppc64le]   to work with policies introduced by <max> or earlier.
[ppc64le] CMake Error at /usr/share/cmake/Modules/FindPackageHandleStandardArgs.cmake:233 (message):
[ppc64le]   Could NOT find Threads (missing: Threads_FOUND)
[ppc64le] Call Stack (most recent call first):
[ppc64le]   /usr/share/cmake/Modules/FindPackageHandleStandardArgs.cmake:603 (_FPHSA_FAILURE_MESSAGE)
[ppc64le]   /usr/share/cmake/Modules/FindThreads.cmake:226 (FIND_PACKAGE_HANDLE_STANDARD_ARGS)
[ppc64le]   third-party/glfw/CMakeLists.txt:63 (find_package)
[ppc64le] -- Configuring incomplete, errors occurred!
2025-Feb-12 05:10:22 :: [ppc64le] librealsense.git 2.56.3-alt1: remote: build failed
2025-Feb-12 05:10:22 :: [ppc64le] #100 librealsense.git 2.56.3-alt1: build FAILED
2025-Feb-12 05:10:22 :: [ppc64le] requesting cancellation of task processing
2025-Feb-12 05:14:08 :: [x86_64] #100 librealsense.git 2.56.3-alt1: build OK
2025-Feb-12 05:14:38 :: [i586] #100 librealsense.git 2.56.3-alt1: build OK
2025-Feb-12 05:16:05 :: [aarch64] #100 librealsense.git 2.56.3-alt1: build OK
2025-Feb-12 05:10:22 :: [ppc64le] build FAILED
2025-Feb-12 05:16:05 :: task #374405 for sisyphus FAILED