From mboxrd@z Thu Jan  1 00:00:00 1970
Return-Path: <girar-builder@altlinux.org>
X-Spam-Checker-Version: SpamAssassin 3.4.1 (2015-04-28) on
 sa.local.altlinux.org
X-Spam-Level: 
X-Spam-Status: No, score=-3.3 required=5.0 tests=BAYES_00,RP_MATCHES_RCVD
 autolearn=ham autolearn_force=no version=3.4.1
Date: Thu, 30 Jan 2025 11:03:41 +0000
From: "Girar awaiter (serjigva)" <girar-builder@altlinux.org>
To: Sergey Gvozdetskiy <serjigva@altlinux.org>
Subject: [#371974] [test-only] p10 FAILED (try 4)
 srpm=jpackage-generic-compat-0.43-alt1.src.rpm ...
Message-ID: <girar.task.371974.4.1@gyle.mskdc.altlinux.org>
Mail-Followup-To: Girar awaiter robot <girar-builder@altlinux.org>
References: <girar.task.371974.3.1@gyle.mskdc.altlinux.org>
 <girar.task.371974.2.1@gyle.mskdc.altlinux.org>
 <girar.task.371974.1.1@gyle.mskdc.altlinux.org>
MIME-Version: 1.0
Content-Type: text/plain; charset=us-ascii
Content-Disposition: inline
In-Reply-To: <girar.task.371974.1.1@gyle.mskdc.altlinux.org>
X-girar-task-id: 371974
X-girar-task-owner: serjigva
X-girar-task-repo: p10
X-girar-task-try: 4
X-girar-task-iter: 1
X-girar-task-status: FAILED
X-girar-task-URL: https://git.altlinux.org/tasks/371974/
X-girar-task-log: logs/events.4.1.log
X-girar-task-summary: [#371974] [test-only] p10 FAILED (try 4)
 srpm=jpackage-generic-compat-0.43-alt1.src.rpm
 srpm=aqute-bnd-6.2.0-alt1_2jpp11.src.rpm tomcat-native.git=1.3.1-alt1_1jpp17
User-Agent: Mutt/1.10.1 (2018-07-13)
Cc: girar-builder-p10@altlinux.org, sisyphus-incominger@lists.altlinux.org,
 girar-builder-p10@lists.altlinux.org
X-BeenThere: sisyphus-incominger@lists.altlinux.org
X-Mailman-Version: 2.1.12
Precedence: list
Reply-To: ALT Devel discussion list <devel@lists.altlinux.org>
List-Id: ALT Linux Girar Builder robot reports
 <sisyphus-incominger.lists.altlinux.org>
List-Unsubscribe: <https://lists.altlinux.org/mailman/options/sisyphus-incominger>, 
 <mailto:sisyphus-incominger-request@lists.altlinux.org?subject=unsubscribe>
List-Archive: <http://lists.altlinux.org/pipermail/sisyphus-incominger>
List-Post: <mailto:sisyphus-incominger@lists.altlinux.org>
List-Help: <mailto:sisyphus-incominger-request@lists.altlinux.org?subject=help>
List-Subscribe: <https://lists.altlinux.org/mailman/listinfo/sisyphus-incominger>, 
 <mailto:sisyphus-incominger-request@lists.altlinux.org?subject=subscribe>
X-List-Received-Date: Thu, 30 Jan 2025 11:03:44 -0000
Archived-At: <http://lore.altlinux.org/sisyphus-incominger/girar.task.371974.4.1@gyle.mskdc.altlinux.org/>
List-Archive: <http://lore.altlinux.org/sisyphus-incominger/>

https://git.altlinux.org/tasks/371974/logs/events.4.1.log
https://packages.altlinux.org/tasks/371974

subtask  name           aarch64  armh  i586  ppc64le  x86_64
   #400  tomcat-native       47  1:08    33       51      30

2025-Jan-30 10:54:33 :: test-only task #371974 for p10 resumed by serjigva:
2025-Jan-30 10:54:33 :: message: test_for_rm164755
#100 removed
#200 build jpackage-generic-compat-0.43-alt1.src.rpm from sisyphus
#300 build aqute-bnd-6.2.0-alt1_2jpp11.src.rpm from sisyphus
#400 build 1.3.1-alt1_1jpp17 from /people/serjigva/packages/tomcat-native.git fetched at 2025-Jan-30 10:11:29
2025-Jan-30 10:54:34 :: created build repo
2025-Jan-30 10:54:35 :: [armh] #200 jpackage-generic-compat-0.43-alt1.src.rpm: build start
2025-Jan-30 10:54:35 :: [x86_64] #200 jpackage-generic-compat-0.43-alt1.src.rpm: build start
2025-Jan-30 10:54:35 :: [i586] #200 jpackage-generic-compat-0.43-alt1.src.rpm: build start
2025-Jan-30 10:54:35 :: [aarch64] #200 jpackage-generic-compat-0.43-alt1.src.rpm: build start
2025-Jan-30 10:54:35 :: [ppc64le] #200 jpackage-generic-compat-0.43-alt1.src.rpm: build start
2025-Jan-30 10:54:48 :: [i586] #200 jpackage-generic-compat-0.43-alt1.src.rpm: build OK (cached)
2025-Jan-30 10:54:49 :: [i586] #300 aqute-bnd-6.2.0-alt1_2jpp11.src.rpm: build start
2025-Jan-30 10:54:49 :: [x86_64] #200 jpackage-generic-compat-0.43-alt1.src.rpm: build OK (cached)
2025-Jan-30 10:54:49 :: [x86_64] #300 aqute-bnd-6.2.0-alt1_2jpp11.src.rpm: build start
2025-Jan-30 10:55:00 :: [aarch64] #200 jpackage-generic-compat-0.43-alt1.src.rpm: build OK (cached)
2025-Jan-30 10:55:00 :: [aarch64] #300 aqute-bnd-6.2.0-alt1_2jpp11.src.rpm: build start
2025-Jan-30 10:55:02 :: [i586] #300 aqute-bnd-6.2.0-alt1_2jpp11.src.rpm: build OK (cached)
2025-Jan-30 10:55:02 :: [ppc64le] #200 jpackage-generic-compat-0.43-alt1.src.rpm: build OK (cached)
2025-Jan-30 10:55:02 :: [i586] #400 tomcat-native.git 1.3.1-alt1_1jpp17: build start
2025-Jan-30 10:55:02 :: [ppc64le] #300 aqute-bnd-6.2.0-alt1_2jpp11.src.rpm: build start
2025-Jan-30 10:55:02 :: [x86_64] #300 aqute-bnd-6.2.0-alt1_2jpp11.src.rpm: build OK (cached)
2025-Jan-30 10:55:03 :: [x86_64] #400 tomcat-native.git 1.3.1-alt1_1jpp17: build start
2025-Jan-30 10:55:07 :: [armh] #200 jpackage-generic-compat-0.43-alt1.src.rpm: build OK (cached)
2025-Jan-30 10:55:07 :: [armh] #300 aqute-bnd-6.2.0-alt1_2jpp11.src.rpm: build start
2025-Jan-30 10:55:25 :: [aarch64] #300 aqute-bnd-6.2.0-alt1_2jpp11.src.rpm: build OK (cached)
2025-Jan-30 10:55:25 :: [aarch64] #400 tomcat-native.git 1.3.1-alt1_1jpp17: build start
2025-Jan-30 10:55:26 :: [ppc64le] #300 aqute-bnd-6.2.0-alt1_2jpp11.src.rpm: build OK (cached)
2025-Jan-30 10:55:27 :: [ppc64le] #400 tomcat-native.git 1.3.1-alt1_1jpp17: build start
2025-Jan-30 10:55:33 :: [x86_64] #400 tomcat-native.git 1.3.1-alt1_1jpp17: build OK
2025-Jan-30 10:55:35 :: [i586] #400 tomcat-native.git 1.3.1-alt1_1jpp17: build OK
2025-Jan-30 10:55:41 :: [armh] #300 aqute-bnd-6.2.0-alt1_2jpp11.src.rpm: build OK (cached)
2025-Jan-30 10:55:42 :: [armh] #400 tomcat-native.git 1.3.1-alt1_1jpp17: build start
2025-Jan-30 10:56:12 :: [aarch64] #400 tomcat-native.git 1.3.1-alt1_1jpp17: build OK
2025-Jan-30 10:56:18 :: [ppc64le] #400 tomcat-native.git 1.3.1-alt1_1jpp17: build OK
2025-Jan-30 10:56:50 :: [armh] #400 tomcat-native.git 1.3.1-alt1_1jpp17: build OK
2025-Jan-30 10:57:10 :: #200: jpackage-generic-compat-0.43-alt1.src.rpm: build check OK
x86_64/srpm/aqute-bnd-6.2.0-alt1_2jpp11.src.rpm: license not found in '/usr/share/license' directory: ASL
x86_64/srpm/aqute-bnd-6.2.0-alt1_2jpp11.src.rpm: license not found in '/usr/share/license' directory: 2.0
x86_64/rpms/bnd-maven-plugin-6.2.0-alt1_2jpp11.noarch.rpm: license not found in '/usr/share/license' directory: ASL
x86_64/rpms/bnd-maven-plugin-6.2.0-alt1_2jpp11.noarch.rpm: license not found in '/usr/share/license' directory: 2.0
x86_64/rpms/aqute-bndlib-6.2.0-alt1_2jpp11.noarch.rpm: license not found in '/usr/share/license' directory: ASL
x86_64/rpms/aqute-bndlib-6.2.0-alt1_2jpp11.noarch.rpm: license not found in '/usr/share/license' directory: 2.0
x86_64/rpms/aqute-bnd-javadoc-6.2.0-alt1_2jpp11.noarch.rpm: license not found in '/usr/share/license' directory: ASL
x86_64/rpms/aqute-bnd-javadoc-6.2.0-alt1_2jpp11.noarch.rpm: license not found in '/usr/share/license' directory: 2.0
x86_64/rpms/aqute-bnd-6.2.0-alt1_2jpp11.noarch.rpm: license not found in '/usr/share/license' directory: ASL
x86_64/rpms/aqute-bnd-6.2.0-alt1_2jpp11.noarch.rpm: license not found in '/usr/share/license' directory: 2.0
i586/srpm/aqute-bnd-6.2.0-alt1_2jpp11.src.rpm: license not found in '/usr/share/license' directory: ASL
i586/srpm/aqute-bnd-6.2.0-alt1_2jpp11.src.rpm: license not found in '/usr/share/license' directory: 2.0
i586/rpms/bnd-maven-plugin-6.2.0-alt1_2jpp11.noarch.rpm: license not found in '/usr/share/license' directory: ASL
i586/rpms/bnd-maven-plugin-6.2.0-alt1_2jpp11.noarch.rpm: license not found in '/usr/share/license' directory: 2.0
i586/rpms/aqute-bndlib-6.2.0-alt1_2jpp11.noarch.rpm: license not found in '/usr/share/license' directory: ASL
i586/rpms/aqute-bndlib-6.2.0-alt1_2jpp11.noarch.rpm: license not found in '/usr/share/license' directory: 2.0
i586/rpms/aqute-bnd-javadoc-6.2.0-alt1_2jpp11.noarch.rpm: license not found in '/usr/share/license' directory: ASL
i586/rpms/aqute-bnd-javadoc-6.2.0-alt1_2jpp11.noarch.rpm: license not found in '/usr/share/license' directory: 2.0
i586/rpms/aqute-bnd-6.2.0-alt1_2jpp11.noarch.rpm: license not found in '/usr/share/license' directory: ASL
i586/rpms/aqute-bnd-6.2.0-alt1_2jpp11.noarch.rpm: license not found in '/usr/share/license' directory: 2.0
aarch64/srpm/aqute-bnd-6.2.0-alt1_2jpp11.src.rpm: license not found in '/usr/share/license' directory: ASL
aarch64/srpm/aqute-bnd-6.2.0-alt1_2jpp11.src.rpm: license not found in '/usr/share/license' directory: 2.0
aarch64/rpms/bnd-maven-plugin-6.2.0-alt1_2jpp11.noarch.rpm: license not found in '/usr/share/license' directory: ASL
aarch64/rpms/bnd-maven-plugin-6.2.0-alt1_2jpp11.noarch.rpm: license not found in '/usr/share/license' directory: 2.0
aarch64/rpms/aqute-bndlib-6.2.0-alt1_2jpp11.noarch.rpm: license not found in '/usr/share/license' directory: ASL
aarch64/rpms/aqute-bndlib-6.2.0-alt1_2jpp11.noarch.rpm: license not found in '/usr/share/license' directory: 2.0
aarch64/rpms/aqute-bnd-javadoc-6.2.0-alt1_2jpp11.noarch.rpm: license not found in '/usr/share/license' directory: ASL
aarch64/rpms/aqute-bnd-javadoc-6.2.0-alt1_2jpp11.noarch.rpm: license not found in '/usr/share/license' directory: 2.0
aarch64/rpms/aqute-bnd-6.2.0-alt1_2jpp11.noarch.rpm: license not found in '/usr/share/license' directory: ASL
aarch64/rpms/aqute-bnd-6.2.0-alt1_2jpp11.noarch.rpm: license not found in '/usr/share/license' directory: 2.0
ppc64le/srpm/aqute-bnd-6.2.0-alt1_2jpp11.src.rpm: license not found in '/usr/share/license' directory: ASL
ppc64le/srpm/aqute-bnd-6.2.0-alt1_2jpp11.src.rpm: license not found in '/usr/share/license' directory: 2.0
ppc64le/rpms/bnd-maven-plugin-6.2.0-alt1_2jpp11.noarch.rpm: license not found in '/usr/share/license' directory: ASL
ppc64le/rpms/bnd-maven-plugin-6.2.0-alt1_2jpp11.noarch.rpm: license not found in '/usr/share/license' directory: 2.0
ppc64le/rpms/aqute-bndlib-6.2.0-alt1_2jpp11.noarch.rpm: license not found in '/usr/share/license' directory: ASL
ppc64le/rpms/aqute-bndlib-6.2.0-alt1_2jpp11.noarch.rpm: license not found in '/usr/share/license' directory: 2.0
ppc64le/rpms/aqute-bnd-javadoc-6.2.0-alt1_2jpp11.noarch.rpm: license not found in '/usr/share/license' directory: ASL
ppc64le/rpms/aqute-bnd-javadoc-6.2.0-alt1_2jpp11.noarch.rpm: license not found in '/usr/share/license' directory: 2.0
ppc64le/rpms/aqute-bnd-6.2.0-alt1_2jpp11.noarch.rpm: license not found in '/usr/share/license' directory: ASL
ppc64le/rpms/aqute-bnd-6.2.0-alt1_2jpp11.noarch.rpm: license not found in '/usr/share/license' directory: 2.0
armh/srpm/aqute-bnd-6.2.0-alt1_2jpp11.src.rpm: license not found in '/usr/share/license' directory: ASL
armh/srpm/aqute-bnd-6.2.0-alt1_2jpp11.src.rpm: license not found in '/usr/share/license' directory: 2.0
armh/rpms/bnd-maven-plugin-6.2.0-alt1_2jpp11.noarch.rpm: license not found in '/usr/share/license' directory: ASL
armh/rpms/bnd-maven-plugin-6.2.0-alt1_2jpp11.noarch.rpm: license not found in '/usr/share/license' directory: 2.0
armh/rpms/aqute-bndlib-6.2.0-alt1_2jpp11.noarch.rpm: license not found in '/usr/share/license' directory: ASL
armh/rpms/aqute-bndlib-6.2.0-alt1_2jpp11.noarch.rpm: license not found in '/usr/share/license' directory: 2.0
armh/rpms/aqute-bnd-javadoc-6.2.0-alt1_2jpp11.noarch.rpm: license not found in '/usr/share/license' directory: ASL
armh/rpms/aqute-bnd-javadoc-6.2.0-alt1_2jpp11.noarch.rpm: license not found in '/usr/share/license' directory: 2.0
armh/rpms/aqute-bnd-6.2.0-alt1_2jpp11.noarch.rpm: license not found in '/usr/share/license' directory: ASL
armh/rpms/aqute-bnd-6.2.0-alt1_2jpp11.noarch.rpm: license not found in '/usr/share/license' directory: 2.0
2025-Jan-30 10:57:36 :: #300: aqute-bnd-6.2.0-alt1_2jpp11.src.rpm: build check OK
x86_64/srpm/tomcat-native-1.3.1-alt1_1jpp17.src.rpm: license not found in '/usr/share/license' directory: ASL
x86_64/srpm/tomcat-native-1.3.1-alt1_1jpp17.src.rpm: license not found in '/usr/share/license' directory: 2.0
x86_64/rpms/tomcat-native-1.3.1-alt1_1jpp17.x86_64.rpm: license not found in '/usr/share/license' directory: ASL
x86_64/rpms/tomcat-native-1.3.1-alt1_1jpp17.x86_64.rpm: license not found in '/usr/share/license' directory: 2.0
x86_64/rpms/tomcat-native-debuginfo-1.3.1-alt1_1jpp17.x86_64.rpm: license not found in '/usr/share/license' directory: ASL
x86_64/rpms/tomcat-native-debuginfo-1.3.1-alt1_1jpp17.x86_64.rpm: license not found in '/usr/share/license' directory: 2.0
i586/srpm/tomcat-native-1.3.1-alt1_1jpp17.src.rpm: license not found in '/usr/share/license' directory: ASL
i586/srpm/tomcat-native-1.3.1-alt1_1jpp17.src.rpm: license not found in '/usr/share/license' directory: 2.0
i586/rpms/tomcat-native-1.3.1-alt1_1jpp17.i586.rpm: license not found in '/usr/share/license' directory: ASL
i586/rpms/tomcat-native-1.3.1-alt1_1jpp17.i586.rpm: license not found in '/usr/share/license' directory: 2.0
i586/rpms/tomcat-native-debuginfo-1.3.1-alt1_1jpp17.i586.rpm: license not found in '/usr/share/license' directory: ASL
i586/rpms/tomcat-native-debuginfo-1.3.1-alt1_1jpp17.i586.rpm: license not found in '/usr/share/license' directory: 2.0
aarch64/srpm/tomcat-native-1.3.1-alt1_1jpp17.src.rpm: license not found in '/usr/share/license' directory: ASL
aarch64/srpm/tomcat-native-1.3.1-alt1_1jpp17.src.rpm: license not found in '/usr/share/license' directory: 2.0
aarch64/rpms/tomcat-native-1.3.1-alt1_1jpp17.aarch64.rpm: license not found in '/usr/share/license' directory: ASL
aarch64/rpms/tomcat-native-1.3.1-alt1_1jpp17.aarch64.rpm: license not found in '/usr/share/license' directory: 2.0
aarch64/rpms/tomcat-native-debuginfo-1.3.1-alt1_1jpp17.aarch64.rpm: license not found in '/usr/share/license' directory: ASL
aarch64/rpms/tomcat-native-debuginfo-1.3.1-alt1_1jpp17.aarch64.rpm: license not found in '/usr/share/license' directory: 2.0
ppc64le/srpm/tomcat-native-1.3.1-alt1_1jpp17.src.rpm: license not found in '/usr/share/license' directory: ASL
ppc64le/srpm/tomcat-native-1.3.1-alt1_1jpp17.src.rpm: license not found in '/usr/share/license' directory: 2.0
ppc64le/rpms/tomcat-native-1.3.1-alt1_1jpp17.ppc64le.rpm: license not found in '/usr/share/license' directory: ASL
ppc64le/rpms/tomcat-native-1.3.1-alt1_1jpp17.ppc64le.rpm: license not found in '/usr/share/license' directory: 2.0
ppc64le/rpms/tomcat-native-debuginfo-1.3.1-alt1_1jpp17.ppc64le.rpm: license not found in '/usr/share/license' directory: ASL
ppc64le/rpms/tomcat-native-debuginfo-1.3.1-alt1_1jpp17.ppc64le.rpm: license not found in '/usr/share/license' directory: 2.0
armh/srpm/tomcat-native-1.3.1-alt1_1jpp17.src.rpm: license not found in '/usr/share/license' directory: ASL
armh/srpm/tomcat-native-1.3.1-alt1_1jpp17.src.rpm: license not found in '/usr/share/license' directory: 2.0
armh/rpms/tomcat-native-1.3.1-alt1_1jpp17.armh.rpm: license not found in '/usr/share/license' directory: ASL
armh/rpms/tomcat-native-1.3.1-alt1_1jpp17.armh.rpm: license not found in '/usr/share/license' directory: 2.0
armh/rpms/tomcat-native-debuginfo-1.3.1-alt1_1jpp17.armh.rpm: license not found in '/usr/share/license' directory: ASL
armh/rpms/tomcat-native-debuginfo-1.3.1-alt1_1jpp17.armh.rpm: license not found in '/usr/share/license' directory: 2.0
2025-Jan-30 10:57:50 :: #400: tomcat-native.git 1.3.1-alt1_1jpp17: build check OK
2025-Jan-30 10:57:51 :: build check OK
2025-Jan-30 10:58:03 :: noarch check OK
2025-Jan-30 10:58:06 :: plan: src +3 -3 =19006, aarch64 +4 -2 =31651, armh +3 -2 =29502, i586 +4 -2 =31982, noarch +6 -6 =20408, ppc64le +4 -2 =31000, x86_64 +4 -2 =32992
#300 aqute-bnd 4.3.1-alt1_4jpp11 -> 0:6.2.0-alt1_2jpp11
 Mon Mar 20 2023 Igor Vlasenko <viy@altlinux> 0:6.2.0-alt1_2jpp11
 - new version
 Fri Jul 01 2022 Igor Vlasenko <viy@altlinux> 0:5.2.0-alt1_9jpp11
 - update
 Wed Jun 08 2022 Igor Vlasenko <viy@altlinux> 0:5.2.0-alt1_5jpp11
 - new version
#200 jpackage-generic-compat 0.38-alt0.p10.1 -> 0.43-alt1
 Fri Jan 12 2024 Igor Vlasenko <viy@altlinux> 0.43-alt1
 - added jpackage-17-compat
 Sun Jun 12 2022 Igor Vlasenko <viy@altlinux> 0.42-alt1
 - added jpackage-11 provides
 Thu Jun 09 2022 Igor Vlasenko <viy@altlinux> 0.41-alt1
 - added Conflicts for maven-openjdkXX
 Wed Jun 08 2022 Igor Vlasenko <viy@altlinux> 0.40-alt1
 - added Conflicts for maven-local-openjdkXX
 Wed Sep 01 2021 Igor Vlasenko <viy@altlinux> 0.39-alt1
 - restored jpackage-generic-compat dependency on latest jvm
#400 tomcat-native 1.2.23-alt1_8jpp11 -> 1:1.3.1-alt1_1jpp17
 Thu Jan 30 2025 Sergey Gvozdetskiy <serjigva@altlinux> 1:1.3.1-alt1_1jpp17
 - new version
 Tue Mar 21 2023 Igor Vlasenko <viy@altlinux> 1:1.2.35-alt1_1jpp11
 - update
2025-Jan-30 10:58:57 :: patched apt indices
2025-Jan-30 10:59:13 :: created next repo
2025-Jan-30 10:59:20 :: duplicate provides check OK
2025-Jan-30 11:00:08 :: dependencies check OK
2025-Jan-30 11:00:40 :: [x86_64 i586 aarch64 ppc64le armh] ELF symbols check OK
warning [i586]: aqute-bnd=0:6.2.0-alt1_2jpp11: circular dependencies on aqute-bndlib=0:6.2.0-alt1_2jpp11
	i586: aqute-bnd=0:6.2.0-alt1_2jpp11 post-install unowned files:
 /etc/ant.d
2025-Jan-30 11:00:52 :: [i586] #300 aqute-bnd: install check OK (cached)
warning [x86_64]: aqute-bnd=0:6.2.0-alt1_2jpp11: circular dependencies on aqute-bndlib=0:6.2.0-alt1_2jpp11
	x86_64: aqute-bnd=0:6.2.0-alt1_2jpp11 post-install unowned files:
 /etc/ant.d
2025-Jan-30 11:00:53 :: [x86_64] #300 aqute-bnd: install check OK (cached)
2025-Jan-30 11:00:56 :: [i586] #300 aqute-bnd-javadoc: install check OK (cached)
2025-Jan-30 11:00:57 :: [x86_64] #300 aqute-bnd-javadoc: install check OK (cached)
warning [aarch64]: aqute-bnd=0:6.2.0-alt1_2jpp11: circular dependencies on aqute-bndlib=0:6.2.0-alt1_2jpp11
	aarch64: aqute-bnd=0:6.2.0-alt1_2jpp11 post-install unowned files:
 /etc/ant.d
2025-Jan-30 11:00:59 :: [aarch64] #300 aqute-bnd: install check OK (cached)
warning [ppc64le]: aqute-bnd=0:6.2.0-alt1_2jpp11: circular dependencies on aqute-bndlib=0:6.2.0-alt1_2jpp11
	ppc64le: aqute-bnd=0:6.2.0-alt1_2jpp11 post-install unowned files:
 /etc/ant.d
2025-Jan-30 11:01:00 :: [ppc64le] #300 aqute-bnd: install check OK (cached)
warning [i586]: aqute-bndlib=0:6.2.0-alt1_2jpp11: circular dependencies on aqute-bnd=0:6.2.0-alt1_2jpp11
	i586: aqute-bndlib=0:6.2.0-alt1_2jpp11 post-install unowned files:
 /etc/ant.d
2025-Jan-30 11:01:00 :: [i586] #300 aqute-bndlib: install check OK (cached)
warning [x86_64]: aqute-bndlib=0:6.2.0-alt1_2jpp11: circular dependencies on aqute-bnd=0:6.2.0-alt1_2jpp11
	x86_64: aqute-bndlib=0:6.2.0-alt1_2jpp11 post-install unowned files:
 /etc/ant.d
2025-Jan-30 11:01:01 :: [x86_64] #300 aqute-bndlib: install check OK (cached)
2025-Jan-30 11:01:04 :: [i586] #300 bnd-maven-plugin: install check OK (cached)
2025-Jan-30 11:01:05 :: [x86_64] #300 bnd-maven-plugin: install check OK (cached)
2025-Jan-30 11:01:05 :: [aarch64] #300 aqute-bnd-javadoc: install check OK (cached)
warning [armh]: aqute-bnd=0:6.2.0-alt1_2jpp11: circular dependencies on aqute-bndlib=0:6.2.0-alt1_2jpp11
	armh: aqute-bnd=0:6.2.0-alt1_2jpp11 post-install unowned files:
 /etc/ant.d
2025-Jan-30 11:01:06 :: [armh] #300 aqute-bnd: install check OK (cached)
2025-Jan-30 11:01:08 :: [ppc64le] #300 aqute-bnd-javadoc: install check OK (cached)
2025-Jan-30 11:01:08 :: [i586] #200 jpackage-1.8-compat: install check OK (cached)
2025-Jan-30 11:01:09 :: [x86_64] #200 jpackage-1.8-compat: install check OK (cached)
warning [aarch64]: aqute-bndlib=0:6.2.0-alt1_2jpp11: circular dependencies on aqute-bnd=0:6.2.0-alt1_2jpp11
	aarch64: aqute-bndlib=0:6.2.0-alt1_2jpp11 post-install unowned files:
 /etc/ant.d
2025-Jan-30 11:01:12 :: [aarch64] #300 aqute-bndlib: install check OK (cached)
2025-Jan-30 11:01:12 :: [i586] #200 jpackage-11-compat: install check OK (cached)
2025-Jan-30 11:01:14 :: [x86_64] #200 jpackage-11-compat: install check OK (cached)
warning [ppc64le]: aqute-bndlib=0:6.2.0-alt1_2jpp11: circular dependencies on aqute-bnd=0:6.2.0-alt1_2jpp11
	ppc64le: aqute-bndlib=0:6.2.0-alt1_2jpp11 post-install unowned files:
 /etc/ant.d
2025-Jan-30 11:01:16 :: [ppc64le] #300 aqute-bndlib: install check OK (cached)
2025-Jan-30 11:01:17 :: [i586] #200 jpackage-17-compat: install check OK (cached)
2025-Jan-30 11:01:17 :: [armh] #300 aqute-bnd-javadoc: install check OK (cached)
2025-Jan-30 11:01:18 :: [x86_64] #200 jpackage-17-compat: install check OK (cached)
2025-Jan-30 11:01:19 :: [aarch64] #300 bnd-maven-plugin: install check OK (cached)
2025-Jan-30 11:01:21 :: [i586] #200 jpackage-generic-compat: install check OK (cached)
2025-Jan-30 11:01:22 :: [x86_64] #200 jpackage-generic-compat: install check OK (cached)
2025-Jan-30 11:01:24 :: [ppc64le] #300 bnd-maven-plugin: install check OK (cached)
2025-Jan-30 11:01:26 :: [aarch64] #200 jpackage-1.8-compat: install check OK (cached)
2025-Jan-30 11:01:27 :: [i586] #400 tomcat-native: install check OK
warning [armh]: aqute-bndlib=0:6.2.0-alt1_2jpp11: circular dependencies on aqute-bnd=0:6.2.0-alt1_2jpp11
	armh: aqute-bndlib=0:6.2.0-alt1_2jpp11 post-install unowned files:
 /etc/ant.d
2025-Jan-30 11:01:28 :: [armh] #300 aqute-bndlib: install check OK (cached)
2025-Jan-30 11:01:28 :: [x86_64] #400 tomcat-native: install check OK
2025-Jan-30 11:01:33 :: [ppc64le] #200 jpackage-1.8-compat: install check OK (cached)
2025-Jan-30 11:01:34 :: [aarch64] #200 jpackage-11-compat: install check OK (cached)
2025-Jan-30 11:01:35 :: [i586] #400 tomcat-native-debuginfo: install check OK
2025-Jan-30 11:01:36 :: [x86_64] #400 tomcat-native-debuginfo: install check OK
2025-Jan-30 11:01:39 :: [armh] #300 bnd-maven-plugin: install check OK (cached)
2025-Jan-30 11:01:41 :: [aarch64] #200 jpackage-17-compat: install check OK (cached)
2025-Jan-30 11:01:41 :: [ppc64le] #200 jpackage-11-compat: install check OK (cached)
2025-Jan-30 11:01:48 :: [aarch64] #200 jpackage-generic-compat: install check OK (cached)
2025-Jan-30 11:01:50 :: [ppc64le] #200 jpackage-17-compat: install check OK (cached)
2025-Jan-30 11:01:50 :: [armh] #200 jpackage-1.8-compat: install check OK (cached)
2025-Jan-30 11:01:58 :: [ppc64le] #200 jpackage-generic-compat: install check OK (cached)
2025-Jan-30 11:01:59 :: [aarch64] #400 tomcat-native: install check OK
2025-Jan-30 11:02:01 :: [armh] #200 jpackage-11-compat: install check OK (cached)
2025-Jan-30 11:02:11 :: [ppc64le] #400 tomcat-native: install check OK
2025-Jan-30 11:02:11 :: [aarch64] #400 tomcat-native-debuginfo: install check OK
2025-Jan-30 11:02:13 :: [armh] #200 jpackage-generic-compat: install check OK (cached)
2025-Jan-30 11:02:25 :: [ppc64le] #400 tomcat-native-debuginfo: install check OK
2025-Jan-30 11:02:29 :: [armh] #400 tomcat-native: install check OK
2025-Jan-30 11:02:47 :: [armh] #400 tomcat-native-debuginfo: install check OK
2025-Jan-30 11:02:48 :: [x86_64-i586] plan: #1 +1 -1 =11114
arepo/x86_64-i586/rpms/i586-tomcat-native-1.3.1-alt1_1jpp17.i586.rpm: license not found in '/usr/share/license' directory: ASL
arepo/x86_64-i586/rpms/i586-tomcat-native-1.3.1-alt1_1jpp17.i586.rpm: license not found in '/usr/share/license' directory: 2.0
2025-Jan-30 11:03:05 :: [x86_64-i586] arepo build OK
2025-Jan-30 11:03:25 :: [x86_64-i586] generated apt indices
2025-Jan-30 11:03:26 :: [x86_64-i586] created next repo
2025-Jan-30 11:03:39 :: [x86_64-i586] dependencies check OK
2025-Jan-30 11:03:40 :: gears inheritance check OK
error: #200: jpackage-generic-compat-0.43-alt1.src.rpm: missing last changelog entry from jpackage-generic-compat-0.38-alt0.p10.1.src.rpm:
* Mon Nov 01 2021	viy@altlinux	0.38-alt0.p10.1
2025-Jan-30 11:03:40 :: srpm inheritance check FAILED for: #200 
2025-Jan-30 11:03:40 :: task #371974 for p10 FAILED