ALT Linux Girar Builder robot reports
 help / color / mirror / Atom feed
From: "Girar pender (snowmix)" <girar-builder@altlinux.org>
To: Sergey Gvozdetskiy <serjigva@altlinux.org>
Cc: girar-builder-p10@altlinux.org,
	sisyphus-incominger@lists.altlinux.org,
	girar-builder-p10@lists.altlinux.org
Subject: [#371974] p10 DONE (try 18) srpm=aqute-bnd-6.2.0-alt1_2jpp11.src.rpm ...
Date: Thu, 27 Mar 2025 08:42:30 +0000
Message-ID: <girar.task.371974.18.1@gyle.mskdc.altlinux.org> (raw)
In-Reply-To: <girar.task.371974.1.1@gyle.mskdc.altlinux.org>

https://git.altlinux.org/tasks/archive/done/_363/371974/logs/events.18.1.log
https://packages.altlinux.org/tasks/371974

2025-Mar-27 08:03:35 :: task #371974 for p10 resumed by snowmix:
2025-Mar-27 08:03:35 :: message: Fix_CVE-2024-56337
#100 removed
#200 removed
#240 removed
#300 removed
#320 build aqute-bnd-6.2.0-alt1_2jpp11.src.rpm from sisyphus
#324 build maven-plugin-bundle-4.2.1-alt1_3jpp11.src.rpm from p10
#330 removed
#334 build apache-commons-lang3-3.11-alt1_1jpp11.src.rpm from p10
#336 removed
#337 build bouncycastle1.65-1.65-alt2_4jpp11.src.rpm from p10
#340 build ecj-4.23-alt1_3jpp11.src.rpm from sisyphus
#400 removed
#440 removed
#500 removed
#540 build jdom2-2.0.6-alt1_21jpp11.src.rpm from p10
#560 build lz4-java-1.7.1-alt1_12jpp11.src.rpm from p10
#600 build scala-2.13.9-alt3.src.rpm from p10
#620 build concurrent-trees-2.6.1-alt1_10jpp11.src.rpm from p10
#640 build bouncycastle-1.67-alt1_2jpp11.src.rpm from p10
#700 build freemarker-2.3.30-alt2_3jpp8.src.rpm from p10
#720 build maven-osgi-0.2.0-alt1_19jpp11.src.rpm from p10
#740 build javaparser-3.14.16-alt1_1jpp11.src.rpm from p10
#1000 build apache-commons-parent-52-alt1_1jpp11.src.rpm from p10
#1100 build rxtx-2.2-alt3_0.24.20100211jpp8.src.rpm from p10
#1200 build josql-2.2-alt1_15jpp8.src.rpm from p10
#1300 build dnsjava-2.1.3-alt1_18jpp8.src.rpm from p10
#1400 build bindex-2.2-alt3_21.svn96jpp8.src.rpm from p10
#1500 build jgraphx-3.6.0.0-alt1_10jpp8.src.rpm from p10
#1600 removed
#1700 build gentlyweb-utils-1.5-alt1_15jpp8.src.rpm from p10
#2000 build extra166y-1.7.0-alt1_11jpp8.src.rpm from p10
#2100 build 6.0.2-alt2 from /gears/s/scilab.git fetched at 2025-Feb-25 11:51:17 from p10
#2200 build jakarta-server-pages-2.3.6-alt1_3jpp11.src.rpm from p10
#2300 build plexus-compiler-2.8.8-alt1_1jpp11.src.rpm from p10
#2400 removed
#2440 removed
#2460 build tomcat-9.0.98-alt0_1jpp17.p10.1.src.rpm
#2500 removed
#2600 removed
#2700 removed
#3000 delete apache-commons-javaflow
#3100 delete apache-commons-jci
2025-Mar-27 08:03:35 :: created build repo
2025-Mar-27 08:03:37 :: [i586] #320 aqute-bnd-6.2.0-alt1_2jpp11.src.rpm: build start
2025-Mar-27 08:03:37 :: [x86_64] #320 aqute-bnd-6.2.0-alt1_2jpp11.src.rpm: build start
2025-Mar-27 08:03:37 :: [armh] #320 aqute-bnd-6.2.0-alt1_2jpp11.src.rpm: build start
2025-Mar-27 08:03:37 :: [aarch64] #320 aqute-bnd-6.2.0-alt1_2jpp11.src.rpm: build start
2025-Mar-27 08:03:54 :: [i586] #320 aqute-bnd-6.2.0-alt1_2jpp11.src.rpm: build OK (cached)
2025-Mar-27 08:03:54 :: [x86_64] #320 aqute-bnd-6.2.0-alt1_2jpp11.src.rpm: build OK (cached)
2025-Mar-27 08:03:55 :: [i586] #324 maven-plugin-bundle-4.2.1-alt1_3jpp11.src.rpm: build start
2025-Mar-27 08:03:55 :: [x86_64] #324 maven-plugin-bundle-4.2.1-alt1_3jpp11.src.rpm: build start
2025-Mar-27 08:04:07 :: [i586] #324 maven-plugin-bundle-4.2.1-alt1_3jpp11.src.rpm: build OK (cached)
2025-Mar-27 08:04:08 :: [i586] #334 apache-commons-lang3-3.11-alt1_1jpp11.src.rpm: build start
2025-Mar-27 08:04:08 :: [x86_64] #324 maven-plugin-bundle-4.2.1-alt1_3jpp11.src.rpm: build OK (cached)
2025-Mar-27 08:04:08 :: [x86_64] #334 apache-commons-lang3-3.11-alt1_1jpp11.src.rpm: build start
2025-Mar-27 08:04:12 :: [aarch64] #320 aqute-bnd-6.2.0-alt1_2jpp11.src.rpm: build OK (cached)
2025-Mar-27 08:04:12 :: [aarch64] #324 maven-plugin-bundle-4.2.1-alt1_3jpp11.src.rpm: build start
2025-Mar-27 08:04:19 :: [i586] #334 apache-commons-lang3-3.11-alt1_1jpp11.src.rpm: build OK (cached)
2025-Mar-27 08:04:20 :: [i586] #337 bouncycastle1.65-1.65-alt2_4jpp11.src.rpm: build start
2025-Mar-27 08:04:20 :: [x86_64] #334 apache-commons-lang3-3.11-alt1_1jpp11.src.rpm: build OK (cached)
2025-Mar-27 08:04:20 :: [x86_64] #337 bouncycastle1.65-1.65-alt2_4jpp11.src.rpm: build start
2025-Mar-27 08:04:22 :: [armh] #320 aqute-bnd-6.2.0-alt1_2jpp11.src.rpm: build OK (cached)
2025-Mar-27 08:04:22 :: [armh] #324 maven-plugin-bundle-4.2.1-alt1_3jpp11.src.rpm: build start
2025-Mar-27 08:04:32 :: [i586] #337 bouncycastle1.65-1.65-alt2_4jpp11.src.rpm: build OK (cached)
2025-Mar-27 08:04:32 :: [i586] #340 ecj-4.23-alt1_3jpp11.src.rpm: build start
2025-Mar-27 08:04:32 :: [x86_64] #337 bouncycastle1.65-1.65-alt2_4jpp11.src.rpm: build OK (cached)
2025-Mar-27 08:04:33 :: [x86_64] #340 ecj-4.23-alt1_3jpp11.src.rpm: build start
2025-Mar-27 08:04:37 :: [aarch64] #324 maven-plugin-bundle-4.2.1-alt1_3jpp11.src.rpm: build OK (cached)
2025-Mar-27 08:04:37 :: [aarch64] #334 apache-commons-lang3-3.11-alt1_1jpp11.src.rpm: build start
2025-Mar-27 08:04:43 :: [i586] #340 ecj-4.23-alt1_3jpp11.src.rpm: build OK (cached)
2025-Mar-27 08:04:44 :: [i586] #540 jdom2-2.0.6-alt1_21jpp11.src.rpm: build start
2025-Mar-27 08:04:44 :: [x86_64] #340 ecj-4.23-alt1_3jpp11.src.rpm: build OK (cached)
2025-Mar-27 08:04:44 :: [x86_64] #540 jdom2-2.0.6-alt1_21jpp11.src.rpm: build start
2025-Mar-27 08:04:55 :: [i586] #540 jdom2-2.0.6-alt1_21jpp11.src.rpm: build OK (cached)
2025-Mar-27 08:04:55 :: [i586] #560 lz4-java-1.7.1-alt1_12jpp11.src.rpm: build start
2025-Mar-27 08:04:56 :: [x86_64] #540 jdom2-2.0.6-alt1_21jpp11.src.rpm: build OK (cached)
2025-Mar-27 08:04:56 :: [x86_64] #560 lz4-java-1.7.1-alt1_12jpp11.src.rpm: build start
2025-Mar-27 08:04:56 :: [armh] #324 maven-plugin-bundle-4.2.1-alt1_3jpp11.src.rpm: build OK (cached)
2025-Mar-27 08:04:57 :: [armh] #334 apache-commons-lang3-3.11-alt1_1jpp11.src.rpm: build start
2025-Mar-27 08:05:00 :: [aarch64] #334 apache-commons-lang3-3.11-alt1_1jpp11.src.rpm: build OK (cached)
2025-Mar-27 08:05:00 :: [aarch64] #337 bouncycastle1.65-1.65-alt2_4jpp11.src.rpm: build start
2025-Mar-27 08:05:07 :: [i586] #560 lz4-java-1.7.1-alt1_12jpp11.src.rpm: build OK (cached)
2025-Mar-27 08:05:07 :: [i586] #600 scala-2.13.9-alt3.src.rpm: build start
2025-Mar-27 08:05:08 :: [x86_64] #560 lz4-java-1.7.1-alt1_12jpp11.src.rpm: build OK (cached)
2025-Mar-27 08:05:08 :: [x86_64] #600 scala-2.13.9-alt3.src.rpm: build start
2025-Mar-27 08:05:21 :: [x86_64] #600 scala-2.13.9-alt3.src.rpm: build OK (cached)
2025-Mar-27 08:05:21 :: [x86_64] #620 concurrent-trees-2.6.1-alt1_10jpp11.src.rpm: build start
2025-Mar-27 08:05:22 :: [aarch64] #337 bouncycastle1.65-1.65-alt2_4jpp11.src.rpm: build OK (cached)
2025-Mar-27 08:05:22 :: [aarch64] #340 ecj-4.23-alt1_3jpp11.src.rpm: build start
2025-Mar-27 08:05:25 :: [i586] #600 scala-2.13.9-alt3.src.rpm: build SKIPPED
2025-Mar-27 08:05:25 :: [i586] #620 concurrent-trees-2.6.1-alt1_10jpp11.src.rpm: build start
2025-Mar-27 08:05:27 :: [armh] #334 apache-commons-lang3-3.11-alt1_1jpp11.src.rpm: build OK (cached)
2025-Mar-27 08:05:28 :: [armh] #337 bouncycastle1.65-1.65-alt2_4jpp11.src.rpm: build start
2025-Mar-27 08:05:33 :: [x86_64] #620 concurrent-trees-2.6.1-alt1_10jpp11.src.rpm: build OK (cached)
2025-Mar-27 08:05:33 :: [x86_64] #640 bouncycastle-1.67-alt1_2jpp11.src.rpm: build start
2025-Mar-27 08:05:37 :: [i586] #620 concurrent-trees-2.6.1-alt1_10jpp11.src.rpm: build OK (cached)
2025-Mar-27 08:05:37 :: [i586] #640 bouncycastle-1.67-alt1_2jpp11.src.rpm: build start
2025-Mar-27 08:05:44 :: [aarch64] #340 ecj-4.23-alt1_3jpp11.src.rpm: build OK (cached)
2025-Mar-27 08:05:44 :: [aarch64] #540 jdom2-2.0.6-alt1_21jpp11.src.rpm: build start
2025-Mar-27 08:05:45 :: [x86_64] #640 bouncycastle-1.67-alt1_2jpp11.src.rpm: build OK (cached)
2025-Mar-27 08:05:45 :: [x86_64] #700 freemarker-2.3.30-alt2_3jpp8.src.rpm: build start
2025-Mar-27 08:05:49 :: [i586] #640 bouncycastle-1.67-alt1_2jpp11.src.rpm: build OK (cached)
2025-Mar-27 08:05:49 :: [i586] #700 freemarker-2.3.30-alt2_3jpp8.src.rpm: build start
2025-Mar-27 08:05:57 :: [x86_64] #700 freemarker-2.3.30-alt2_3jpp8.src.rpm: build OK (cached)
2025-Mar-27 08:05:58 :: [x86_64] #720 maven-osgi-0.2.0-alt1_19jpp11.src.rpm: build start
2025-Mar-27 08:05:59 :: [armh] #337 bouncycastle1.65-1.65-alt2_4jpp11.src.rpm: build OK (cached)
2025-Mar-27 08:05:59 :: [armh] #340 ecj-4.23-alt1_3jpp11.src.rpm: build start
2025-Mar-27 08:06:02 :: [i586] #700 freemarker-2.3.30-alt2_3jpp8.src.rpm: build OK (cached)
2025-Mar-27 08:06:02 :: [i586] #720 maven-osgi-0.2.0-alt1_19jpp11.src.rpm: build start
2025-Mar-27 08:06:06 :: [aarch64] #540 jdom2-2.0.6-alt1_21jpp11.src.rpm: build OK (cached)
2025-Mar-27 08:06:06 :: [aarch64] #560 lz4-java-1.7.1-alt1_12jpp11.src.rpm: build start
2025-Mar-27 08:06:10 :: [x86_64] #720 maven-osgi-0.2.0-alt1_19jpp11.src.rpm: build OK (cached)
2025-Mar-27 08:06:10 :: [x86_64] #740 javaparser-3.14.16-alt1_1jpp11.src.rpm: build start
2025-Mar-27 08:06:14 :: [i586] #720 maven-osgi-0.2.0-alt1_19jpp11.src.rpm: build OK (cached)
2025-Mar-27 08:06:14 :: [i586] #740 javaparser-3.14.16-alt1_1jpp11.src.rpm: build start
2025-Mar-27 08:06:22 :: [x86_64] #740 javaparser-3.14.16-alt1_1jpp11.src.rpm: build OK (cached)
2025-Mar-27 08:06:23 :: [x86_64] #1000 apache-commons-parent-52-alt1_1jpp11.src.rpm: build start
2025-Mar-27 08:06:26 :: [i586] #740 javaparser-3.14.16-alt1_1jpp11.src.rpm: build OK (cached)
2025-Mar-27 08:06:26 :: [i586] #1000 apache-commons-parent-52-alt1_1jpp11.src.rpm: build start
2025-Mar-27 08:06:27 :: [aarch64] #560 lz4-java-1.7.1-alt1_12jpp11.src.rpm: build OK (cached)
2025-Mar-27 08:06:27 :: [aarch64] #600 scala-2.13.9-alt3.src.rpm: build start
2025-Mar-27 08:06:29 :: [armh] #340 ecj-4.23-alt1_3jpp11.src.rpm: build OK (cached)
2025-Mar-27 08:06:29 :: [armh] #540 jdom2-2.0.6-alt1_21jpp11.src.rpm: build start
2025-Mar-27 08:06:35 :: [x86_64] #1000 apache-commons-parent-52-alt1_1jpp11.src.rpm: build OK (cached)
2025-Mar-27 08:06:35 :: [x86_64] #1100 rxtx-2.2-alt3_0.24.20100211jpp8.src.rpm: build start
2025-Mar-27 08:06:38 :: [i586] #1000 apache-commons-parent-52-alt1_1jpp11.src.rpm: build OK (cached)
2025-Mar-27 08:06:38 :: [i586] #1100 rxtx-2.2-alt3_0.24.20100211jpp8.src.rpm: build start
2025-Mar-27 08:06:47 :: [x86_64] #1100 rxtx-2.2-alt3_0.24.20100211jpp8.src.rpm: build OK (cached)
2025-Mar-27 08:06:47 :: [x86_64] #1200 josql-2.2-alt1_15jpp8.src.rpm: build start
2025-Mar-27 08:06:50 :: [i586] #1100 rxtx-2.2-alt3_0.24.20100211jpp8.src.rpm: build OK (cached)
2025-Mar-27 08:06:50 :: [i586] #1200 josql-2.2-alt1_15jpp8.src.rpm: build start
2025-Mar-27 08:06:51 :: [aarch64] #600 scala-2.13.9-alt3.src.rpm: build OK (cached)
2025-Mar-27 08:06:51 :: [aarch64] #620 concurrent-trees-2.6.1-alt1_10jpp11.src.rpm: build start
2025-Mar-27 08:06:59 :: [x86_64] #1200 josql-2.2-alt1_15jpp8.src.rpm: build OK (cached)
2025-Mar-27 08:06:59 :: [armh] #540 jdom2-2.0.6-alt1_21jpp11.src.rpm: build OK (cached)
2025-Mar-27 08:06:59 :: [x86_64] #1300 dnsjava-2.1.3-alt1_18jpp8.src.rpm: build start
2025-Mar-27 08:06:59 :: [armh] #560 lz4-java-1.7.1-alt1_12jpp11.src.rpm: build start
2025-Mar-27 08:07:01 :: [i586] #1200 josql-2.2-alt1_15jpp8.src.rpm: build OK (cached)
2025-Mar-27 08:07:02 :: [i586] #1300 dnsjava-2.1.3-alt1_18jpp8.src.rpm: build start
2025-Mar-27 08:07:10 :: [x86_64] #1300 dnsjava-2.1.3-alt1_18jpp8.src.rpm: build OK (cached)
2025-Mar-27 08:07:11 :: [x86_64] #1400 bindex-2.2-alt3_21.svn96jpp8.src.rpm: build start
2025-Mar-27 08:07:13 :: [i586] #1300 dnsjava-2.1.3-alt1_18jpp8.src.rpm: build OK (cached)
2025-Mar-27 08:07:13 :: [aarch64] #620 concurrent-trees-2.6.1-alt1_10jpp11.src.rpm: build OK (cached)
2025-Mar-27 08:07:13 :: [i586] #1400 bindex-2.2-alt3_21.svn96jpp8.src.rpm: build start
2025-Mar-27 08:07:13 :: [aarch64] #640 bouncycastle-1.67-alt1_2jpp11.src.rpm: build start
2025-Mar-27 08:07:22 :: [x86_64] #1400 bindex-2.2-alt3_21.svn96jpp8.src.rpm: build OK (cached)
2025-Mar-27 08:07:22 :: [x86_64] #1500 jgraphx-3.6.0.0-alt1_10jpp8.src.rpm: build start
2025-Mar-27 08:07:25 :: [i586] #1400 bindex-2.2-alt3_21.svn96jpp8.src.rpm: build OK (cached)
2025-Mar-27 08:07:25 :: [i586] #1500 jgraphx-3.6.0.0-alt1_10jpp8.src.rpm: build start
2025-Mar-27 08:07:29 :: [armh] #560 lz4-java-1.7.1-alt1_12jpp11.src.rpm: build OK (cached)
2025-Mar-27 08:07:29 :: [armh] #600 scala-2.13.9-alt3.src.rpm: build start
2025-Mar-27 08:07:34 :: [x86_64] #1500 jgraphx-3.6.0.0-alt1_10jpp8.src.rpm: build OK (cached)
2025-Mar-27 08:07:34 :: [x86_64] #1700 gentlyweb-utils-1.5-alt1_15jpp8.src.rpm: build start
2025-Mar-27 08:07:35 :: [aarch64] #640 bouncycastle-1.67-alt1_2jpp11.src.rpm: build OK (cached)
2025-Mar-27 08:07:36 :: [aarch64] #700 freemarker-2.3.30-alt2_3jpp8.src.rpm: build start
2025-Mar-27 08:07:36 :: [i586] #1500 jgraphx-3.6.0.0-alt1_10jpp8.src.rpm: build OK (cached)
2025-Mar-27 08:07:36 :: [i586] #1700 gentlyweb-utils-1.5-alt1_15jpp8.src.rpm: build start
2025-Mar-27 08:07:46 :: [x86_64] #1700 gentlyweb-utils-1.5-alt1_15jpp8.src.rpm: build OK (cached)
2025-Mar-27 08:07:46 :: [x86_64] #2000 extra166y-1.7.0-alt1_11jpp8.src.rpm: build start
2025-Mar-27 08:07:48 :: [i586] #1700 gentlyweb-utils-1.5-alt1_15jpp8.src.rpm: build OK (cached)
2025-Mar-27 08:07:48 :: [i586] #2000 extra166y-1.7.0-alt1_11jpp8.src.rpm: build start
2025-Mar-27 08:07:58 :: [x86_64] #2000 extra166y-1.7.0-alt1_11jpp8.src.rpm: build OK (cached)
2025-Mar-27 08:07:58 :: [x86_64] #2100 scilab.git 6.0.2-alt2: build start
2025-Mar-27 08:07:58 :: [aarch64] #700 freemarker-2.3.30-alt2_3jpp8.src.rpm: build OK (cached)
2025-Mar-27 08:07:58 :: [aarch64] #720 maven-osgi-0.2.0-alt1_19jpp11.src.rpm: build start
2025-Mar-27 08:07:59 :: [i586] #2000 extra166y-1.7.0-alt1_11jpp8.src.rpm: build OK (cached)
2025-Mar-27 08:08:00 :: [i586] #2100 scilab.git 6.0.2-alt2: build start
2025-Mar-27 08:08:11 :: [armh] #600 scala-2.13.9-alt3.src.rpm: build SKIPPED
2025-Mar-27 08:08:12 :: [armh] #620 concurrent-trees-2.6.1-alt1_10jpp11.src.rpm: build start
2025-Mar-27 08:08:12 :: [x86_64] #2100 scilab.git 6.0.2-alt2: build OK (cached)
2025-Mar-27 08:08:13 :: [x86_64] #2200 jakarta-server-pages-2.3.6-alt1_3jpp11.src.rpm: build start
2025-Mar-27 08:08:14 :: [i586] #2100 scilab.git 6.0.2-alt2: build OK (cached)
2025-Mar-27 08:08:14 :: [i586] #2200 jakarta-server-pages-2.3.6-alt1_3jpp11.src.rpm: build start
2025-Mar-27 08:08:19 :: [aarch64] #720 maven-osgi-0.2.0-alt1_19jpp11.src.rpm: build OK (cached)
2025-Mar-27 08:08:19 :: [aarch64] #740 javaparser-3.14.16-alt1_1jpp11.src.rpm: build start
2025-Mar-27 08:08:25 :: [x86_64] #2200 jakarta-server-pages-2.3.6-alt1_3jpp11.src.rpm: build OK (cached)
2025-Mar-27 08:08:25 :: [x86_64] #2300 plexus-compiler-2.8.8-alt1_1jpp11.src.rpm: build start
2025-Mar-27 08:08:26 :: [i586] #2200 jakarta-server-pages-2.3.6-alt1_3jpp11.src.rpm: build OK (cached)
2025-Mar-27 08:08:27 :: [i586] #2300 plexus-compiler-2.8.8-alt1_1jpp11.src.rpm: build start
2025-Mar-27 08:08:37 :: [x86_64] #2300 plexus-compiler-2.8.8-alt1_1jpp11.src.rpm: build OK (cached)
2025-Mar-27 08:08:38 :: [x86_64] #2460 tomcat-9.0.98-alt0_1jpp17.p10.1.src.rpm: build start
2025-Mar-27 08:08:39 :: [i586] #2300 plexus-compiler-2.8.8-alt1_1jpp11.src.rpm: build OK (cached)
2025-Mar-27 08:08:39 :: [i586] #2460 tomcat-9.0.98-alt0_1jpp17.p10.1.src.rpm: build start
2025-Mar-27 08:08:41 :: [aarch64] #740 javaparser-3.14.16-alt1_1jpp11.src.rpm: build OK (cached)
2025-Mar-27 08:08:41 :: [aarch64] #1000 apache-commons-parent-52-alt1_1jpp11.src.rpm: build start
2025-Mar-27 08:08:43 :: [armh] #620 concurrent-trees-2.6.1-alt1_10jpp11.src.rpm: build OK (cached)
2025-Mar-27 08:08:43 :: [armh] #640 bouncycastle-1.67-alt1_2jpp11.src.rpm: build start
2025-Mar-27 08:08:50 :: [x86_64] #2460 tomcat-9.0.98-alt0_1jpp17.p10.1.src.rpm: build OK (cached)
2025-Mar-27 08:08:51 :: [i586] #2460 tomcat-9.0.98-alt0_1jpp17.p10.1.src.rpm: build OK (cached)
2025-Mar-27 08:09:03 :: [aarch64] #1000 apache-commons-parent-52-alt1_1jpp11.src.rpm: build OK (cached)
2025-Mar-27 08:09:03 :: [aarch64] #1100 rxtx-2.2-alt3_0.24.20100211jpp8.src.rpm: build start
2025-Mar-27 08:09:13 :: [armh] #640 bouncycastle-1.67-alt1_2jpp11.src.rpm: build OK (cached)
2025-Mar-27 08:09:13 :: [armh] #700 freemarker-2.3.30-alt2_3jpp8.src.rpm: build start
2025-Mar-27 08:09:23 :: [aarch64] #1100 rxtx-2.2-alt3_0.24.20100211jpp8.src.rpm: build OK (cached)
2025-Mar-27 08:09:23 :: [aarch64] #1200 josql-2.2-alt1_15jpp8.src.rpm: build start
2025-Mar-27 08:09:43 :: [aarch64] #1200 josql-2.2-alt1_15jpp8.src.rpm: build OK (cached)
2025-Mar-27 08:09:44 :: [aarch64] #1300 dnsjava-2.1.3-alt1_18jpp8.src.rpm: build start
2025-Mar-27 08:09:45 :: [armh] #700 freemarker-2.3.30-alt2_3jpp8.src.rpm: build OK (cached)
2025-Mar-27 08:09:45 :: [armh] #720 maven-osgi-0.2.0-alt1_19jpp11.src.rpm: build start
2025-Mar-27 08:10:04 :: [aarch64] #1300 dnsjava-2.1.3-alt1_18jpp8.src.rpm: build OK (cached)
2025-Mar-27 08:10:04 :: [aarch64] #1400 bindex-2.2-alt3_21.svn96jpp8.src.rpm: build start
2025-Mar-27 08:10:16 :: [armh] #720 maven-osgi-0.2.0-alt1_19jpp11.src.rpm: build OK (cached)
2025-Mar-27 08:10:16 :: [armh] #740 javaparser-3.14.16-alt1_1jpp11.src.rpm: build start
2025-Mar-27 08:10:24 :: [aarch64] #1400 bindex-2.2-alt3_21.svn96jpp8.src.rpm: build OK (cached)
2025-Mar-27 08:10:24 :: [aarch64] #1500 jgraphx-3.6.0.0-alt1_10jpp8.src.rpm: build start
2025-Mar-27 08:10:45 :: [aarch64] #1500 jgraphx-3.6.0.0-alt1_10jpp8.src.rpm: build OK (cached)
2025-Mar-27 08:10:45 :: [aarch64] #1700 gentlyweb-utils-1.5-alt1_15jpp8.src.rpm: build start
2025-Mar-27 08:10:48 :: [armh] #740 javaparser-3.14.16-alt1_1jpp11.src.rpm: build OK (cached)
2025-Mar-27 08:10:48 :: [armh] #1000 apache-commons-parent-52-alt1_1jpp11.src.rpm: build start
2025-Mar-27 08:11:05 :: [aarch64] #1700 gentlyweb-utils-1.5-alt1_15jpp8.src.rpm: build OK (cached)
2025-Mar-27 08:11:05 :: [aarch64] #2000 extra166y-1.7.0-alt1_11jpp8.src.rpm: build start
2025-Mar-27 08:11:19 :: [armh] #1000 apache-commons-parent-52-alt1_1jpp11.src.rpm: build OK (cached)
2025-Mar-27 08:11:19 :: [armh] #1100 rxtx-2.2-alt3_0.24.20100211jpp8.src.rpm: build start
2025-Mar-27 08:11:26 :: [aarch64] #2000 extra166y-1.7.0-alt1_11jpp8.src.rpm: build OK (cached)
2025-Mar-27 08:11:26 :: [aarch64] #2100 scilab.git 6.0.2-alt2: build start
2025-Mar-27 08:11:49 :: [aarch64] #2100 scilab.git 6.0.2-alt2: build SKIPPED
2025-Mar-27 08:11:49 :: [armh] #1100 rxtx-2.2-alt3_0.24.20100211jpp8.src.rpm: build OK (cached)
2025-Mar-27 08:11:49 :: [aarch64] #2200 jakarta-server-pages-2.3.6-alt1_3jpp11.src.rpm: build start
2025-Mar-27 08:11:49 :: [armh] #1200 josql-2.2-alt1_15jpp8.src.rpm: build start
2025-Mar-27 08:12:11 :: [aarch64] #2200 jakarta-server-pages-2.3.6-alt1_3jpp11.src.rpm: build OK (cached)
2025-Mar-27 08:12:11 :: [aarch64] #2300 plexus-compiler-2.8.8-alt1_1jpp11.src.rpm: build start
2025-Mar-27 08:12:19 :: [armh] #1200 josql-2.2-alt1_15jpp8.src.rpm: build OK (cached)
2025-Mar-27 08:12:19 :: [armh] #1300 dnsjava-2.1.3-alt1_18jpp8.src.rpm: build start
2025-Mar-27 08:12:33 :: [aarch64] #2300 plexus-compiler-2.8.8-alt1_1jpp11.src.rpm: build OK (cached)
2025-Mar-27 08:12:33 :: [aarch64] #2460 tomcat-9.0.98-alt0_1jpp17.p10.1.src.rpm: build start
2025-Mar-27 08:12:49 :: [armh] #1300 dnsjava-2.1.3-alt1_18jpp8.src.rpm: build OK (cached)
2025-Mar-27 08:12:49 :: [armh] #1400 bindex-2.2-alt3_21.svn96jpp8.src.rpm: build start
2025-Mar-27 08:12:54 :: [aarch64] #2460 tomcat-9.0.98-alt0_1jpp17.p10.1.src.rpm: build OK (cached)
2025-Mar-27 08:13:19 :: [armh] #1400 bindex-2.2-alt3_21.svn96jpp8.src.rpm: build OK (cached)
2025-Mar-27 08:13:19 :: [armh] #1500 jgraphx-3.6.0.0-alt1_10jpp8.src.rpm: build start
2025-Mar-27 08:13:49 :: [armh] #1500 jgraphx-3.6.0.0-alt1_10jpp8.src.rpm: build OK (cached)
2025-Mar-27 08:13:49 :: [armh] #1700 gentlyweb-utils-1.5-alt1_15jpp8.src.rpm: build start
2025-Mar-27 08:14:19 :: [armh] #1700 gentlyweb-utils-1.5-alt1_15jpp8.src.rpm: build OK (cached)
2025-Mar-27 08:14:19 :: [armh] #2000 extra166y-1.7.0-alt1_11jpp8.src.rpm: build start
2025-Mar-27 08:14:49 :: [armh] #2000 extra166y-1.7.0-alt1_11jpp8.src.rpm: build OK (cached)
2025-Mar-27 08:14:49 :: [armh] #2100 scilab.git 6.0.2-alt2: build start
2025-Mar-27 08:15:24 :: [armh] #2100 scilab.git 6.0.2-alt2: build SKIPPED
2025-Mar-27 08:15:24 :: [armh] #2200 jakarta-server-pages-2.3.6-alt1_3jpp11.src.rpm: build start
2025-Mar-27 08:15:56 :: [armh] #2200 jakarta-server-pages-2.3.6-alt1_3jpp11.src.rpm: build OK (cached)
2025-Mar-27 08:15:56 :: [armh] #2300 plexus-compiler-2.8.8-alt1_1jpp11.src.rpm: build start
2025-Mar-27 08:16:28 :: [armh] #2300 plexus-compiler-2.8.8-alt1_1jpp11.src.rpm: build OK (cached)
2025-Mar-27 08:16:28 :: [armh] #2460 tomcat-9.0.98-alt0_1jpp17.p10.1.src.rpm: build start
2025-Mar-27 08:16:58 :: [armh] #2460 tomcat-9.0.98-alt0_1jpp17.p10.1.src.rpm: build SKIPPED
x86_64/srpm/aqute-bnd-6.2.0-alt1_2jpp11.src.rpm: license not found in '/usr/share/license' directory: ASL
x86_64/srpm/aqute-bnd-6.2.0-alt1_2jpp11.src.rpm: license not found in '/usr/share/license' directory: 2.0
x86_64/rpms/bnd-maven-plugin-6.2.0-alt1_2jpp11.noarch.rpm: license not found in '/usr/share/license' directory: ASL
x86_64/rpms/bnd-maven-plugin-6.2.0-alt1_2jpp11.noarch.rpm: license not found in '/usr/share/license' directory: 2.0
x86_64/rpms/aqute-bndlib-6.2.0-alt1_2jpp11.noarch.rpm: license not found in '/usr/share/license' directory: ASL
x86_64/rpms/aqute-bndlib-6.2.0-alt1_2jpp11.noarch.rpm: license not found in '/usr/share/license' directory: 2.0
x86_64/rpms/aqute-bnd-javadoc-6.2.0-alt1_2jpp11.noarch.rpm: license not found in '/usr/share/license' directory: ASL
x86_64/rpms/aqute-bnd-javadoc-6.2.0-alt1_2jpp11.noarch.rpm: license not found in '/usr/share/license' directory: 2.0
x86_64/rpms/aqute-bnd-6.2.0-alt1_2jpp11.noarch.rpm: license not found in '/usr/share/license' directory: ASL
x86_64/rpms/aqute-bnd-6.2.0-alt1_2jpp11.noarch.rpm: license not found in '/usr/share/license' directory: 2.0
i586/srpm/aqute-bnd-6.2.0-alt1_2jpp11.src.rpm: license not found in '/usr/share/license' directory: ASL
i586/srpm/aqute-bnd-6.2.0-alt1_2jpp11.src.rpm: license not found in '/usr/share/license' directory: 2.0
i586/rpms/bnd-maven-plugin-6.2.0-alt1_2jpp11.noarch.rpm: license not found in '/usr/share/license' directory: ASL
i586/rpms/bnd-maven-plugin-6.2.0-alt1_2jpp11.noarch.rpm: license not found in '/usr/share/license' directory: 2.0
i586/rpms/aqute-bndlib-6.2.0-alt1_2jpp11.noarch.rpm: license not found in '/usr/share/license' directory: ASL
i586/rpms/aqute-bndlib-6.2.0-alt1_2jpp11.noarch.rpm: license not found in '/usr/share/license' directory: 2.0
i586/rpms/aqute-bnd-javadoc-6.2.0-alt1_2jpp11.noarch.rpm: license not found in '/usr/share/license' directory: ASL
i586/rpms/aqute-bnd-javadoc-6.2.0-alt1_2jpp11.noarch.rpm: license not found in '/usr/share/license' directory: 2.0
i586/rpms/aqute-bnd-6.2.0-alt1_2jpp11.noarch.rpm: license not found in '/usr/share/license' directory: ASL
i586/rpms/aqute-bnd-6.2.0-alt1_2jpp11.noarch.rpm: license not found in '/usr/share/license' directory: 2.0
aarch64/srpm/aqute-bnd-6.2.0-alt1_2jpp11.src.rpm: license not found in '/usr/share/license' directory: ASL
aarch64/srpm/aqute-bnd-6.2.0-alt1_2jpp11.src.rpm: license not found in '/usr/share/license' directory: 2.0
aarch64/rpms/bnd-maven-plugin-6.2.0-alt1_2jpp11.noarch.rpm: license not found in '/usr/share/license' directory: ASL
aarch64/rpms/bnd-maven-plugin-6.2.0-alt1_2jpp11.noarch.rpm: license not found in '/usr/share/license' directory: 2.0
aarch64/rpms/aqute-bndlib-6.2.0-alt1_2jpp11.noarch.rpm: license not found in '/usr/share/license' directory: ASL
aarch64/rpms/aqute-bndlib-6.2.0-alt1_2jpp11.noarch.rpm: license not found in '/usr/share/license' directory: 2.0
aarch64/rpms/aqute-bnd-javadoc-6.2.0-alt1_2jpp11.noarch.rpm: license not found in '/usr/share/license' directory: ASL
aarch64/rpms/aqute-bnd-javadoc-6.2.0-alt1_2jpp11.noarch.rpm: license not found in '/usr/share/license' directory: 2.0
aarch64/rpms/aqute-bnd-6.2.0-alt1_2jpp11.noarch.rpm: license not found in '/usr/share/license' directory: ASL
aarch64/rpms/aqute-bnd-6.2.0-alt1_2jpp11.noarch.rpm: license not found in '/usr/share/license' directory: 2.0
armh/srpm/aqute-bnd-6.2.0-alt1_2jpp11.src.rpm: license not found in '/usr/share/license' directory: ASL
armh/srpm/aqute-bnd-6.2.0-alt1_2jpp11.src.rpm: license not found in '/usr/share/license' directory: 2.0
armh/rpms/bnd-maven-plugin-6.2.0-alt1_2jpp11.noarch.rpm: license not found in '/usr/share/license' directory: ASL
armh/rpms/bnd-maven-plugin-6.2.0-alt1_2jpp11.noarch.rpm: license not found in '/usr/share/license' directory: 2.0
armh/rpms/aqute-bndlib-6.2.0-alt1_2jpp11.noarch.rpm: license not found in '/usr/share/license' directory: ASL
armh/rpms/aqute-bndlib-6.2.0-alt1_2jpp11.noarch.rpm: license not found in '/usr/share/license' directory: 2.0
armh/rpms/aqute-bnd-javadoc-6.2.0-alt1_2jpp11.noarch.rpm: license not found in '/usr/share/license' directory: ASL
armh/rpms/aqute-bnd-javadoc-6.2.0-alt1_2jpp11.noarch.rpm: license not found in '/usr/share/license' directory: 2.0
armh/rpms/aqute-bnd-6.2.0-alt1_2jpp11.noarch.rpm: license not found in '/usr/share/license' directory: ASL
armh/rpms/aqute-bnd-6.2.0-alt1_2jpp11.noarch.rpm: license not found in '/usr/share/license' directory: 2.0
2025-Mar-27 08:17:21 :: #320: aqute-bnd-6.2.0-alt1_2jpp11.src.rpm: build check OK
x86_64/srpm/maven-plugin-bundle-4.2.1-alt1_3jpp11.src.rpm: license not found in '/usr/share/license' directory: ASL
x86_64/srpm/maven-plugin-bundle-4.2.1-alt1_3jpp11.src.rpm: license not found in '/usr/share/license' directory: 2.0
x86_64/rpms/maven-plugin-bundle-4.2.1-alt1_3jpp11.noarch.rpm: license not found in '/usr/share/license' directory: ASL
x86_64/rpms/maven-plugin-bundle-4.2.1-alt1_3jpp11.noarch.rpm: license not found in '/usr/share/license' directory: 2.0
x86_64/rpms/maven-plugin-bundle-javadoc-4.2.1-alt1_3jpp11.noarch.rpm: license not found in '/usr/share/license' directory: ASL
x86_64/rpms/maven-plugin-bundle-javadoc-4.2.1-alt1_3jpp11.noarch.rpm: license not found in '/usr/share/license' directory: 2.0
i586/srpm/maven-plugin-bundle-4.2.1-alt1_3jpp11.src.rpm: license not found in '/usr/share/license' directory: ASL
i586/srpm/maven-plugin-bundle-4.2.1-alt1_3jpp11.src.rpm: license not found in '/usr/share/license' directory: 2.0
i586/rpms/maven-plugin-bundle-4.2.1-alt1_3jpp11.noarch.rpm: license not found in '/usr/share/license' directory: ASL
i586/rpms/maven-plugin-bundle-4.2.1-alt1_3jpp11.noarch.rpm: license not found in '/usr/share/license' directory: 2.0
i586/rpms/maven-plugin-bundle-javadoc-4.2.1-alt1_3jpp11.noarch.rpm: license not found in '/usr/share/license' directory: ASL
i586/rpms/maven-plugin-bundle-javadoc-4.2.1-alt1_3jpp11.noarch.rpm: license not found in '/usr/share/license' directory: 2.0
aarch64/srpm/maven-plugin-bundle-4.2.1-alt1_3jpp11.src.rpm: license not found in '/usr/share/license' directory: ASL
aarch64/srpm/maven-plugin-bundle-4.2.1-alt1_3jpp11.src.rpm: license not found in '/usr/share/license' directory: 2.0
aarch64/rpms/maven-plugin-bundle-4.2.1-alt1_3jpp11.noarch.rpm: license not found in '/usr/share/license' directory: ASL
aarch64/rpms/maven-plugin-bundle-4.2.1-alt1_3jpp11.noarch.rpm: license not found in '/usr/share/license' directory: 2.0
aarch64/rpms/maven-plugin-bundle-javadoc-4.2.1-alt1_3jpp11.noarch.rpm: license not found in '/usr/share/license' directory: ASL
aarch64/rpms/maven-plugin-bundle-javadoc-4.2.1-alt1_3jpp11.noarch.rpm: license not found in '/usr/share/license' directory: 2.0
armh/srpm/maven-plugin-bundle-4.2.1-alt1_3jpp11.src.rpm: license not found in '/usr/share/license' directory: ASL
armh/srpm/maven-plugin-bundle-4.2.1-alt1_3jpp11.src.rpm: license not found in '/usr/share/license' directory: 2.0
armh/rpms/maven-plugin-bundle-4.2.1-alt1_3jpp11.noarch.rpm: license not found in '/usr/share/license' directory: ASL
armh/rpms/maven-plugin-bundle-4.2.1-alt1_3jpp11.noarch.rpm: license not found in '/usr/share/license' directory: 2.0
armh/rpms/maven-plugin-bundle-javadoc-4.2.1-alt1_3jpp11.noarch.rpm: license not found in '/usr/share/license' directory: ASL
armh/rpms/maven-plugin-bundle-javadoc-4.2.1-alt1_3jpp11.noarch.rpm: license not found in '/usr/share/license' directory: 2.0
2025-Mar-27 08:17:33 :: #324: maven-plugin-bundle-4.2.1-alt1_3jpp11.src.rpm: build check OK
x86_64/srpm/apache-commons-lang3-3.11-alt1_1jpp11.src.rpm: license not found in '/usr/share/license' directory: ASL
x86_64/srpm/apache-commons-lang3-3.11-alt1_1jpp11.src.rpm: license not found in '/usr/share/license' directory: 2.0
x86_64/rpms/apache-commons-lang3-javadoc-3.11-alt1_1jpp11.noarch.rpm: license not found in '/usr/share/license' directory: ASL
x86_64/rpms/apache-commons-lang3-javadoc-3.11-alt1_1jpp11.noarch.rpm: license not found in '/usr/share/license' directory: 2.0
x86_64/rpms/apache-commons-lang3-3.11-alt1_1jpp11.noarch.rpm: license not found in '/usr/share/license' directory: ASL
x86_64/rpms/apache-commons-lang3-3.11-alt1_1jpp11.noarch.rpm: license not found in '/usr/share/license' directory: 2.0
i586/srpm/apache-commons-lang3-3.11-alt1_1jpp11.src.rpm: license not found in '/usr/share/license' directory: ASL
i586/srpm/apache-commons-lang3-3.11-alt1_1jpp11.src.rpm: license not found in '/usr/share/license' directory: 2.0
i586/rpms/apache-commons-lang3-javadoc-3.11-alt1_1jpp11.noarch.rpm: license not found in '/usr/share/license' directory: ASL
i586/rpms/apache-commons-lang3-javadoc-3.11-alt1_1jpp11.noarch.rpm: license not found in '/usr/share/license' directory: 2.0
i586/rpms/apache-commons-lang3-3.11-alt1_1jpp11.noarch.rpm: license not found in '/usr/share/license' directory: ASL
i586/rpms/apache-commons-lang3-3.11-alt1_1jpp11.noarch.rpm: license not found in '/usr/share/license' directory: 2.0
aarch64/srpm/apache-commons-lang3-3.11-alt1_1jpp11.src.rpm: license not found in '/usr/share/license' directory: ASL
aarch64/srpm/apache-commons-lang3-3.11-alt1_1jpp11.src.rpm: license not found in '/usr/share/license' directory: 2.0
aarch64/rpms/apache-commons-lang3-javadoc-3.11-alt1_1jpp11.noarch.rpm: license not found in '/usr/share/license' directory: ASL
aarch64/rpms/apache-commons-lang3-javadoc-3.11-alt1_1jpp11.noarch.rpm: license not found in '/usr/share/license' directory: 2.0
aarch64/rpms/apache-commons-lang3-3.11-alt1_1jpp11.noarch.rpm: license not found in '/usr/share/license' directory: ASL
aarch64/rpms/apache-commons-lang3-3.11-alt1_1jpp11.noarch.rpm: license not found in '/usr/share/license' directory: 2.0
armh/srpm/apache-commons-lang3-3.11-alt1_1jpp11.src.rpm: license not found in '/usr/share/license' directory: ASL
armh/srpm/apache-commons-lang3-3.11-alt1_1jpp11.src.rpm: license not found in '/usr/share/license' directory: 2.0
armh/rpms/apache-commons-lang3-javadoc-3.11-alt1_1jpp11.noarch.rpm: license not found in '/usr/share/license' directory: ASL
armh/rpms/apache-commons-lang3-javadoc-3.11-alt1_1jpp11.noarch.rpm: license not found in '/usr/share/license' directory: 2.0
armh/rpms/apache-commons-lang3-3.11-alt1_1jpp11.noarch.rpm: license not found in '/usr/share/license' directory: ASL
armh/rpms/apache-commons-lang3-3.11-alt1_1jpp11.noarch.rpm: license not found in '/usr/share/license' directory: 2.0
2025-Mar-27 08:17:44 :: #334: apache-commons-lang3-3.11-alt1_1jpp11.src.rpm: build check OK
2025-Mar-27 08:18:14 :: #337: bouncycastle1.65-1.65-alt2_4jpp11.src.rpm: build check OK
2025-Mar-27 08:18:23 :: #340: ecj-4.23-alt1_3jpp11.src.rpm: build check OK
2025-Mar-27 08:18:35 :: #540: jdom2-2.0.6-alt1_21jpp11.src.rpm: build check OK
x86_64/srpm/lz4-java-1.7.1-alt1_12jpp11.src.rpm: license not found in '/usr/share/license' directory: ASL
x86_64/srpm/lz4-java-1.7.1-alt1_12jpp11.src.rpm: license not found in '/usr/share/license' directory: 2.0
x86_64/rpms/lz4-java-1.7.1-alt1_12jpp11.x86_64.rpm: license not found in '/usr/share/license' directory: ASL
x86_64/rpms/lz4-java-1.7.1-alt1_12jpp11.x86_64.rpm: license not found in '/usr/share/license' directory: 2.0
x86_64/rpms/lz4-java-javadoc-1.7.1-alt1_12jpp11.noarch.rpm: license not found in '/usr/share/license' directory: ASL
x86_64/rpms/lz4-java-javadoc-1.7.1-alt1_12jpp11.noarch.rpm: license not found in '/usr/share/license' directory: 2.0
i586/srpm/lz4-java-1.7.1-alt1_12jpp11.src.rpm: license not found in '/usr/share/license' directory: ASL
i586/srpm/lz4-java-1.7.1-alt1_12jpp11.src.rpm: license not found in '/usr/share/license' directory: 2.0
i586/rpms/lz4-java-1.7.1-alt1_12jpp11.i586.rpm: license not found in '/usr/share/license' directory: ASL
i586/rpms/lz4-java-1.7.1-alt1_12jpp11.i586.rpm: license not found in '/usr/share/license' directory: 2.0
i586/rpms/lz4-java-javadoc-1.7.1-alt1_12jpp11.noarch.rpm: license not found in '/usr/share/license' directory: ASL
i586/rpms/lz4-java-javadoc-1.7.1-alt1_12jpp11.noarch.rpm: license not found in '/usr/share/license' directory: 2.0
aarch64/srpm/lz4-java-1.7.1-alt1_12jpp11.src.rpm: license not found in '/usr/share/license' directory: ASL
aarch64/srpm/lz4-java-1.7.1-alt1_12jpp11.src.rpm: license not found in '/usr/share/license' directory: 2.0
aarch64/rpms/lz4-java-1.7.1-alt1_12jpp11.aarch64.rpm: license not found in '/usr/share/license' directory: ASL
aarch64/rpms/lz4-java-1.7.1-alt1_12jpp11.aarch64.rpm: license not found in '/usr/share/license' directory: 2.0
aarch64/rpms/lz4-java-javadoc-1.7.1-alt1_12jpp11.noarch.rpm: license not found in '/usr/share/license' directory: ASL
aarch64/rpms/lz4-java-javadoc-1.7.1-alt1_12jpp11.noarch.rpm: license not found in '/usr/share/license' directory: 2.0
armh/srpm/lz4-java-1.7.1-alt1_12jpp11.src.rpm: license not found in '/usr/share/license' directory: ASL
armh/srpm/lz4-java-1.7.1-alt1_12jpp11.src.rpm: license not found in '/usr/share/license' directory: 2.0
armh/rpms/lz4-java-javadoc-1.7.1-alt1_12jpp11.noarch.rpm: license not found in '/usr/share/license' directory: ASL
armh/rpms/lz4-java-javadoc-1.7.1-alt1_12jpp11.noarch.rpm: license not found in '/usr/share/license' directory: 2.0
armh/rpms/lz4-java-1.7.1-alt1_12jpp11.armh.rpm: license not found in '/usr/share/license' directory: ASL
armh/rpms/lz4-java-1.7.1-alt1_12jpp11.armh.rpm: license not found in '/usr/share/license' directory: 2.0
2025-Mar-27 08:18:46 :: #560: lz4-java-1.7.1-alt1_12jpp11.src.rpm: build check OK
2025-Mar-27 08:18:57 :: #600: scala-2.13.9-alt3.src.rpm: build check OK
x86_64/srpm/concurrent-trees-2.6.1-alt1_10jpp11.src.rpm: license not found in '/usr/share/license' directory: ASL
x86_64/srpm/concurrent-trees-2.6.1-alt1_10jpp11.src.rpm: license not found in '/usr/share/license' directory: 2.0
x86_64/rpms/concurrent-trees-2.6.1-alt1_10jpp11.noarch.rpm: license not found in '/usr/share/license' directory: ASL
x86_64/rpms/concurrent-trees-2.6.1-alt1_10jpp11.noarch.rpm: license not found in '/usr/share/license' directory: 2.0
x86_64/rpms/concurrent-trees-javadoc-2.6.1-alt1_10jpp11.noarch.rpm: license not found in '/usr/share/license' directory: ASL
x86_64/rpms/concurrent-trees-javadoc-2.6.1-alt1_10jpp11.noarch.rpm: license not found in '/usr/share/license' directory: 2.0
i586/srpm/concurrent-trees-2.6.1-alt1_10jpp11.src.rpm: license not found in '/usr/share/license' directory: ASL
i586/srpm/concurrent-trees-2.6.1-alt1_10jpp11.src.rpm: license not found in '/usr/share/license' directory: 2.0
i586/rpms/concurrent-trees-2.6.1-alt1_10jpp11.noarch.rpm: license not found in '/usr/share/license' directory: ASL
i586/rpms/concurrent-trees-2.6.1-alt1_10jpp11.noarch.rpm: license not found in '/usr/share/license' directory: 2.0
i586/rpms/concurrent-trees-javadoc-2.6.1-alt1_10jpp11.noarch.rpm: license not found in '/usr/share/license' directory: ASL
i586/rpms/concurrent-trees-javadoc-2.6.1-alt1_10jpp11.noarch.rpm: license not found in '/usr/share/license' directory: 2.0
aarch64/srpm/concurrent-trees-2.6.1-alt1_10jpp11.src.rpm: license not found in '/usr/share/license' directory: ASL
aarch64/srpm/concurrent-trees-2.6.1-alt1_10jpp11.src.rpm: license not found in '/usr/share/license' directory: 2.0
aarch64/rpms/concurrent-trees-2.6.1-alt1_10jpp11.noarch.rpm: license not found in '/usr/share/license' directory: ASL
aarch64/rpms/concurrent-trees-2.6.1-alt1_10jpp11.noarch.rpm: license not found in '/usr/share/license' directory: 2.0
aarch64/rpms/concurrent-trees-javadoc-2.6.1-alt1_10jpp11.noarch.rpm: license not found in '/usr/share/license' directory: ASL
aarch64/rpms/concurrent-trees-javadoc-2.6.1-alt1_10jpp11.noarch.rpm: license not found in '/usr/share/license' directory: 2.0
armh/srpm/concurrent-trees-2.6.1-alt1_10jpp11.src.rpm: license not found in '/usr/share/license' directory: ASL
armh/srpm/concurrent-trees-2.6.1-alt1_10jpp11.src.rpm: license not found in '/usr/share/license' directory: 2.0
armh/rpms/concurrent-trees-2.6.1-alt1_10jpp11.noarch.rpm: license not found in '/usr/share/license' directory: ASL
armh/rpms/concurrent-trees-2.6.1-alt1_10jpp11.noarch.rpm: license not found in '/usr/share/license' directory: 2.0
armh/rpms/concurrent-trees-javadoc-2.6.1-alt1_10jpp11.noarch.rpm: license not found in '/usr/share/license' directory: ASL
armh/rpms/concurrent-trees-javadoc-2.6.1-alt1_10jpp11.noarch.rpm: license not found in '/usr/share/license' directory: 2.0
2025-Mar-27 08:19:08 :: #620: concurrent-trees-2.6.1-alt1_10jpp11.src.rpm: build check OK
2025-Mar-27 08:19:38 :: #640: bouncycastle-1.67-alt1_2jpp11.src.rpm: build check OK
x86_64/srpm/freemarker-2.3.30-alt2_3jpp8.src.rpm: license not found in '/usr/share/license' directory: ASL
x86_64/srpm/freemarker-2.3.30-alt2_3jpp8.src.rpm: license not found in '/usr/share/license' directory: 2.0
x86_64/rpms/freemarker-2.3.30-alt2_3jpp8.noarch.rpm: license not found in '/usr/share/license' directory: ASL
x86_64/rpms/freemarker-2.3.30-alt2_3jpp8.noarch.rpm: license not found in '/usr/share/license' directory: 2.0
x86_64/rpms/freemarker-javadoc-2.3.30-alt2_3jpp8.noarch.rpm: license not found in '/usr/share/license' directory: ASL
x86_64/rpms/freemarker-javadoc-2.3.30-alt2_3jpp8.noarch.rpm: license not found in '/usr/share/license' directory: 2.0
i586/srpm/freemarker-2.3.30-alt2_3jpp8.src.rpm: license not found in '/usr/share/license' directory: ASL
i586/srpm/freemarker-2.3.30-alt2_3jpp8.src.rpm: license not found in '/usr/share/license' directory: 2.0
i586/rpms/freemarker-2.3.30-alt2_3jpp8.noarch.rpm: license not found in '/usr/share/license' directory: ASL
i586/rpms/freemarker-2.3.30-alt2_3jpp8.noarch.rpm: license not found in '/usr/share/license' directory: 2.0
i586/rpms/freemarker-javadoc-2.3.30-alt2_3jpp8.noarch.rpm: license not found in '/usr/share/license' directory: ASL
i586/rpms/freemarker-javadoc-2.3.30-alt2_3jpp8.noarch.rpm: license not found in '/usr/share/license' directory: 2.0
aarch64/srpm/freemarker-2.3.30-alt2_3jpp8.src.rpm: license not found in '/usr/share/license' directory: ASL
aarch64/srpm/freemarker-2.3.30-alt2_3jpp8.src.rpm: license not found in '/usr/share/license' directory: 2.0
aarch64/rpms/freemarker-2.3.30-alt2_3jpp8.noarch.rpm: license not found in '/usr/share/license' directory: ASL
aarch64/rpms/freemarker-2.3.30-alt2_3jpp8.noarch.rpm: license not found in '/usr/share/license' directory: 2.0
aarch64/rpms/freemarker-javadoc-2.3.30-alt2_3jpp8.noarch.rpm: license not found in '/usr/share/license' directory: ASL
aarch64/rpms/freemarker-javadoc-2.3.30-alt2_3jpp8.noarch.rpm: license not found in '/usr/share/license' directory: 2.0
armh/srpm/freemarker-2.3.30-alt2_3jpp8.src.rpm: license not found in '/usr/share/license' directory: ASL
armh/srpm/freemarker-2.3.30-alt2_3jpp8.src.rpm: license not found in '/usr/share/license' directory: 2.0
armh/rpms/freemarker-2.3.30-alt2_3jpp8.noarch.rpm: license not found in '/usr/share/license' directory: ASL
armh/rpms/freemarker-2.3.30-alt2_3jpp8.noarch.rpm: license not found in '/usr/share/license' directory: 2.0
armh/rpms/freemarker-javadoc-2.3.30-alt2_3jpp8.noarch.rpm: license not found in '/usr/share/license' directory: ASL
armh/rpms/freemarker-javadoc-2.3.30-alt2_3jpp8.noarch.rpm: license not found in '/usr/share/license' directory: 2.0
2025-Mar-27 08:19:50 :: #700: freemarker-2.3.30-alt2_3jpp8.src.rpm: build check OK
x86_64/srpm/maven-osgi-0.2.0-alt1_19jpp11.src.rpm: license not found in '/usr/share/license' directory: ASL
x86_64/srpm/maven-osgi-0.2.0-alt1_19jpp11.src.rpm: license not found in '/usr/share/license' directory: 2.0
x86_64/rpms/maven-osgi-0.2.0-alt1_19jpp11.noarch.rpm: license not found in '/usr/share/license' directory: ASL
x86_64/rpms/maven-osgi-0.2.0-alt1_19jpp11.noarch.rpm: license not found in '/usr/share/license' directory: 2.0
x86_64/rpms/maven-osgi-javadoc-0.2.0-alt1_19jpp11.noarch.rpm: license not found in '/usr/share/license' directory: ASL
x86_64/rpms/maven-osgi-javadoc-0.2.0-alt1_19jpp11.noarch.rpm: license not found in '/usr/share/license' directory: 2.0
i586/srpm/maven-osgi-0.2.0-alt1_19jpp11.src.rpm: license not found in '/usr/share/license' directory: ASL
i586/srpm/maven-osgi-0.2.0-alt1_19jpp11.src.rpm: license not found in '/usr/share/license' directory: 2.0
i586/rpms/maven-osgi-0.2.0-alt1_19jpp11.noarch.rpm: license not found in '/usr/share/license' directory: ASL
i586/rpms/maven-osgi-0.2.0-alt1_19jpp11.noarch.rpm: license not found in '/usr/share/license' directory: 2.0
i586/rpms/maven-osgi-javadoc-0.2.0-alt1_19jpp11.noarch.rpm: license not found in '/usr/share/license' directory: ASL
i586/rpms/maven-osgi-javadoc-0.2.0-alt1_19jpp11.noarch.rpm: license not found in '/usr/share/license' directory: 2.0
aarch64/srpm/maven-osgi-0.2.0-alt1_19jpp11.src.rpm: license not found in '/usr/share/license' directory: ASL
aarch64/srpm/maven-osgi-0.2.0-alt1_19jpp11.src.rpm: license not found in '/usr/share/license' directory: 2.0
aarch64/rpms/maven-osgi-0.2.0-alt1_19jpp11.noarch.rpm: license not found in '/usr/share/license' directory: ASL
aarch64/rpms/maven-osgi-0.2.0-alt1_19jpp11.noarch.rpm: license not found in '/usr/share/license' directory: 2.0
aarch64/rpms/maven-osgi-javadoc-0.2.0-alt1_19jpp11.noarch.rpm: license not found in '/usr/share/license' directory: ASL
aarch64/rpms/maven-osgi-javadoc-0.2.0-alt1_19jpp11.noarch.rpm: license not found in '/usr/share/license' directory: 2.0
armh/srpm/maven-osgi-0.2.0-alt1_19jpp11.src.rpm: license not found in '/usr/share/license' directory: ASL
armh/srpm/maven-osgi-0.2.0-alt1_19jpp11.src.rpm: license not found in '/usr/share/license' directory: 2.0
armh/rpms/maven-osgi-0.2.0-alt1_19jpp11.noarch.rpm: license not found in '/usr/share/license' directory: ASL
armh/rpms/maven-osgi-0.2.0-alt1_19jpp11.noarch.rpm: license not found in '/usr/share/license' directory: 2.0
armh/rpms/maven-osgi-javadoc-0.2.0-alt1_19jpp11.noarch.rpm: license not found in '/usr/share/license' directory: ASL
armh/rpms/maven-osgi-javadoc-0.2.0-alt1_19jpp11.noarch.rpm: license not found in '/usr/share/license' directory: 2.0
2025-Mar-27 08:20:01 :: #720: maven-osgi-0.2.0-alt1_19jpp11.src.rpm: build check OK
x86_64/srpm/javaparser-3.14.16-alt1_1jpp11.src.rpm: license not found in '/usr/share/license' directory: ASL
x86_64/srpm/javaparser-3.14.16-alt1_1jpp11.src.rpm: license not found in '/usr/share/license' directory: 2.0
x86_64/rpms/javaparser-3.14.16-alt1_1jpp11.noarch.rpm: license not found in '/usr/share/license' directory: ASL
x86_64/rpms/javaparser-3.14.16-alt1_1jpp11.noarch.rpm: license not found in '/usr/share/license' directory: 2.0
x86_64/rpms/javaparser-javadoc-3.14.16-alt1_1jpp11.noarch.rpm: license not found in '/usr/share/license' directory: ASL
x86_64/rpms/javaparser-javadoc-3.14.16-alt1_1jpp11.noarch.rpm: license not found in '/usr/share/license' directory: 2.0
i586/srpm/javaparser-3.14.16-alt1_1jpp11.src.rpm: license not found in '/usr/share/license' directory: ASL
i586/srpm/javaparser-3.14.16-alt1_1jpp11.src.rpm: license not found in '/usr/share/license' directory: 2.0
i586/rpms/javaparser-3.14.16-alt1_1jpp11.noarch.rpm: license not found in '/usr/share/license' directory: ASL
i586/rpms/javaparser-3.14.16-alt1_1jpp11.noarch.rpm: license not found in '/usr/share/license' directory: 2.0
i586/rpms/javaparser-javadoc-3.14.16-alt1_1jpp11.noarch.rpm: license not found in '/usr/share/license' directory: ASL
i586/rpms/javaparser-javadoc-3.14.16-alt1_1jpp11.noarch.rpm: license not found in '/usr/share/license' directory: 2.0
aarch64/srpm/javaparser-3.14.16-alt1_1jpp11.src.rpm: license not found in '/usr/share/license' directory: ASL
aarch64/srpm/javaparser-3.14.16-alt1_1jpp11.src.rpm: license not found in '/usr/share/license' directory: 2.0
aarch64/rpms/javaparser-3.14.16-alt1_1jpp11.noarch.rpm: license not found in '/usr/share/license' directory: ASL
aarch64/rpms/javaparser-3.14.16-alt1_1jpp11.noarch.rpm: license not found in '/usr/share/license' directory: 2.0
aarch64/rpms/javaparser-javadoc-3.14.16-alt1_1jpp11.noarch.rpm: license not found in '/usr/share/license' directory: ASL
aarch64/rpms/javaparser-javadoc-3.14.16-alt1_1jpp11.noarch.rpm: license not found in '/usr/share/license' directory: 2.0
armh/srpm/javaparser-3.14.16-alt1_1jpp11.src.rpm: license not found in '/usr/share/license' directory: ASL
armh/srpm/javaparser-3.14.16-alt1_1jpp11.src.rpm: license not found in '/usr/share/license' directory: 2.0
armh/rpms/javaparser-3.14.16-alt1_1jpp11.noarch.rpm: license not found in '/usr/share/license' directory: ASL
armh/rpms/javaparser-3.14.16-alt1_1jpp11.noarch.rpm: license not found in '/usr/share/license' directory: 2.0
armh/rpms/javaparser-javadoc-3.14.16-alt1_1jpp11.noarch.rpm: license not found in '/usr/share/license' directory: ASL
armh/rpms/javaparser-javadoc-3.14.16-alt1_1jpp11.noarch.rpm: license not found in '/usr/share/license' directory: 2.0
2025-Mar-27 08:20:14 :: #740: javaparser-3.14.16-alt1_1jpp11.src.rpm: build check OK
x86_64/srpm/apache-commons-parent-52-alt1_1jpp11.src.rpm: license not found in '/usr/share/license' directory: ASL
x86_64/srpm/apache-commons-parent-52-alt1_1jpp11.src.rpm: license not found in '/usr/share/license' directory: 2.0
x86_64/rpms/apache-commons-parent-52-alt1_1jpp11.noarch.rpm: license not found in '/usr/share/license' directory: ASL
x86_64/rpms/apache-commons-parent-52-alt1_1jpp11.noarch.rpm: license not found in '/usr/share/license' directory: 2.0
i586/srpm/apache-commons-parent-52-alt1_1jpp11.src.rpm: license not found in '/usr/share/license' directory: ASL
i586/srpm/apache-commons-parent-52-alt1_1jpp11.src.rpm: license not found in '/usr/share/license' directory: 2.0
i586/rpms/apache-commons-parent-52-alt1_1jpp11.noarch.rpm: license not found in '/usr/share/license' directory: ASL
i586/rpms/apache-commons-parent-52-alt1_1jpp11.noarch.rpm: license not found in '/usr/share/license' directory: 2.0
aarch64/srpm/apache-commons-parent-52-alt1_1jpp11.src.rpm: license not found in '/usr/share/license' directory: ASL
aarch64/srpm/apache-commons-parent-52-alt1_1jpp11.src.rpm: license not found in '/usr/share/license' directory: 2.0
aarch64/rpms/apache-commons-parent-52-alt1_1jpp11.noarch.rpm: license not found in '/usr/share/license' directory: ASL
aarch64/rpms/apache-commons-parent-52-alt1_1jpp11.noarch.rpm: license not found in '/usr/share/license' directory: 2.0
armh/srpm/apache-commons-parent-52-alt1_1jpp11.src.rpm: license not found in '/usr/share/license' directory: ASL
armh/srpm/apache-commons-parent-52-alt1_1jpp11.src.rpm: license not found in '/usr/share/license' directory: 2.0
armh/rpms/apache-commons-parent-52-alt1_1jpp11.noarch.rpm: license not found in '/usr/share/license' directory: ASL
armh/rpms/apache-commons-parent-52-alt1_1jpp11.noarch.rpm: license not found in '/usr/share/license' directory: 2.0
2025-Mar-27 08:20:22 :: #1000: apache-commons-parent-52-alt1_1jpp11.src.rpm: build check OK
2025-Mar-27 08:20:33 :: #1100: rxtx-2.2-alt3_0.24.20100211jpp8.src.rpm: build check OK
x86_64/srpm/josql-2.2-alt1_15jpp8.src.rpm: license not found in '/usr/share/license' directory: ASL
x86_64/srpm/josql-2.2-alt1_15jpp8.src.rpm: license not found in '/usr/share/license' directory: 2.0
x86_64/rpms/josql-2.2-alt1_15jpp8.noarch.rpm: license not found in '/usr/share/license' directory: ASL
x86_64/rpms/josql-2.2-alt1_15jpp8.noarch.rpm: license not found in '/usr/share/license' directory: 2.0
x86_64/rpms/josql-javadoc-2.2-alt1_15jpp8.noarch.rpm: license not found in '/usr/share/license' directory: ASL
x86_64/rpms/josql-javadoc-2.2-alt1_15jpp8.noarch.rpm: license not found in '/usr/share/license' directory: 2.0
i586/srpm/josql-2.2-alt1_15jpp8.src.rpm: license not found in '/usr/share/license' directory: ASL
i586/srpm/josql-2.2-alt1_15jpp8.src.rpm: license not found in '/usr/share/license' directory: 2.0
i586/rpms/josql-2.2-alt1_15jpp8.noarch.rpm: license not found in '/usr/share/license' directory: ASL
i586/rpms/josql-2.2-alt1_15jpp8.noarch.rpm: license not found in '/usr/share/license' directory: 2.0
i586/rpms/josql-javadoc-2.2-alt1_15jpp8.noarch.rpm: license not found in '/usr/share/license' directory: ASL
i586/rpms/josql-javadoc-2.2-alt1_15jpp8.noarch.rpm: license not found in '/usr/share/license' directory: 2.0
aarch64/srpm/josql-2.2-alt1_15jpp8.src.rpm: license not found in '/usr/share/license' directory: ASL
aarch64/srpm/josql-2.2-alt1_15jpp8.src.rpm: license not found in '/usr/share/license' directory: 2.0
aarch64/rpms/josql-2.2-alt1_15jpp8.noarch.rpm: license not found in '/usr/share/license' directory: ASL
aarch64/rpms/josql-2.2-alt1_15jpp8.noarch.rpm: license not found in '/usr/share/license' directory: 2.0
aarch64/rpms/josql-javadoc-2.2-alt1_15jpp8.noarch.rpm: license not found in '/usr/share/license' directory: ASL
aarch64/rpms/josql-javadoc-2.2-alt1_15jpp8.noarch.rpm: license not found in '/usr/share/license' directory: 2.0
armh/srpm/josql-2.2-alt1_15jpp8.src.rpm: license not found in '/usr/share/license' directory: ASL
armh/srpm/josql-2.2-alt1_15jpp8.src.rpm: license not found in '/usr/share/license' directory: 2.0
armh/rpms/josql-2.2-alt1_15jpp8.noarch.rpm: license not found in '/usr/share/license' directory: ASL
armh/rpms/josql-2.2-alt1_15jpp8.noarch.rpm: license not found in '/usr/share/license' directory: 2.0
armh/rpms/josql-javadoc-2.2-alt1_15jpp8.noarch.rpm: license not found in '/usr/share/license' directory: ASL
armh/rpms/josql-javadoc-2.2-alt1_15jpp8.noarch.rpm: license not found in '/usr/share/license' directory: 2.0
2025-Mar-27 08:20:44 :: #1200: josql-2.2-alt1_15jpp8.src.rpm: build check OK
2025-Mar-27 08:20:55 :: #1300: dnsjava-2.1.3-alt1_18jpp8.src.rpm: build check OK
x86_64/srpm/bindex-2.2-alt3_21.svn96jpp8.src.rpm: license not found in '/usr/share/license' directory: ASL
x86_64/srpm/bindex-2.2-alt3_21.svn96jpp8.src.rpm: license not found in '/usr/share/license' directory: 2.0
x86_64/rpms/bindex-2.2-alt3_21.svn96jpp8.noarch.rpm: license not found in '/usr/share/license' directory: ASL
x86_64/rpms/bindex-2.2-alt3_21.svn96jpp8.noarch.rpm: license not found in '/usr/share/license' directory: 2.0
i586/srpm/bindex-2.2-alt3_21.svn96jpp8.src.rpm: license not found in '/usr/share/license' directory: ASL
i586/srpm/bindex-2.2-alt3_21.svn96jpp8.src.rpm: license not found in '/usr/share/license' directory: 2.0
i586/rpms/bindex-2.2-alt3_21.svn96jpp8.noarch.rpm: license not found in '/usr/share/license' directory: ASL
i586/rpms/bindex-2.2-alt3_21.svn96jpp8.noarch.rpm: license not found in '/usr/share/license' directory: 2.0
aarch64/srpm/bindex-2.2-alt3_21.svn96jpp8.src.rpm: license not found in '/usr/share/license' directory: ASL
aarch64/srpm/bindex-2.2-alt3_21.svn96jpp8.src.rpm: license not found in '/usr/share/license' directory: 2.0
aarch64/rpms/bindex-2.2-alt3_21.svn96jpp8.noarch.rpm: license not found in '/usr/share/license' directory: ASL
aarch64/rpms/bindex-2.2-alt3_21.svn96jpp8.noarch.rpm: license not found in '/usr/share/license' directory: 2.0
armh/srpm/bindex-2.2-alt3_21.svn96jpp8.src.rpm: license not found in '/usr/share/license' directory: ASL
armh/srpm/bindex-2.2-alt3_21.svn96jpp8.src.rpm: license not found in '/usr/share/license' directory: 2.0
armh/rpms/bindex-2.2-alt3_21.svn96jpp8.noarch.rpm: license not found in '/usr/share/license' directory: ASL
armh/rpms/bindex-2.2-alt3_21.svn96jpp8.noarch.rpm: license not found in '/usr/share/license' directory: 2.0
2025-Mar-27 08:21:03 :: #1400: bindex-2.2-alt3_21.svn96jpp8.src.rpm: build check OK
2025-Mar-27 08:21:15 :: #1500: jgraphx-3.6.0.0-alt1_10jpp8.src.rpm: build check OK
x86_64/srpm/gentlyweb-utils-1.5-alt1_15jpp8.src.rpm: license not found in '/usr/share/license' directory: ASL
x86_64/srpm/gentlyweb-utils-1.5-alt1_15jpp8.src.rpm: license not found in '/usr/share/license' directory: 2.0
x86_64/rpms/gentlyweb-utils-1.5-alt1_15jpp8.noarch.rpm: license not found in '/usr/share/license' directory: ASL
x86_64/rpms/gentlyweb-utils-1.5-alt1_15jpp8.noarch.rpm: license not found in '/usr/share/license' directory: 2.0
x86_64/rpms/gentlyweb-utils-javadoc-1.5-alt1_15jpp8.noarch.rpm: license not found in '/usr/share/license' directory: ASL
x86_64/rpms/gentlyweb-utils-javadoc-1.5-alt1_15jpp8.noarch.rpm: license not found in '/usr/share/license' directory: 2.0
i586/srpm/gentlyweb-utils-1.5-alt1_15jpp8.src.rpm: license not found in '/usr/share/license' directory: ASL
i586/srpm/gentlyweb-utils-1.5-alt1_15jpp8.src.rpm: license not found in '/usr/share/license' directory: 2.0
i586/rpms/gentlyweb-utils-1.5-alt1_15jpp8.noarch.rpm: license not found in '/usr/share/license' directory: ASL
i586/rpms/gentlyweb-utils-1.5-alt1_15jpp8.noarch.rpm: license not found in '/usr/share/license' directory: 2.0
i586/rpms/gentlyweb-utils-javadoc-1.5-alt1_15jpp8.noarch.rpm: license not found in '/usr/share/license' directory: ASL
i586/rpms/gentlyweb-utils-javadoc-1.5-alt1_15jpp8.noarch.rpm: license not found in '/usr/share/license' directory: 2.0
aarch64/srpm/gentlyweb-utils-1.5-alt1_15jpp8.src.rpm: license not found in '/usr/share/license' directory: ASL
aarch64/srpm/gentlyweb-utils-1.5-alt1_15jpp8.src.rpm: license not found in '/usr/share/license' directory: 2.0
aarch64/rpms/gentlyweb-utils-1.5-alt1_15jpp8.noarch.rpm: license not found in '/usr/share/license' directory: ASL
aarch64/rpms/gentlyweb-utils-1.5-alt1_15jpp8.noarch.rpm: license not found in '/usr/share/license' directory: 2.0
aarch64/rpms/gentlyweb-utils-javadoc-1.5-alt1_15jpp8.noarch.rpm: license not found in '/usr/share/license' directory: ASL
aarch64/rpms/gentlyweb-utils-javadoc-1.5-alt1_15jpp8.noarch.rpm: license not found in '/usr/share/license' directory: 2.0
armh/srpm/gentlyweb-utils-1.5-alt1_15jpp8.src.rpm: license not found in '/usr/share/license' directory: ASL
armh/srpm/gentlyweb-utils-1.5-alt1_15jpp8.src.rpm: license not found in '/usr/share/license' directory: 2.0
armh/rpms/gentlyweb-utils-1.5-alt1_15jpp8.noarch.rpm: license not found in '/usr/share/license' directory: ASL
armh/rpms/gentlyweb-utils-1.5-alt1_15jpp8.noarch.rpm: license not found in '/usr/share/license' directory: 2.0
armh/rpms/gentlyweb-utils-javadoc-1.5-alt1_15jpp8.noarch.rpm: license not found in '/usr/share/license' directory: ASL
armh/rpms/gentlyweb-utils-javadoc-1.5-alt1_15jpp8.noarch.rpm: license not found in '/usr/share/license' directory: 2.0
2025-Mar-27 08:21:26 :: #1700: gentlyweb-utils-1.5-alt1_15jpp8.src.rpm: build check OK
x86_64/srpm/extra166y-1.7.0-alt1_11jpp8.src.rpm: license not found in '/usr/share/license' directory: Public
x86_64/srpm/extra166y-1.7.0-alt1_11jpp8.src.rpm: license not found in '/usr/share/license' directory: Domain
x86_64/rpms/extra166y-javadoc-1.7.0-alt1_11jpp8.noarch.rpm: license not found in '/usr/share/license' directory: Public
x86_64/rpms/extra166y-javadoc-1.7.0-alt1_11jpp8.noarch.rpm: license not found in '/usr/share/license' directory: Domain
x86_64/rpms/extra166y-1.7.0-alt1_11jpp8.noarch.rpm: license not found in '/usr/share/license' directory: Public
x86_64/rpms/extra166y-1.7.0-alt1_11jpp8.noarch.rpm: license not found in '/usr/share/license' directory: Domain
i586/srpm/extra166y-1.7.0-alt1_11jpp8.src.rpm: license not found in '/usr/share/license' directory: Public
i586/srpm/extra166y-1.7.0-alt1_11jpp8.src.rpm: license not found in '/usr/share/license' directory: Domain
i586/rpms/extra166y-javadoc-1.7.0-alt1_11jpp8.noarch.rpm: license not found in '/usr/share/license' directory: Public
i586/rpms/extra166y-javadoc-1.7.0-alt1_11jpp8.noarch.rpm: license not found in '/usr/share/license' directory: Domain
i586/rpms/extra166y-1.7.0-alt1_11jpp8.noarch.rpm: license not found in '/usr/share/license' directory: Public
i586/rpms/extra166y-1.7.0-alt1_11jpp8.noarch.rpm: license not found in '/usr/share/license' directory: Domain
aarch64/srpm/extra166y-1.7.0-alt1_11jpp8.src.rpm: license not found in '/usr/share/license' directory: Public
aarch64/srpm/extra166y-1.7.0-alt1_11jpp8.src.rpm: license not found in '/usr/share/license' directory: Domain
aarch64/rpms/extra166y-javadoc-1.7.0-alt1_11jpp8.noarch.rpm: license not found in '/usr/share/license' directory: Public
aarch64/rpms/extra166y-javadoc-1.7.0-alt1_11jpp8.noarch.rpm: license not found in '/usr/share/license' directory: Domain
aarch64/rpms/extra166y-1.7.0-alt1_11jpp8.noarch.rpm: license not found in '/usr/share/license' directory: Public
aarch64/rpms/extra166y-1.7.0-alt1_11jpp8.noarch.rpm: license not found in '/usr/share/license' directory: Domain
armh/srpm/extra166y-1.7.0-alt1_11jpp8.src.rpm: license not found in '/usr/share/license' directory: Public
armh/srpm/extra166y-1.7.0-alt1_11jpp8.src.rpm: license not found in '/usr/share/license' directory: Domain
armh/rpms/extra166y-javadoc-1.7.0-alt1_11jpp8.noarch.rpm: license not found in '/usr/share/license' directory: Public
armh/rpms/extra166y-javadoc-1.7.0-alt1_11jpp8.noarch.rpm: license not found in '/usr/share/license' directory: Domain
armh/rpms/extra166y-1.7.0-alt1_11jpp8.noarch.rpm: license not found in '/usr/share/license' directory: Public
armh/rpms/extra166y-1.7.0-alt1_11jpp8.noarch.rpm: license not found in '/usr/share/license' directory: Domain
2025-Mar-27 08:21:37 :: #2000: extra166y-1.7.0-alt1_11jpp8.src.rpm: build check OK
x86_64/srpm/scilab-6.0.2-alt2.src.rpm: license not found in '/usr/share/license' directory: CeCILL
x86_64/rpms/scilab-debuginfo-6.0.2-alt2.x86_64.rpm: license not found in '/usr/share/license' directory: CeCILL
x86_64/rpms/scilab-6.0.2-alt2.x86_64.rpm: license not found in '/usr/share/license' directory: CeCILL
i586/srpm/scilab-6.0.2-alt2.src.rpm: license not found in '/usr/share/license' directory: CeCILL
i586/rpms/scilab-debuginfo-6.0.2-alt2.i586.rpm: license not found in '/usr/share/license' directory: CeCILL
i586/rpms/scilab-6.0.2-alt2.i586.rpm: license not found in '/usr/share/license' directory: CeCILL
2025-Mar-27 08:21:53 :: #2100: scilab.git 6.0.2-alt2: build check OK
x86_64/srpm/jakarta-server-pages-2.3.6-alt1_3jpp11.src.rpm: exception not found in '/usr/share/license-exception' directory: exceptions
x86_64/srpm/jakarta-server-pages-2.3.6-alt1_3jpp11.src.rpm: license not found in '/usr/share/license' directory: ASL
x86_64/srpm/jakarta-server-pages-2.3.6-alt1_3jpp11.src.rpm: license not found in '/usr/share/license' directory: 2.0
x86_64/rpms/jakarta-server-pages-2.3.6-alt1_3jpp11.noarch.rpm: exception not found in '/usr/share/license-exception' directory: exceptions
x86_64/rpms/jakarta-server-pages-2.3.6-alt1_3jpp11.noarch.rpm: license not found in '/usr/share/license' directory: ASL
x86_64/rpms/jakarta-server-pages-2.3.6-alt1_3jpp11.noarch.rpm: license not found in '/usr/share/license' directory: 2.0
x86_64/rpms/jakarta-server-pages-javadoc-2.3.6-alt1_3jpp11.noarch.rpm: exception not found in '/usr/share/license-exception' directory: exceptions
x86_64/rpms/jakarta-server-pages-javadoc-2.3.6-alt1_3jpp11.noarch.rpm: license not found in '/usr/share/license' directory: ASL
x86_64/rpms/jakarta-server-pages-javadoc-2.3.6-alt1_3jpp11.noarch.rpm: license not found in '/usr/share/license' directory: 2.0
x86_64/rpms/jakarta-server-pages-api-2.3.6-alt1_3jpp11.noarch.rpm: exception not found in '/usr/share/license-exception' directory: exceptions
x86_64/rpms/jakarta-server-pages-api-2.3.6-alt1_3jpp11.noarch.rpm: license not found in '/usr/share/license' directory: ASL
x86_64/rpms/jakarta-server-pages-api-2.3.6-alt1_3jpp11.noarch.rpm: license not found in '/usr/share/license' directory: 2.0
i586/srpm/jakarta-server-pages-2.3.6-alt1_3jpp11.src.rpm: exception not found in '/usr/share/license-exception' directory: exceptions
i586/srpm/jakarta-server-pages-2.3.6-alt1_3jpp11.src.rpm: license not found in '/usr/share/license' directory: ASL
i586/srpm/jakarta-server-pages-2.3.6-alt1_3jpp11.src.rpm: license not found in '/usr/share/license' directory: 2.0
i586/rpms/jakarta-server-pages-2.3.6-alt1_3jpp11.noarch.rpm: exception not found in '/usr/share/license-exception' directory: exceptions
i586/rpms/jakarta-server-pages-2.3.6-alt1_3jpp11.noarch.rpm: license not found in '/usr/share/license' directory: ASL
i586/rpms/jakarta-server-pages-2.3.6-alt1_3jpp11.noarch.rpm: license not found in '/usr/share/license' directory: 2.0
i586/rpms/jakarta-server-pages-javadoc-2.3.6-alt1_3jpp11.noarch.rpm: exception not found in '/usr/share/license-exception' directory: exceptions
i586/rpms/jakarta-server-pages-javadoc-2.3.6-alt1_3jpp11.noarch.rpm: license not found in '/usr/share/license' directory: ASL
i586/rpms/jakarta-server-pages-javadoc-2.3.6-alt1_3jpp11.noarch.rpm: license not found in '/usr/share/license' directory: 2.0
i586/rpms/jakarta-server-pages-api-2.3.6-alt1_3jpp11.noarch.rpm: exception not found in '/usr/share/license-exception' directory: exceptions
i586/rpms/jakarta-server-pages-api-2.3.6-alt1_3jpp11.noarch.rpm: license not found in '/usr/share/license' directory: ASL
i586/rpms/jakarta-server-pages-api-2.3.6-alt1_3jpp11.noarch.rpm: license not found in '/usr/share/license' directory: 2.0
aarch64/srpm/jakarta-server-pages-2.3.6-alt1_3jpp11.src.rpm: exception not found in '/usr/share/license-exception' directory: exceptions
aarch64/srpm/jakarta-server-pages-2.3.6-alt1_3jpp11.src.rpm: license not found in '/usr/share/license' directory: ASL
aarch64/srpm/jakarta-server-pages-2.3.6-alt1_3jpp11.src.rpm: license not found in '/usr/share/license' directory: 2.0
aarch64/rpms/jakarta-server-pages-2.3.6-alt1_3jpp11.noarch.rpm: exception not found in '/usr/share/license-exception' directory: exceptions
aarch64/rpms/jakarta-server-pages-2.3.6-alt1_3jpp11.noarch.rpm: license not found in '/usr/share/license' directory: ASL
aarch64/rpms/jakarta-server-pages-2.3.6-alt1_3jpp11.noarch.rpm: license not found in '/usr/share/license' directory: 2.0
aarch64/rpms/jakarta-server-pages-javadoc-2.3.6-alt1_3jpp11.noarch.rpm: exception not found in '/usr/share/license-exception' directory: exceptions
aarch64/rpms/jakarta-server-pages-javadoc-2.3.6-alt1_3jpp11.noarch.rpm: license not found in '/usr/share/license' directory: ASL
aarch64/rpms/jakarta-server-pages-javadoc-2.3.6-alt1_3jpp11.noarch.rpm: license not found in '/usr/share/license' directory: 2.0
aarch64/rpms/jakarta-server-pages-api-2.3.6-alt1_3jpp11.noarch.rpm: exception not found in '/usr/share/license-exception' directory: exceptions
aarch64/rpms/jakarta-server-pages-api-2.3.6-alt1_3jpp11.noarch.rpm: license not found in '/usr/share/license' directory: ASL
aarch64/rpms/jakarta-server-pages-api-2.3.6-alt1_3jpp11.noarch.rpm: license not found in '/usr/share/license' directory: 2.0
armh/srpm/jakarta-server-pages-2.3.6-alt1_3jpp11.src.rpm: exception not found in '/usr/share/license-exception' directory: exceptions
armh/srpm/jakarta-server-pages-2.3.6-alt1_3jpp11.src.rpm: license not found in '/usr/share/license' directory: ASL
armh/srpm/jakarta-server-pages-2.3.6-alt1_3jpp11.src.rpm: license not found in '/usr/share/license' directory: 2.0
armh/rpms/jakarta-server-pages-2.3.6-alt1_3jpp11.noarch.rpm: exception not found in '/usr/share/license-exception' directory: exceptions
armh/rpms/jakarta-server-pages-2.3.6-alt1_3jpp11.noarch.rpm: license not found in '/usr/share/license' directory: ASL
armh/rpms/jakarta-server-pages-2.3.6-alt1_3jpp11.noarch.rpm: license not found in '/usr/share/license' directory: 2.0
armh/rpms/jakarta-server-pages-javadoc-2.3.6-alt1_3jpp11.noarch.rpm: exception not found in '/usr/share/license-exception' directory: exceptions
armh/rpms/jakarta-server-pages-javadoc-2.3.6-alt1_3jpp11.noarch.rpm: license not found in '/usr/share/license' directory: ASL
armh/rpms/jakarta-server-pages-javadoc-2.3.6-alt1_3jpp11.noarch.rpm: license not found in '/usr/share/license' directory: 2.0
armh/rpms/jakarta-server-pages-api-2.3.6-alt1_3jpp11.noarch.rpm: exception not found in '/usr/share/license-exception' directory: exceptions
armh/rpms/jakarta-server-pages-api-2.3.6-alt1_3jpp11.noarch.rpm: license not found in '/usr/share/license' directory: ASL
armh/rpms/jakarta-server-pages-api-2.3.6-alt1_3jpp11.noarch.rpm: license not found in '/usr/share/license' directory: 2.0
2025-Mar-27 08:22:07 :: #2200: jakarta-server-pages-2.3.6-alt1_3jpp11.src.rpm: build check OK
x86_64/srpm/plexus-compiler-2.8.8-alt1_1jpp11.src.rpm: license not found in '/usr/share/license' directory: ASL
x86_64/srpm/plexus-compiler-2.8.8-alt1_1jpp11.src.rpm: license not found in '/usr/share/license' directory: 2.0
x86_64/rpms/plexus-compiler-2.8.8-alt1_1jpp11.noarch.rpm: license not found in '/usr/share/license' directory: ASL
x86_64/rpms/plexus-compiler-2.8.8-alt1_1jpp11.noarch.rpm: license not found in '/usr/share/license' directory: 2.0
x86_64/rpms/plexus-compiler-pom-2.8.8-alt1_1jpp11.noarch.rpm: license not found in '/usr/share/license' directory: ASL
x86_64/rpms/plexus-compiler-pom-2.8.8-alt1_1jpp11.noarch.rpm: license not found in '/usr/share/license' directory: 2.0
x86_64/rpms/plexus-compiler-extras-2.8.8-alt1_1jpp11.noarch.rpm: license not found in '/usr/share/license' directory: ASL
x86_64/rpms/plexus-compiler-extras-2.8.8-alt1_1jpp11.noarch.rpm: license not found in '/usr/share/license' directory: 2.0
x86_64/rpms/plexus-compiler-extras-2.8.8-alt1_1jpp11.noarch.rpm: license not found in '/usr/share/license' directory: ASL
x86_64/rpms/plexus-compiler-extras-2.8.8-alt1_1jpp11.noarch.rpm: license not found in '/usr/share/license' directory: 1.1
x86_64/rpms/plexus-compiler-javadoc-2.8.8-alt1_1jpp11.noarch.rpm: license not found in '/usr/share/license' directory: ASL
x86_64/rpms/plexus-compiler-javadoc-2.8.8-alt1_1jpp11.noarch.rpm: license not found in '/usr/share/license' directory: 2.0
x86_64/rpms/plexus-compiler-javadoc-2.8.8-alt1_1jpp11.noarch.rpm: license not found in '/usr/share/license' directory: ASL
x86_64/rpms/plexus-compiler-javadoc-2.8.8-alt1_1jpp11.noarch.rpm: license not found in '/usr/share/license' directory: 1.1
i586/srpm/plexus-compiler-2.8.8-alt1_1jpp11.src.rpm: license not found in '/usr/share/license' directory: ASL
i586/srpm/plexus-compiler-2.8.8-alt1_1jpp11.src.rpm: license not found in '/usr/share/license' directory: 2.0
i586/rpms/plexus-compiler-2.8.8-alt1_1jpp11.noarch.rpm: license not found in '/usr/share/license' directory: ASL
i586/rpms/plexus-compiler-2.8.8-alt1_1jpp11.noarch.rpm: license not found in '/usr/share/license' directory: 2.0
i586/rpms/plexus-compiler-pom-2.8.8-alt1_1jpp11.noarch.rpm: license not found in '/usr/share/license' directory: ASL
i586/rpms/plexus-compiler-pom-2.8.8-alt1_1jpp11.noarch.rpm: license not found in '/usr/share/license' directory: 2.0
i586/rpms/plexus-compiler-extras-2.8.8-alt1_1jpp11.noarch.rpm: license not found in '/usr/share/license' directory: ASL
i586/rpms/plexus-compiler-extras-2.8.8-alt1_1jpp11.noarch.rpm: license not found in '/usr/share/license' directory: 2.0
i586/rpms/plexus-compiler-extras-2.8.8-alt1_1jpp11.noarch.rpm: license not found in '/usr/share/license' directory: ASL
i586/rpms/plexus-compiler-extras-2.8.8-alt1_1jpp11.noarch.rpm: license not found in '/usr/share/license' directory: 1.1
i586/rpms/plexus-compiler-javadoc-2.8.8-alt1_1jpp11.noarch.rpm: license not found in '/usr/share/license' directory: ASL
i586/rpms/plexus-compiler-javadoc-2.8.8-alt1_1jpp11.noarch.rpm: license not found in '/usr/share/license' directory: 2.0
i586/rpms/plexus-compiler-javadoc-2.8.8-alt1_1jpp11.noarch.rpm: license not found in '/usr/share/license' directory: ASL
i586/rpms/plexus-compiler-javadoc-2.8.8-alt1_1jpp11.noarch.rpm: license not found in '/usr/share/license' directory: 1.1
aarch64/srpm/plexus-compiler-2.8.8-alt1_1jpp11.src.rpm: license not found in '/usr/share/license' directory: ASL
aarch64/srpm/plexus-compiler-2.8.8-alt1_1jpp11.src.rpm: license not found in '/usr/share/license' directory: 2.0
aarch64/rpms/plexus-compiler-2.8.8-alt1_1jpp11.noarch.rpm: license not found in '/usr/share/license' directory: ASL
aarch64/rpms/plexus-compiler-2.8.8-alt1_1jpp11.noarch.rpm: license not found in '/usr/share/license' directory: 2.0
aarch64/rpms/plexus-compiler-pom-2.8.8-alt1_1jpp11.noarch.rpm: license not found in '/usr/share/license' directory: ASL
aarch64/rpms/plexus-compiler-pom-2.8.8-alt1_1jpp11.noarch.rpm: license not found in '/usr/share/license' directory: 2.0
aarch64/rpms/plexus-compiler-extras-2.8.8-alt1_1jpp11.noarch.rpm: license not found in '/usr/share/license' directory: ASL
aarch64/rpms/plexus-compiler-extras-2.8.8-alt1_1jpp11.noarch.rpm: license not found in '/usr/share/license' directory: 2.0
aarch64/rpms/plexus-compiler-extras-2.8.8-alt1_1jpp11.noarch.rpm: license not found in '/usr/share/license' directory: ASL
aarch64/rpms/plexus-compiler-extras-2.8.8-alt1_1jpp11.noarch.rpm: license not found in '/usr/share/license' directory: 1.1
aarch64/rpms/plexus-compiler-javadoc-2.8.8-alt1_1jpp11.noarch.rpm: license not found in '/usr/share/license' directory: ASL
aarch64/rpms/plexus-compiler-javadoc-2.8.8-alt1_1jpp11.noarch.rpm: license not found in '/usr/share/license' directory: 2.0
aarch64/rpms/plexus-compiler-javadoc-2.8.8-alt1_1jpp11.noarch.rpm: license not found in '/usr/share/license' directory: ASL
aarch64/rpms/plexus-compiler-javadoc-2.8.8-alt1_1jpp11.noarch.rpm: license not found in '/usr/share/license' directory: 1.1
armh/srpm/plexus-compiler-2.8.8-alt1_1jpp11.src.rpm: license not found in '/usr/share/license' directory: ASL
armh/srpm/plexus-compiler-2.8.8-alt1_1jpp11.src.rpm: license not found in '/usr/share/license' directory: 2.0
armh/rpms/plexus-compiler-2.8.8-alt1_1jpp11.noarch.rpm: license not found in '/usr/share/license' directory: ASL
armh/rpms/plexus-compiler-2.8.8-alt1_1jpp11.noarch.rpm: license not found in '/usr/share/license' directory: 2.0
armh/rpms/plexus-compiler-pom-2.8.8-alt1_1jpp11.noarch.rpm: license not found in '/usr/share/license' directory: ASL
armh/rpms/plexus-compiler-pom-2.8.8-alt1_1jpp11.noarch.rpm: license not found in '/usr/share/license' directory: 2.0
armh/rpms/plexus-compiler-extras-2.8.8-alt1_1jpp11.noarch.rpm: license not found in '/usr/share/license' directory: ASL
armh/rpms/plexus-compiler-extras-2.8.8-alt1_1jpp11.noarch.rpm: license not found in '/usr/share/license' directory: 2.0
armh/rpms/plexus-compiler-extras-2.8.8-alt1_1jpp11.noarch.rpm: license not found in '/usr/share/license' directory: ASL
armh/rpms/plexus-compiler-extras-2.8.8-alt1_1jpp11.noarch.rpm: license not found in '/usr/share/license' directory: 1.1
armh/rpms/plexus-compiler-javadoc-2.8.8-alt1_1jpp11.noarch.rpm: license not found in '/usr/share/license' directory: ASL
armh/rpms/plexus-compiler-javadoc-2.8.8-alt1_1jpp11.noarch.rpm: license not found in '/usr/share/license' directory: 2.0
armh/rpms/plexus-compiler-javadoc-2.8.8-alt1_1jpp11.noarch.rpm: license not found in '/usr/share/license' directory: ASL
armh/rpms/plexus-compiler-javadoc-2.8.8-alt1_1jpp11.noarch.rpm: license not found in '/usr/share/license' directory: 1.1
2025-Mar-27 08:22:26 :: #2300: plexus-compiler-2.8.8-alt1_1jpp11.src.rpm: build check OK
2025-Mar-27 08:22:50 :: #2460: tomcat-9.0.98-alt0_1jpp17.p10.1.src.rpm: build check OK
2025-Mar-27 08:22:53 :: build check OK
warning (#2460): armh: non-verifiable noarch packages due to ExclusiveArch
2025-Mar-27 08:24:45 :: noarch check OK
2025-Mar-27 08:24:47 :: plan: src +25 -27 =19030, aarch64 +7 -7 =31724, armh +3 -3 =29564, i586 +5 -5 =32041, noarch +59 -69 =20408, x86_64 +9 -9 =33064
#320 aqute-bnd 4.3.1-alt1_4jpp11 -> 0:6.2.0-alt1_2jpp11
 Mon Mar 20 2023 Igor Vlasenko <viy@altlinux> 0:6.2.0-alt1_2jpp11
 - new version
 Fri Jul 01 2022 Igor Vlasenko <viy@altlinux> 0:5.2.0-alt1_9jpp11
 - update
 Wed Jun 08 2022 Igor Vlasenko <viy@altlinux> 0:5.2.0-alt1_5jpp11
 - new version
#340 ecj 4.19-alt2_1jpp11 -> 1:4.23-alt1_3jpp11
 Mon Mar 20 2023 Igor Vlasenko <viy@altlinux> 1:4.23-alt1_3jpp11
 - new version
 Fri Jul 01 2022 Igor Vlasenko <viy@altlinux> 1:4.22-alt1_3jpp11
 - new version
 Fri Jun 10 2022 Igor Vlasenko <viy@altlinux> 1:4.21-alt1_1jpp11
 - new version
#2460 tomcat 9.0.59-alt1_3jpp11 -> 1:9.0.98-alt0_1jpp17.p10.1
 Thu Mar 20 2025 Sergey Gvozdetskiy <serjigva@altlinux> 1:9.0.98-alt0_1jpp17.p10.1
 - NMU: new version
 - suppress unmet lsb-init symlink
 - security fixes:
   + CVE-2024-23672: Denial of Service
   + CVE-2024-24549: Denial of Service
   + CVE-2024-38286: Denial of Service
   + CVE-2024-34750: Denial of Service
   + CVE-2024-52316: Authentication Bypass
   + CVE-2024-52317: Request and/or response mix-up
 [...]
2025-Mar-27 08:24:48 :: tomcat: closes bugs: 53331 53333
2025-Mar-27 08:24:48 :: tomcat: mentions vulnerabilities: CVE-2024-23672 CVE-2024-24549 CVE-2024-38286 CVE-2024-34750 CVE-2024-52316 CVE-2024-52317 CVE-2024-52318 CVE-2024-50379 CVE-2024-54677 CVE-2024-56337
2025-Mar-27 08:25:28 :: patched apt indices
2025-Mar-27 08:25:39 :: created next repo
2025-Mar-27 08:25:46 :: duplicate provides check OK
2025-Mar-27 08:26:21 :: dependencies check OK
2025-Mar-27 08:26:57 :: [x86_64 i586 aarch64 armh] ELF symbols check OK
2025-Mar-27 08:27:09 :: [i586] #334 apache-commons-lang3: install check OK (cached)
2025-Mar-27 08:27:09 :: [x86_64] #334 apache-commons-lang3: install check OK (cached)
2025-Mar-27 08:27:13 :: [x86_64] #334 apache-commons-lang3-javadoc: install check OK (cached)
2025-Mar-27 08:27:13 :: [i586] #334 apache-commons-lang3-javadoc: install check OK (cached)
2025-Mar-27 08:27:17 :: [aarch64] #334 apache-commons-lang3: install check OK (cached)
2025-Mar-27 08:27:17 :: [x86_64] #1000 apache-commons-parent: install check OK (cached)
2025-Mar-27 08:27:17 :: [i586] #1000 apache-commons-parent: install check OK (cached)
warning [i586]: aqute-bnd=0:6.2.0-alt1_2jpp11: circular dependencies on aqute-bndlib=0:6.2.0-alt1_2jpp11
	i586: aqute-bnd=0:6.2.0-alt1_2jpp11 post-install unowned files:
 /etc/ant.d
2025-Mar-27 08:27:21 :: [i586] #320 aqute-bnd: install check OK (cached)
warning [x86_64]: aqute-bnd=0:6.2.0-alt1_2jpp11: circular dependencies on aqute-bndlib=0:6.2.0-alt1_2jpp11
	x86_64: aqute-bnd=0:6.2.0-alt1_2jpp11 post-install unowned files:
 /etc/ant.d
2025-Mar-27 08:27:21 :: [x86_64] #320 aqute-bnd: install check OK (cached)
2025-Mar-27 08:27:23 :: [armh] #334 apache-commons-lang3: install check OK (cached)
2025-Mar-27 08:27:24 :: [aarch64] #334 apache-commons-lang3-javadoc: install check OK (cached)
2025-Mar-27 08:27:25 :: [i586] #320 aqute-bnd-javadoc: install check OK (cached)
2025-Mar-27 08:27:25 :: [x86_64] #320 aqute-bnd-javadoc: install check OK (cached)
warning [i586]: aqute-bndlib=0:6.2.0-alt1_2jpp11: circular dependencies on aqute-bnd=0:6.2.0-alt1_2jpp11
	i586: aqute-bndlib=0:6.2.0-alt1_2jpp11 post-install unowned files:
 /etc/ant.d
2025-Mar-27 08:27:29 :: [i586] #320 aqute-bndlib: install check OK (cached)
warning [x86_64]: aqute-bndlib=0:6.2.0-alt1_2jpp11: circular dependencies on aqute-bnd=0:6.2.0-alt1_2jpp11
	x86_64: aqute-bndlib=0:6.2.0-alt1_2jpp11 post-install unowned files:
 /etc/ant.d
2025-Mar-27 08:27:29 :: [x86_64] #320 aqute-bndlib: install check OK (cached)
2025-Mar-27 08:27:31 :: [aarch64] #1000 apache-commons-parent: install check OK (cached)
2025-Mar-27 08:27:33 :: [i586] #1400 bindex: install check OK (cached)
2025-Mar-27 08:27:33 :: [x86_64] #1400 bindex: install check OK (cached)
2025-Mar-27 08:27:34 :: [armh] #334 apache-commons-lang3-javadoc: install check OK (cached)
2025-Mar-27 08:27:37 :: [i586] #320 bnd-maven-plugin: install check OK (cached)
2025-Mar-27 08:27:37 :: [x86_64] #320 bnd-maven-plugin: install check OK (cached)
warning [aarch64]: aqute-bnd=0:6.2.0-alt1_2jpp11: circular dependencies on aqute-bndlib=0:6.2.0-alt1_2jpp11
	aarch64: aqute-bnd=0:6.2.0-alt1_2jpp11 post-install unowned files:
 /etc/ant.d
2025-Mar-27 08:27:39 :: [aarch64] #320 aqute-bnd: install check OK (cached)
2025-Mar-27 08:27:41 :: [i586] #640 bouncycastle: install check OK (cached)
2025-Mar-27 08:27:41 :: [x86_64] #640 bouncycastle: install check OK (cached)
2025-Mar-27 08:27:45 :: [i586] #640 bouncycastle-javadoc: install check OK (cached)
2025-Mar-27 08:27:45 :: [x86_64] #640 bouncycastle-javadoc: install check OK (cached)
2025-Mar-27 08:27:45 :: [armh] #1000 apache-commons-parent: install check OK (cached)
2025-Mar-27 08:27:46 :: [aarch64] #320 aqute-bnd-javadoc: install check OK (cached)
2025-Mar-27 08:27:49 :: [i586] #640 bouncycastle-mail: install check OK (cached)
2025-Mar-27 08:27:49 :: [x86_64] #640 bouncycastle-mail: install check OK (cached)
warning [aarch64]: aqute-bndlib=0:6.2.0-alt1_2jpp11: circular dependencies on aqute-bnd=0:6.2.0-alt1_2jpp11
	aarch64: aqute-bndlib=0:6.2.0-alt1_2jpp11 post-install unowned files:
 /etc/ant.d
2025-Mar-27 08:27:53 :: [aarch64] #320 aqute-bndlib: install check OK (cached)
2025-Mar-27 08:27:53 :: [i586] #640 bouncycastle-pg: install check OK (cached)
2025-Mar-27 08:27:53 :: [x86_64] #640 bouncycastle-pg: install check OK (cached)
warning [armh]: aqute-bnd=0:6.2.0-alt1_2jpp11: circular dependencies on aqute-bndlib=0:6.2.0-alt1_2jpp11
	armh: aqute-bnd=0:6.2.0-alt1_2jpp11 post-install unowned files:
 /etc/ant.d
2025-Mar-27 08:27:56 :: [armh] #320 aqute-bnd: install check OK (cached)
2025-Mar-27 08:27:57 :: [i586] #640 bouncycastle-pkix: install check OK (cached)
2025-Mar-27 08:27:57 :: [x86_64] #640 bouncycastle-pkix: install check OK (cached)
2025-Mar-27 08:28:00 :: [aarch64] #1400 bindex: install check OK (cached)
2025-Mar-27 08:28:01 :: [i586] #640 bouncycastle-tls: install check OK (cached)
2025-Mar-27 08:28:01 :: [x86_64] #640 bouncycastle-tls: install check OK (cached)
2025-Mar-27 08:28:05 :: [i586] #337 bouncycastle1.65: install check OK (cached)
2025-Mar-27 08:28:05 :: [x86_64] #337 bouncycastle1.65: install check OK (cached)
2025-Mar-27 08:28:07 :: [aarch64] #320 bnd-maven-plugin: install check OK (cached)
2025-Mar-27 08:28:07 :: [armh] #320 aqute-bnd-javadoc: install check OK (cached)
2025-Mar-27 08:28:09 :: [i586] #337 bouncycastle1.65-javadoc: install check OK (cached)
2025-Mar-27 08:28:09 :: [x86_64] #337 bouncycastle1.65-javadoc: install check OK (cached)
2025-Mar-27 08:28:13 :: [i586] #337 bouncycastle1.65-mail: install check OK (cached)
2025-Mar-27 08:28:13 :: [x86_64] #337 bouncycastle1.65-mail: install check OK (cached)
2025-Mar-27 08:28:14 :: [aarch64] #640 bouncycastle: install check OK (cached)
2025-Mar-27 08:28:17 :: [i586] #337 bouncycastle1.65-pg: install check OK (cached)
2025-Mar-27 08:28:18 :: [x86_64] #337 bouncycastle1.65-pg: install check OK (cached)
warning [armh]: aqute-bndlib=0:6.2.0-alt1_2jpp11: circular dependencies on aqute-bnd=0:6.2.0-alt1_2jpp11
	armh: aqute-bndlib=0:6.2.0-alt1_2jpp11 post-install unowned files:
 /etc/ant.d
2025-Mar-27 08:28:18 :: [armh] #320 aqute-bndlib: install check OK (cached)
2025-Mar-27 08:28:21 :: [aarch64] #640 bouncycastle-javadoc: install check OK (cached)
2025-Mar-27 08:28:21 :: [i586] #337 bouncycastle1.65-pkix: install check OK (cached)
2025-Mar-27 08:28:22 :: [x86_64] #337 bouncycastle1.65-pkix: install check OK (cached)
2025-Mar-27 08:28:25 :: [i586] #337 bouncycastle1.65-tls: install check OK (cached)
2025-Mar-27 08:28:26 :: [x86_64] #337 bouncycastle1.65-tls: install check OK (cached)
2025-Mar-27 08:28:28 :: [aarch64] #640 bouncycastle-mail: install check OK (cached)
2025-Mar-27 08:28:29 :: [i586] #620 concurrent-trees: install check OK (cached)
2025-Mar-27 08:28:29 :: [armh] #1400 bindex: install check OK (cached)
2025-Mar-27 08:28:30 :: [x86_64] #620 concurrent-trees: install check OK (cached)
2025-Mar-27 08:28:33 :: [i586] #620 concurrent-trees-javadoc: install check OK (cached)
2025-Mar-27 08:28:34 :: [x86_64] #620 concurrent-trees-javadoc: install check OK (cached)
2025-Mar-27 08:28:35 :: [aarch64] #640 bouncycastle-pg: install check OK (cached)
2025-Mar-27 08:28:37 :: [i586] #1300 dnsjava: install check OK (cached)
2025-Mar-27 08:28:38 :: [x86_64] #1300 dnsjava: install check OK (cached)
2025-Mar-27 08:28:40 :: [armh] #320 bnd-maven-plugin: install check OK (cached)
2025-Mar-27 08:28:41 :: [i586] #1300 dnsjava-javadoc: install check OK (cached)
2025-Mar-27 08:28:41 :: [x86_64] #1300 dnsjava-javadoc: install check OK (cached)
2025-Mar-27 08:28:42 :: [aarch64] #640 bouncycastle-pkix: install check OK (cached)
2025-Mar-27 08:28:45 :: [i586] #340 ecj: install check OK (cached)
2025-Mar-27 08:28:45 :: [x86_64] #340 ecj: install check OK (cached)
2025-Mar-27 08:28:49 :: [i586] #2000 extra166y: install check OK (cached)
2025-Mar-27 08:28:49 :: [x86_64] #2000 extra166y: install check OK (cached)
2025-Mar-27 08:28:49 :: [aarch64] #640 bouncycastle-tls: install check OK (cached)
2025-Mar-27 08:28:51 :: [armh] #640 bouncycastle: install check OK (cached)
2025-Mar-27 08:28:53 :: [i586] #2000 extra166y-javadoc: install check OK (cached)
2025-Mar-27 08:28:53 :: [x86_64] #2000 extra166y-javadoc: install check OK (cached)
2025-Mar-27 08:28:57 :: [aarch64] #337 bouncycastle1.65: install check OK (cached)
2025-Mar-27 08:28:57 :: [i586] #700 freemarker: install check OK (cached)
2025-Mar-27 08:28:57 :: [x86_64] #700 freemarker: install check OK (cached)
2025-Mar-27 08:29:01 :: [i586] #700 freemarker-javadoc: install check OK (cached)
2025-Mar-27 08:29:01 :: [x86_64] #700 freemarker-javadoc: install check OK (cached)
2025-Mar-27 08:29:02 :: [armh] #640 bouncycastle-javadoc: install check OK (cached)
2025-Mar-27 08:29:04 :: [aarch64] #337 bouncycastle1.65-javadoc: install check OK (cached)
2025-Mar-27 08:29:05 :: [i586] #1700 gentlyweb-utils: install check OK (cached)
2025-Mar-27 08:29:05 :: [x86_64] #1700 gentlyweb-utils: install check OK (cached)
2025-Mar-27 08:29:09 :: [i586] #1700 gentlyweb-utils-javadoc: install check OK (cached)
2025-Mar-27 08:29:09 :: [x86_64] #1700 gentlyweb-utils-javadoc: install check OK (cached)
2025-Mar-27 08:29:11 :: [aarch64] #337 bouncycastle1.65-mail: install check OK (cached)
2025-Mar-27 08:29:13 :: [i586] #2200 jakarta-server-pages: install check OK (cached)
2025-Mar-27 08:29:13 :: [armh] #640 bouncycastle-mail: install check OK (cached)
2025-Mar-27 08:29:13 :: [x86_64] #2200 jakarta-server-pages: install check OK (cached)
2025-Mar-27 08:29:17 :: [i586] #2200 jakarta-server-pages-api: install check OK (cached)
2025-Mar-27 08:29:17 :: [x86_64] #2200 jakarta-server-pages-api: install check OK (cached)
2025-Mar-27 08:29:18 :: [aarch64] #337 bouncycastle1.65-pg: install check OK (cached)
2025-Mar-27 08:29:21 :: [i586] #2200 jakarta-server-pages-javadoc: install check OK (cached)
2025-Mar-27 08:29:21 :: [x86_64] #2200 jakarta-server-pages-javadoc: install check OK (cached)
2025-Mar-27 08:29:24 :: [armh] #640 bouncycastle-pg: install check OK (cached)
2025-Mar-27 08:29:25 :: [aarch64] #337 bouncycastle1.65-pkix: install check OK (cached)
2025-Mar-27 08:29:25 :: [i586] #740 javaparser: install check OK (cached)
2025-Mar-27 08:29:25 :: [x86_64] #740 javaparser: install check OK (cached)
2025-Mar-27 08:29:29 :: [i586] #740 javaparser-javadoc: install check OK (cached)
2025-Mar-27 08:29:29 :: [x86_64] #740 javaparser-javadoc: install check OK (cached)
2025-Mar-27 08:29:31 :: [aarch64] #337 bouncycastle1.65-tls: install check OK (cached)
2025-Mar-27 08:29:33 :: [i586] #540 jdom2: install check OK (cached)
2025-Mar-27 08:29:33 :: [x86_64] #540 jdom2: install check OK (cached)
2025-Mar-27 08:29:35 :: [armh] #640 bouncycastle-pkix: install check OK (cached)
2025-Mar-27 08:29:37 :: [i586] #540 jdom2-javadoc: install check OK (cached)
2025-Mar-27 08:29:37 :: [x86_64] #540 jdom2-javadoc: install check OK (cached)
2025-Mar-27 08:29:38 :: [aarch64] #620 concurrent-trees: install check OK (cached)
2025-Mar-27 08:29:41 :: [i586] #1500 jgraphx: install check OK (cached)
2025-Mar-27 08:29:41 :: [x86_64] #1500 jgraphx: install check OK (cached)
2025-Mar-27 08:29:45 :: [i586] #1500 jgraphx-javadoc: install check OK (cached)
2025-Mar-27 08:29:45 :: [aarch64] #620 concurrent-trees-javadoc: install check OK (cached)
2025-Mar-27 08:29:45 :: [x86_64] #1500 jgraphx-javadoc: install check OK (cached)
2025-Mar-27 08:29:46 :: [armh] #640 bouncycastle-tls: install check OK (cached)
2025-Mar-27 08:29:49 :: [i586] #1200 josql: install check OK (cached)
2025-Mar-27 08:29:49 :: [x86_64] #1200 josql: install check OK (cached)
2025-Mar-27 08:29:52 :: [aarch64] #1300 dnsjava: install check OK (cached)
2025-Mar-27 08:29:53 :: [i586] #1200 josql-javadoc: install check OK (cached)
2025-Mar-27 08:29:53 :: [x86_64] #1200 josql-javadoc: install check OK (cached)
2025-Mar-27 08:29:57 :: [i586] #560 lz4-java: install check OK (cached)
2025-Mar-27 08:29:57 :: [armh] #337 bouncycastle1.65: install check OK (cached)
2025-Mar-27 08:29:57 :: [x86_64] #560 lz4-java: install check OK (cached)
2025-Mar-27 08:29:59 :: [aarch64] #1300 dnsjava-javadoc: install check OK (cached)
2025-Mar-27 08:30:01 :: [i586] #560 lz4-java-javadoc: install check OK (cached)
2025-Mar-27 08:30:01 :: [x86_64] #560 lz4-java-javadoc: install check OK (cached)
2025-Mar-27 08:30:05 :: [i586] #720 maven-osgi: install check OK (cached)
2025-Mar-27 08:30:05 :: [x86_64] #720 maven-osgi: install check OK (cached)
2025-Mar-27 08:30:06 :: [aarch64] #340 ecj: install check OK (cached)
2025-Mar-27 08:30:08 :: [armh] #337 bouncycastle1.65-javadoc: install check OK (cached)
2025-Mar-27 08:30:09 :: [i586] #720 maven-osgi-javadoc: install check OK (cached)
2025-Mar-27 08:30:10 :: [x86_64] #720 maven-osgi-javadoc: install check OK (cached)
2025-Mar-27 08:30:13 :: [aarch64] #2000 extra166y: install check OK (cached)
2025-Mar-27 08:30:13 :: [i586] #324 maven-plugin-bundle: install check OK (cached)
2025-Mar-27 08:30:14 :: [x86_64] #324 maven-plugin-bundle: install check OK (cached)
2025-Mar-27 08:30:17 :: [i586] #324 maven-plugin-bundle-javadoc: install check OK (cached)
2025-Mar-27 08:30:18 :: [x86_64] #324 maven-plugin-bundle-javadoc: install check OK (cached)
2025-Mar-27 08:30:19 :: [armh] #337 bouncycastle1.65-mail: install check OK (cached)
2025-Mar-27 08:30:20 :: [aarch64] #2000 extra166y-javadoc: install check OK (cached)
2025-Mar-27 08:30:21 :: [i586] #2300 plexus-compiler: install check OK (cached)
2025-Mar-27 08:30:22 :: [x86_64] #2300 plexus-compiler: install check OK (cached)
2025-Mar-27 08:30:25 :: [i586] #2300 plexus-compiler-extras: install check OK (cached)
2025-Mar-27 08:30:26 :: [x86_64] #2300 plexus-compiler-extras: install check OK (cached)
2025-Mar-27 08:30:27 :: [aarch64] #700 freemarker: install check OK (cached)
2025-Mar-27 08:30:29 :: [i586] #2300 plexus-compiler-javadoc: install check OK (cached)
2025-Mar-27 08:30:29 :: [armh] #337 bouncycastle1.65-pg: install check OK (cached)
2025-Mar-27 08:30:30 :: [x86_64] #2300 plexus-compiler-javadoc: install check OK (cached)
2025-Mar-27 08:30:33 :: [i586] #2300 plexus-compiler-pom: install check OK (cached)
2025-Mar-27 08:30:34 :: [aarch64] #700 freemarker-javadoc: install check OK (cached)
2025-Mar-27 08:30:34 :: [x86_64] #2300 plexus-compiler-pom: install check OK (cached)
2025-Mar-27 08:30:37 :: [i586] #1100 rxtx: install check OK (cached)
2025-Mar-27 08:30:38 :: [x86_64] #1100 rxtx: install check OK (cached)
2025-Mar-27 08:30:40 :: [armh] #337 bouncycastle1.65-pkix: install check OK (cached)
2025-Mar-27 08:30:41 :: [aarch64] #1700 gentlyweb-utils: install check OK (cached)
2025-Mar-27 08:30:41 :: [i586] #1100 rxtx-debuginfo: install check OK (cached)
2025-Mar-27 08:30:42 :: [x86_64] #1100 rxtx-debuginfo: install check OK (cached)
	i586: scilab=1:6.0.2-alt2 post-install unowned files:
 /usr/share/icons/hicolor/16x16/mimetypes
 /usr/share/icons/hicolor/24x24/mimetypes
 /usr/share/icons/hicolor/256x256
 /usr/share/icons/hicolor/256x256/apps
 /usr/share/icons/hicolor/256x256/mimetypes
 /usr/share/icons/hicolor/32x32/mimetypes
 /usr/share/icons/hicolor/48x48/mimetypes
2025-Mar-27 08:30:46 :: [i586] #2100 scilab: install check OK (cached)
	x86_64: scala=2.13.9-alt3 post-install unowned files:
 /usr/share/mime-info
2025-Mar-27 08:30:46 :: [x86_64] #600 scala: install check OK (cached)
2025-Mar-27 08:30:47 :: [aarch64] #1700 gentlyweb-utils-javadoc: install check OK (cached)
2025-Mar-27 08:30:50 :: [x86_64] #600 scala-apidoc: install check OK (cached)
2025-Mar-27 08:30:51 :: [i586] #2100 scilab-debuginfo: install check OK (cached)
2025-Mar-27 08:30:51 :: [armh] #337 bouncycastle1.65-tls: install check OK (cached)
2025-Mar-27 08:30:54 :: [x86_64] #600 scala-library: install check OK (cached)
2025-Mar-27 08:30:54 :: [aarch64] #2200 jakarta-server-pages: install check OK (cached)
2025-Mar-27 08:30:55 :: [i586] #2460 tomcat: install check OK (cached)
2025-Mar-27 08:30:58 :: [x86_64] #600 scala-reflect: install check OK (cached)
2025-Mar-27 08:30:59 :: [i586] #2460 tomcat-admin-webapps: install check OK (cached)
2025-Mar-27 08:31:01 :: [aarch64] #2200 jakarta-server-pages-api: install check OK (cached)
	x86_64: scilab=1:6.0.2-alt2 post-install unowned files:
 /usr/share/icons/hicolor/16x16/mimetypes
 /usr/share/icons/hicolor/24x24/mimetypes
 /usr/share/icons/hicolor/256x256
 /usr/share/icons/hicolor/256x256/apps
 /usr/share/icons/hicolor/256x256/mimetypes
 /usr/share/icons/hicolor/32x32/mimetypes
 /usr/share/icons/hicolor/48x48/mimetypes
2025-Mar-27 08:31:02 :: [x86_64] #2100 scilab: install check OK (cached)
2025-Mar-27 08:31:02 :: [armh] #620 concurrent-trees: install check OK (cached)
2025-Mar-27 08:31:03 :: [i586] #2460 tomcat-docs-webapp: install check OK (cached)
2025-Mar-27 08:31:07 :: [i586] #2460 tomcat-el-3.0-api: install check OK (cached)
2025-Mar-27 08:31:08 :: [x86_64] #2100 scilab-debuginfo: install check OK (cached)
2025-Mar-27 08:31:08 :: [aarch64] #2200 jakarta-server-pages-javadoc: install check OK (cached)
warning [i586]: tomcat-jsp-2.3-api=1:9.0.98-alt0_1jpp17.p10.1: circular dependencies on tomcat-lib=1:9.0.98-alt0_1jpp17.p10.1
	i586: tomcat-jsp-2.3-api=1:9.0.98-alt0_1jpp17.p10.1 post-install unowned files:
 /usr/share/tomcat
 /usr/share/tomcat/bin
2025-Mar-27 08:31:11 :: [i586] #2460 tomcat-jsp-2.3-api: install check OK (cached)
2025-Mar-27 08:31:12 :: [x86_64] #2460 tomcat: install check OK (cached)
2025-Mar-27 08:31:13 :: [armh] #620 concurrent-trees-javadoc: install check OK (cached)
warning [i586]: tomcat-lib=1:9.0.98-alt0_1jpp17.p10.1: circular dependencies on tomcat-jsp-2.3-api=1:9.0.98-alt0_1jpp17.p10.1
	i586: tomcat-lib=1:9.0.98-alt0_1jpp17.p10.1 post-install unowned files:
 /usr/share/tomcat
 /usr/share/tomcat/bin
2025-Mar-27 08:31:15 :: [i586] #2460 tomcat-lib: install check OK (cached)
2025-Mar-27 08:31:15 :: [aarch64] #740 javaparser: install check OK (cached)
2025-Mar-27 08:31:16 :: [x86_64] #2460 tomcat-admin-webapps: install check OK (cached)
2025-Mar-27 08:31:19 :: [i586] #2460 tomcat-servlet-4.0-api: install check OK (cached)
2025-Mar-27 08:31:20 :: [x86_64] #2460 tomcat-docs-webapp: install check OK (cached)
2025-Mar-27 08:31:22 :: [aarch64] #740 javaparser-javadoc: install check OK (cached)
2025-Mar-27 08:31:23 :: [i586] #2460 tomcat-webapps: install check OK (cached)
2025-Mar-27 08:31:24 :: [x86_64] #2460 tomcat-el-3.0-api: install check OK (cached)
2025-Mar-27 08:31:24 :: [armh] #1300 dnsjava: install check OK (cached)
warning [x86_64]: tomcat-jsp-2.3-api=1:9.0.98-alt0_1jpp17.p10.1: circular dependencies on tomcat-lib=1:9.0.98-alt0_1jpp17.p10.1
	x86_64: tomcat-jsp-2.3-api=1:9.0.98-alt0_1jpp17.p10.1 post-install unowned files:
 /usr/share/tomcat
 /usr/share/tomcat/bin
2025-Mar-27 08:31:28 :: [x86_64] #2460 tomcat-jsp-2.3-api: install check OK (cached)
2025-Mar-27 08:31:29 :: [aarch64] #540 jdom2: install check OK (cached)
warning [x86_64]: tomcat-lib=1:9.0.98-alt0_1jpp17.p10.1: circular dependencies on tomcat-jsp-2.3-api=1:9.0.98-alt0_1jpp17.p10.1
	x86_64: tomcat-lib=1:9.0.98-alt0_1jpp17.p10.1 post-install unowned files:
 /usr/share/tomcat
 /usr/share/tomcat/bin
2025-Mar-27 08:31:32 :: [x86_64] #2460 tomcat-lib: install check OK (cached)
2025-Mar-27 08:31:35 :: [armh] #1300 dnsjava-javadoc: install check OK (cached)
2025-Mar-27 08:31:36 :: [aarch64] #540 jdom2-javadoc: install check OK (cached)
2025-Mar-27 08:31:36 :: [x86_64] #2460 tomcat-servlet-4.0-api: install check OK (cached)
2025-Mar-27 08:31:40 :: [x86_64] #2460 tomcat-webapps: install check OK (cached)
2025-Mar-27 08:31:43 :: [aarch64] #1500 jgraphx: install check OK (cached)
2025-Mar-27 08:31:46 :: [armh] #340 ecj: install check OK (cached)
2025-Mar-27 08:31:49 :: [aarch64] #1500 jgraphx-javadoc: install check OK (cached)
2025-Mar-27 08:31:56 :: [aarch64] #1200 josql: install check OK (cached)
2025-Mar-27 08:31:57 :: [armh] #2000 extra166y: install check OK (cached)
2025-Mar-27 08:32:03 :: [aarch64] #1200 josql-javadoc: install check OK (cached)
2025-Mar-27 08:32:08 :: [armh] #2000 extra166y-javadoc: install check OK (cached)
2025-Mar-27 08:32:10 :: [aarch64] #560 lz4-java: install check OK (cached)
2025-Mar-27 08:32:17 :: [aarch64] #560 lz4-java-javadoc: install check OK (cached)
2025-Mar-27 08:32:19 :: [armh] #700 freemarker: install check OK (cached)
2025-Mar-27 08:32:24 :: [aarch64] #720 maven-osgi: install check OK (cached)
2025-Mar-27 08:32:30 :: [armh] #700 freemarker-javadoc: install check OK (cached)
2025-Mar-27 08:32:31 :: [aarch64] #720 maven-osgi-javadoc: install check OK (cached)
2025-Mar-27 08:32:38 :: [aarch64] #324 maven-plugin-bundle: install check OK (cached)
2025-Mar-27 08:32:41 :: [armh] #1700 gentlyweb-utils: install check OK (cached)
2025-Mar-27 08:32:45 :: [aarch64] #324 maven-plugin-bundle-javadoc: install check OK (cached)
2025-Mar-27 08:32:52 :: [armh] #1700 gentlyweb-utils-javadoc: install check OK (cached)
2025-Mar-27 08:32:52 :: [aarch64] #2300 plexus-compiler: install check OK (cached)
2025-Mar-27 08:32:59 :: [aarch64] #2300 plexus-compiler-extras: install check OK (cached)
2025-Mar-27 08:33:03 :: [armh] #2200 jakarta-server-pages: install check OK (cached)
2025-Mar-27 08:33:06 :: [aarch64] #2300 plexus-compiler-javadoc: install check OK (cached)
2025-Mar-27 08:33:13 :: [aarch64] #2300 plexus-compiler-pom: install check OK (cached)
2025-Mar-27 08:33:14 :: [armh] #2200 jakarta-server-pages-api: install check OK (cached)
2025-Mar-27 08:33:20 :: [aarch64] #1100 rxtx: install check OK (cached)
2025-Mar-27 08:33:25 :: [armh] #2200 jakarta-server-pages-javadoc: install check OK (cached)
2025-Mar-27 08:33:27 :: [aarch64] #1100 rxtx-debuginfo: install check OK (cached)
	aarch64: scala=2.13.9-alt3 post-install unowned files:
 /usr/share/mime-info
2025-Mar-27 08:33:34 :: [aarch64] #600 scala: install check OK (cached)
2025-Mar-27 08:33:36 :: [armh] #740 javaparser: install check OK (cached)
2025-Mar-27 08:33:41 :: [aarch64] #600 scala-apidoc: install check OK (cached)
2025-Mar-27 08:33:47 :: [armh] #740 javaparser-javadoc: install check OK (cached)
2025-Mar-27 08:33:47 :: [aarch64] #600 scala-library: install check OK (cached)
2025-Mar-27 08:33:54 :: [aarch64] #600 scala-reflect: install check OK (cached)
2025-Mar-27 08:33:58 :: [armh] #540 jdom2: install check OK (cached)
2025-Mar-27 08:34:01 :: [aarch64] #2460 tomcat: install check OK (cached)
2025-Mar-27 08:34:08 :: [aarch64] #2460 tomcat-admin-webapps: install check OK (cached)
2025-Mar-27 08:34:08 :: [armh] #540 jdom2-javadoc: install check OK (cached)
2025-Mar-27 08:34:15 :: [aarch64] #2460 tomcat-docs-webapp: install check OK (cached)
2025-Mar-27 08:34:19 :: [armh] #1500 jgraphx: install check OK (cached)
2025-Mar-27 08:34:22 :: [aarch64] #2460 tomcat-el-3.0-api: install check OK (cached)
warning [aarch64]: tomcat-jsp-2.3-api=1:9.0.98-alt0_1jpp17.p10.1: circular dependencies on tomcat-lib=1:9.0.98-alt0_1jpp17.p10.1
	aarch64: tomcat-jsp-2.3-api=1:9.0.98-alt0_1jpp17.p10.1 post-install unowned files:
 /usr/share/tomcat
 /usr/share/tomcat/bin
2025-Mar-27 08:34:29 :: [aarch64] #2460 tomcat-jsp-2.3-api: install check OK (cached)
2025-Mar-27 08:34:30 :: [armh] #1500 jgraphx-javadoc: install check OK (cached)
warning [aarch64]: tomcat-lib=1:9.0.98-alt0_1jpp17.p10.1: circular dependencies on tomcat-jsp-2.3-api=1:9.0.98-alt0_1jpp17.p10.1
	aarch64: tomcat-lib=1:9.0.98-alt0_1jpp17.p10.1 post-install unowned files:
 /usr/share/tomcat
 /usr/share/tomcat/bin
2025-Mar-27 08:34:36 :: [aarch64] #2460 tomcat-lib: install check OK (cached)
2025-Mar-27 08:34:41 :: [armh] #1200 josql: install check OK (cached)
2025-Mar-27 08:34:43 :: [aarch64] #2460 tomcat-servlet-4.0-api: install check OK (cached)
2025-Mar-27 08:34:50 :: [aarch64] #2460 tomcat-webapps: install check OK (cached)
2025-Mar-27 08:34:52 :: [armh] #1200 josql-javadoc: install check OK (cached)
2025-Mar-27 08:35:03 :: [armh] #560 lz4-java: install check OK (cached)
2025-Mar-27 08:35:14 :: [armh] #560 lz4-java-javadoc: install check OK (cached)
2025-Mar-27 08:35:25 :: [armh] #720 maven-osgi: install check OK (cached)
2025-Mar-27 08:35:36 :: [armh] #720 maven-osgi-javadoc: install check OK (cached)
2025-Mar-27 08:35:47 :: [armh] #324 maven-plugin-bundle: install check OK (cached)
2025-Mar-27 08:35:58 :: [armh] #324 maven-plugin-bundle-javadoc: install check OK (cached)
2025-Mar-27 08:36:09 :: [armh] #2300 plexus-compiler: install check OK (cached)
2025-Mar-27 08:36:20 :: [armh] #2300 plexus-compiler-extras: install check OK (cached)
2025-Mar-27 08:36:31 :: [armh] #2300 plexus-compiler-javadoc: install check OK (cached)
2025-Mar-27 08:36:42 :: [armh] #2300 plexus-compiler-pom: install check OK (cached)
2025-Mar-27 08:36:53 :: [armh] #1100 rxtx: install check OK (cached)
2025-Mar-27 08:37:04 :: [armh] #1100 rxtx-debuginfo: install check OK (cached)
2025-Mar-27 08:37:15 :: [armh] #2460 tomcat: install check OK (cached)
2025-Mar-27 08:37:26 :: [armh] #2460 tomcat-admin-webapps: install check OK (cached)
2025-Mar-27 08:37:38 :: [armh] #2460 tomcat-docs-webapp: install check OK (cached)
2025-Mar-27 08:37:48 :: [armh] #2460 tomcat-el-3.0-api: install check OK (cached)
warning [armh]: tomcat-jsp-2.3-api=1:9.0.98-alt0_1jpp17.p10.1: circular dependencies on tomcat-lib=1:9.0.98-alt0_1jpp17.p10.1
	armh: tomcat-jsp-2.3-api=1:9.0.98-alt0_1jpp17.p10.1 post-install unowned files:
 /usr/share/tomcat
 /usr/share/tomcat/bin
2025-Mar-27 08:37:59 :: [armh] #2460 tomcat-jsp-2.3-api: install check OK (cached)
warning [armh]: tomcat-lib=1:9.0.98-alt0_1jpp17.p10.1: circular dependencies on tomcat-jsp-2.3-api=1:9.0.98-alt0_1jpp17.p10.1
	armh: tomcat-lib=1:9.0.98-alt0_1jpp17.p10.1 post-install unowned files:
 /usr/share/tomcat
 /usr/share/tomcat/bin
2025-Mar-27 08:38:10 :: [armh] #2460 tomcat-lib: install check OK (cached)
2025-Mar-27 08:38:21 :: [armh] #2460 tomcat-servlet-4.0-api: install check OK (cached)
2025-Mar-27 08:38:33 :: [armh] #2460 tomcat-webapps: install check OK (cached)
2025-Mar-27 08:38:34 :: [x86_64-i586] plan: #0 +2 -2 =11135
2025-Mar-27 08:38:51 :: [x86_64-i586] generated apt indices
2025-Mar-27 08:38:52 :: [x86_64-i586] created next repo
2025-Mar-27 08:39:02 :: [x86_64-i586] dependencies check OK
2025-Mar-27 08:39:03 :: gears inheritance check OK
2025-Mar-27 08:39:04 :: srpm inheritance check OK
girar-check-perms: access to @maint ALLOWED for cas: member of approved group
girar-check-perms: access to @tester ALLOWED for snowmix: member of approved group
check-subtask-perms: #320: aqute-bnd: approved by cas, approved by snowmix
girar-check-perms: access to @maint ALLOWED for cas: member of approved group
girar-check-perms: access to @tester ALLOWED for snowmix: member of approved group
check-subtask-perms: #324: maven-plugin-bundle: approved by cas, approved by snowmix
girar-check-perms: access to @maint ALLOWED for cas: member of approved group
girar-check-perms: access to @tester ALLOWED for snowmix: member of approved group
check-subtask-perms: #334: apache-commons-lang3: approved by cas, approved by snowmix
girar-check-perms: access to @maint ALLOWED for cas: member of approved group
girar-check-perms: access to @tester ALLOWED for snowmix: member of approved group
check-subtask-perms: #337: bouncycastle1.65: approved by cas, approved by snowmix
girar-check-perms: access to @maint ALLOWED for cas: member of approved group
girar-check-perms: access to @tester ALLOWED for snowmix: member of approved group
check-subtask-perms: #340: ecj: approved by cas, approved by snowmix
girar-check-perms: access to @maint ALLOWED for cas: member of approved group
girar-check-perms: access to @tester ALLOWED for snowmix: member of approved group
check-subtask-perms: #540: jdom2: approved by cas, approved by snowmix
girar-check-perms: access to @maint ALLOWED for cas: member of approved group
girar-check-perms: access to @tester ALLOWED for snowmix: member of approved group
check-subtask-perms: #560: lz4-java: approved by cas, approved by snowmix
girar-check-perms: access to @maint ALLOWED for cas: member of approved group
girar-check-perms: access to @tester ALLOWED for snowmix: member of approved group
check-subtask-perms: #600: scala: approved by cas, approved by snowmix
girar-check-perms: access to @maint ALLOWED for cas: member of approved group
girar-check-perms: access to @tester ALLOWED for snowmix: member of approved group
check-subtask-perms: #620: concurrent-trees: approved by cas, approved by snowmix
girar-check-perms: access to @maint ALLOWED for cas: member of approved group
girar-check-perms: access to @tester ALLOWED for snowmix: member of approved group
check-subtask-perms: #640: bouncycastle: approved by cas, approved by snowmix
girar-check-perms: access to @maint ALLOWED for cas: member of approved group
girar-check-perms: access to @tester ALLOWED for snowmix: member of approved group
check-subtask-perms: #700: freemarker: approved by cas, approved by snowmix
girar-check-perms: access to @maint ALLOWED for cas: member of approved group
girar-check-perms: access to @tester ALLOWED for snowmix: member of approved group
check-subtask-perms: #720: maven-osgi: approved by cas, approved by snowmix
girar-check-perms: access to @maint ALLOWED for cas: member of approved group
girar-check-perms: access to @tester ALLOWED for snowmix: member of approved group
check-subtask-perms: #740: javaparser: approved by cas, approved by snowmix
girar-check-perms: access to @maint ALLOWED for cas: member of approved group
girar-check-perms: access to @tester ALLOWED for snowmix: member of approved group
check-subtask-perms: #1000: apache-commons-parent: approved by cas, approved by snowmix
girar-check-perms: access to @maint ALLOWED for cas: member of approved group
girar-check-perms: access to @tester ALLOWED for snowmix: member of approved group
check-subtask-perms: #1100: rxtx: approved by cas, approved by snowmix
girar-check-perms: access to @maint ALLOWED for cas: member of approved group
girar-check-perms: access to @tester ALLOWED for snowmix: member of approved group
check-subtask-perms: #1200: josql: approved by cas, approved by snowmix
girar-check-perms: access to @maint ALLOWED for cas: member of approved group
girar-check-perms: access to @tester ALLOWED for snowmix: member of approved group
check-subtask-perms: #1300: dnsjava: approved by cas, approved by snowmix
girar-check-perms: access to @maint ALLOWED for cas: member of approved group
girar-check-perms: access to @tester ALLOWED for snowmix: member of approved group
check-subtask-perms: #1400: bindex: approved by cas, approved by snowmix
girar-check-perms: access to @maint ALLOWED for cas: member of approved group
girar-check-perms: access to @tester ALLOWED for snowmix: member of approved group
check-subtask-perms: #1500: jgraphx: approved by cas, approved by snowmix
girar-check-perms: access to @maint ALLOWED for cas: member of approved group
girar-check-perms: access to @tester ALLOWED for snowmix: member of approved group
check-subtask-perms: #1700: gentlyweb-utils: approved by cas, approved by snowmix
girar-check-perms: access to @maint ALLOWED for cas: member of approved group
girar-check-perms: access to @tester ALLOWED for snowmix: member of approved group
check-subtask-perms: #2000: extra166y: approved by cas, approved by snowmix
girar-check-perms: access to @maint ALLOWED for cas: member of approved group
girar-check-perms: access to @tester ALLOWED for snowmix: member of approved group
check-subtask-perms: #2100: scilab: approved by cas, approved by snowmix
girar-check-perms: access to @maint ALLOWED for cas: member of approved group
girar-check-perms: access to @tester ALLOWED for snowmix: member of approved group
check-subtask-perms: #2200: jakarta-server-pages: approved by cas, approved by snowmix
girar-check-perms: access to @maint ALLOWED for cas: member of approved group
girar-check-perms: access to @tester ALLOWED for snowmix: member of approved group
check-subtask-perms: #2300: plexus-compiler: approved by cas, approved by snowmix
girar-check-perms: access to @maint ALLOWED for cas: member of approved group
girar-check-perms: access to @tester ALLOWED for snowmix: member of approved group
check-subtask-perms: #2460: tomcat: approved by cas, approved by snowmix
girar-check-perms: access to @maint ALLOWED for cas: member of approved group
girar-check-perms: access to @tester ALLOWED for snowmix: member of approved group
check-subtask-perms: #3000: apache-commons-javaflow: approved by cas, approved by snowmix
girar-check-perms: access to @maint ALLOWED for cas: member of approved group
girar-check-perms: access to @tester ALLOWED for snowmix: member of approved group
check-subtask-perms: #3100: apache-commons-jci: approved by cas, approved by snowmix
2025-Mar-27 08:39:22 :: acl check OK
2025-Mar-27 08:39:40 :: created contents_index files
2025-Mar-27 08:39:48 :: created hash files: aarch64 armh i586 noarch src x86_64-i586 x86_64
2025-Mar-27 08:39:51 :: task #371974 for p10 TESTED
2025-Mar-27 08:39:59 :: task is ready for commit
2025-Mar-27 08:40:04 :: repo clone OK
2025-Mar-27 08:40:06 :: packages update OK
2025-Mar-27 08:40:15 :: [x86_64 i586 aarch64 armh noarch] update OK
2025-Mar-27 08:40:16 :: [x86_64-i586] update OK
2025-Mar-27 08:40:16 :: repo update OK
2025-Mar-27 08:40:29 :: repo save OK
2025-Mar-27 08:40:30 :: src index update OK
2025-Mar-27 08:40:30 :: updated /srpms/a/apache-commons-lang3.git branch `p10'
2025-Mar-27 08:40:31 :: updated /srpms/a/apache-commons-parent.git branch `p10'
fatal: tag '6.2.0-alt1_2jpp11' already exists
2025-Mar-27 08:40:33 :: updated /srpms/a/aqute-bnd.git branch `p10'
fatal: no tag exactly matches '39b68a57ac2019233b010a2d579d34c7492ccf40'
2025-Mar-27 08:40:34 :: updated /srpms/b/bindex.git branch `p10'
2025-Mar-27 08:40:40 :: updated /srpms/b/bouncycastle.git branch `p10'
2025-Mar-27 08:40:45 :: updated /srpms/b/bouncycastle1.65.git branch `p10'
2025-Mar-27 08:40:47 :: updated /srpms/c/concurrent-trees.git branch `p10'
2025-Mar-27 08:40:47 :: updated /srpms/d/dnsjava.git branch `p10'
fatal: tag '4.23-alt1_3jpp11' already exists
2025-Mar-27 08:40:48 :: updated /srpms/e/ecj.git branch `p10'
fatal: no tag exactly matches '4b12c85855e0cebff4ffa6f013ad9ffe23592108'
2025-Mar-27 08:40:49 :: updated /srpms/e/extra166y.git branch `p10'
2025-Mar-27 08:40:50 :: updated /srpms/f/freemarker.git branch `p10'
2025-Mar-27 08:40:50 :: updated /srpms/g/gentlyweb-utils.git branch `p10'
2025-Mar-27 08:40:50 :: updated /srpms/j/jakarta-server-pages.git branch `p10'
2025-Mar-27 08:40:53 :: updated /srpms/j/javaparser.git branch `p10'
2025-Mar-27 08:40:53 :: updated /srpms/j/jdom2.git branch `p10'
2025-Mar-27 08:40:54 :: updated /srpms/j/jgraphx.git branch `p10'
2025-Mar-27 08:40:55 :: updated /srpms/j/josql.git branch `p10'
2025-Mar-27 08:40:55 :: updated /srpms/l/lz4-java.git branch `p10'
2025-Mar-27 08:40:56 :: updated /srpms/m/maven-osgi.git branch `p10'
2025-Mar-27 08:40:56 :: updated /srpms/m/maven-plugin-bundle.git branch `p10'
2025-Mar-27 08:40:56 :: updated /srpms/p/plexus-compiler.git branch `p10'
2025-Mar-27 08:40:58 :: updated /srpms/r/rxtx.git branch `p10'
2025-Mar-27 08:41:01 :: updated /srpms/s/scala.git branch `p10'
fatal: no tag exactly matches 'c3a8821faf60dc706baeece805d5679e812b8c26'
2025-Mar-27 08:41:01 :: updated /gears/s/scilab.git branch `p10'
2025-Mar-27 08:41:04 :: updated /srpms/t/tomcat.git branch `p10'
2025-Mar-27 08:41:04 :: saved /srpms/a/apache-commons-javaflow.git branch `p10' as `old/p10-task371974'
2025-Mar-27 08:41:04 :: removed /srpms/a/apache-commons-javaflow.git branch `p10'
2025-Mar-27 08:41:04 :: saved /srpms/a/apache-commons-jci.git branch `p10' as `old/p10-task371974'
2025-Mar-27 08:41:04 :: removed /srpms/a/apache-commons-jci.git branch `p10'
2025-Mar-27 08:42:30 :: gears update OK
2025-Mar-27 08:42:30 :: task #371974 for p10 DONE


      parent reply	other threads:[~2025-03-27  8:42 UTC|newest]

Thread overview: 18+ messages / expand[flat|nested]  mbox.gz  Atom feed  top
2025-01-28 11:35 [#371974] p10 TESTED tinyproxy.git=1.11.1-alt2 Girar awaiter (serjigva)
2025-01-29 15:32 ` [#371974] [test-only] p10 FAILED (try 2) srpm=jpackage-generic-compat-0.43-alt1.src.rpm Girar awaiter (serjigva)
2025-01-29 15:49 ` [#371974] [test-only] p10 FAILED (try 3) srpm=jpackage-generic-compat-0.43-alt1.src.rpm Girar awaiter (serjigva)
2025-01-30 11:03 ` [#371974] [test-only] p10 FAILED (try 4) srpm=jpackage-generic-compat-0.43-alt1.src.rpm Girar awaiter (serjigva)
2025-01-30 11:48 ` [#371974] [test-only] p10 FAILED (try 5) srpm=jpackage-generic-compat-0.43-alt1.src.rpm Girar awaiter (serjigva)
2025-01-30 14:35 ` [#371974] [test-only] p10 FAILED (try 6) srpm=jpackage-generic-compat-0.43-alt1.src.rpm Girar awaiter (serjigva)
2025-01-30 14:49 ` [#371974] [test-only] p10 FAILED (try 7) srpm=jpackage-generic-compat-0.43-alt1.src.rpm Girar awaiter (serjigva)
2025-02-04 10:18 ` [#371974] [test-only] p10 FAILED (try 8) srpm=jpackage-generic-compat-0.43-alt1.src.rpm Girar awaiter (serjigva)
2025-02-04 11:13 ` [#371974] [test-only] p10 FAILED (try 9) srpm=jpackage-generic-compat-0.43-alt1.src.rpm Girar awaiter (serjigva)
2025-02-04 11:31 ` [#371974] [test-only] p10 FAILED (try 10) srpm=jpackage-generic-compat-0.43-alt1.src.rpm Girar awaiter (serjigva)
2025-02-04 13:45 ` [#371974] p10 EPERM (try 11) srpm=jpackage-generic-compat-0.43-alt1.src.rpm Girar awaiter (serjigva)
2025-02-25 12:48 ` [#371974] p10 FAILED (try 12) srpm=aqute-bnd-6.2.0-alt1_2jpp11.src.rpm Girar awaiter (serjigva)
2025-02-25 15:44 ` [#371974] p10 FAILED (try 13) srpm=aqute-bnd-6.2.0-alt1_2jpp11.src.rpm Girar awaiter (serjigva)
2025-02-25 17:02 ` [#371974] p10 EPERM (try 14) srpm=aqute-bnd-6.2.0-alt1_2jpp11.src.rpm Girar awaiter (serjigva)
2025-03-04 12:15 ` [#371974] p10 EPERM (try 15) srpm=aqute-bnd-6.2.0-alt1_2jpp11.src.rpm Girar awaiter (serjigva)
2025-03-17 13:43 ` [#371974] p10 EPERM (try 16) srpm=aqute-bnd-6.2.0-alt1_2jpp11.src.rpm Girar awaiter (serjigva)
2025-03-20 11:00 ` [#371974] p10 EPERM (try 17) srpm=aqute-bnd-6.2.0-alt1_2jpp11.src.rpm Girar awaiter (serjigva)
2025-03-27  8:42 ` Girar pender (snowmix) [this message]

Reply instructions:

You may reply publicly to this message via plain-text email
using any one of the following methods:

* Save the following mbox file, import it into your mail client,
  and reply-to-all from there: mbox

  Avoid top-posting and favor interleaved quoting:
  https://en.wikipedia.org/wiki/Posting_style#Interleaved_style

* Reply using the --to, --cc, and --in-reply-to
  switches of git-send-email(1):

  git send-email \
    --in-reply-to=girar.task.371974.18.1@gyle.mskdc.altlinux.org \
    --to=girar-builder@altlinux.org \
    --cc=devel@lists.altlinux.org \
    --cc=girar-builder-p10@altlinux.org \
    --cc=girar-builder-p10@lists.altlinux.org \
    --cc=serjigva@altlinux.org \
    --cc=sisyphus-incominger@lists.altlinux.org \
    /path/to/YOUR_REPLY

  https://kernel.org/pub/software/scm/git/docs/git-send-email.html

* If your mail client supports setting the In-Reply-To header
  via mailto: links, try the mailto: link

ALT Linux Girar Builder robot reports

This inbox may be cloned and mirrored by anyone:

	git clone --mirror http://lore.altlinux.org/sisyphus-incominger/0 sisyphus-incominger/git/0.git

	# If you have public-inbox 1.1+ installed, you may
	# initialize and index your mirror using the following commands:
	public-inbox-init -V2 sisyphus-incominger sisyphus-incominger/ http://lore.altlinux.org/sisyphus-incominger \
		sisyphus-incominger@lists.altlinux.org sisyphus-incominger@lists.altlinux.ru sisyphus-incominger@lists.altlinux.com
	public-inbox-index sisyphus-incominger

Example config snippet for mirrors.
Newsgroup available over NNTP:
	nntp://lore.altlinux.org/org.altlinux.lists.sisyphus-incominger


AGPL code for this site: git clone https://public-inbox.org/public-inbox.git