From mboxrd@z Thu Jan  1 00:00:00 1970
Return-Path: <girar-builder@altlinux.org>
X-Spam-Checker-Version: SpamAssassin 3.4.1 (2015-04-28) on
 sa.local.altlinux.org
X-Spam-Level: 
X-Spam-Status: No, score=-3.3 required=5.0 tests=BAYES_00,RP_MATCHES_RCVD
 autolearn=unavailable autolearn_force=no version=3.4.1
Date: Tue, 28 Jan 2025 10:52:34 +0000
From: "Girar awaiter (mike)" <girar-builder@altlinux.org>
To: Michael Shigorin <mike@altlinux.org>
Subject: [#371137] [test-only] FAILED (try 5) vtk.git=9.3.0-alt1.3
Message-ID: <girar.task.371137.5.1@gyle.mskdc.altlinux.org>
Mail-Followup-To: Girar awaiter robot <girar-builder@altlinux.org>
References: <girar.task.371137.4.1@gyle.mskdc.altlinux.org>
 <girar.task.371137.3.1@gyle.mskdc.altlinux.org>
 <girar.task.371137.2.1@gyle.mskdc.altlinux.org>
 <girar.task.371137.1.1@gyle.mskdc.altlinux.org>
MIME-Version: 1.0
Content-Type: text/plain; charset=us-ascii
Content-Disposition: inline
In-Reply-To: <girar.task.371137.1.1@gyle.mskdc.altlinux.org>
X-girar-task-id: 371137
X-girar-task-owner: mike
X-girar-task-repo: sisyphus
X-girar-task-try: 5
X-girar-task-iter: 1
X-girar-task-status: FAILED
X-girar-task-URL: https://git.altlinux.org/tasks/371137/
X-girar-task-log: logs/events.5.1.log
X-girar-task-summary: [#371137] [test-only] FAILED (try 5) vtk.git=9.3.0-alt1.3
User-Agent: Mutt/1.10.1 (2018-07-13)
Cc: sisyphus-incominger@lists.altlinux.org, girar-builder-sisyphus@altlinux.org
X-BeenThere: sisyphus-incominger@lists.altlinux.org
X-Mailman-Version: 2.1.12
Precedence: list
Reply-To: ALT Devel discussion list <devel@lists.altlinux.org>
List-Id: ALT Linux Girar Builder robot reports
 <sisyphus-incominger.lists.altlinux.org>
List-Unsubscribe: <https://lists.altlinux.org/mailman/options/sisyphus-incominger>, 
 <mailto:sisyphus-incominger-request@lists.altlinux.org?subject=unsubscribe>
List-Archive: <http://lists.altlinux.org/pipermail/sisyphus-incominger>
List-Post: <mailto:sisyphus-incominger@lists.altlinux.org>
List-Help: <mailto:sisyphus-incominger-request@lists.altlinux.org?subject=help>
List-Subscribe: <https://lists.altlinux.org/mailman/listinfo/sisyphus-incominger>, 
 <mailto:sisyphus-incominger-request@lists.altlinux.org?subject=subscribe>
X-List-Received-Date: Tue, 28 Jan 2025 10:52:38 -0000
Archived-At: <http://lore.altlinux.org/sisyphus-incominger/girar.task.371137.5.1@gyle.mskdc.altlinux.org/>
List-Archive: <http://lore.altlinux.org/sisyphus-incominger/>

https://git.altlinux.org/tasks/371137/logs/events.5.1.log
https://packages.altlinux.org/tasks/371137

subtask  name  aarch64    i586  ppc64le  x86_64
   #400  vtk    failed  failed   failed  failed

2025-Jan-28 10:52:11 :: test-only task #371137 for sisyphus resumed by mike:
2025-Jan-28 10:52:11 :: message: libvtk split up to fit under e2k debuginfo size limit
#100 removed
#200 removed
#300 removed
#400 build 9.3.0-alt1.3 from /people/mike/packages/vtk.git fetched at 2025-Jan-28 10:52:08
2025-Jan-28 10:52:12 :: [aarch64] #400 vtk.git 9.3.0-alt1.3: build start
2025-Jan-28 10:52:12 :: [x86_64] #400 vtk.git 9.3.0-alt1.3: build start
2025-Jan-28 10:52:12 :: [i586] #400 vtk.git 9.3.0-alt1.3: build start
2025-Jan-28 10:52:12 :: [ppc64le] #400 vtk.git 9.3.0-alt1.3: build start
[x86_64] <13>Jan 28 10:52:23 rpmi: libmpdec3-2.5.1-alt3 sisyphus+314490.500.5.1 1675432004 installed
[x86_64] <13>Jan 28 10:52:23 rpmi: libgdbm-1.8.3-alt10 sisyphus+346222.200.3.2 1716468404 installed
[x86_64] <13>Jan 28 10:52:23 rpmi: libexpat-2.6.4-alt1 sisyphus+365521.100.1.1 1734700243 installed
[x86_64] <13>Jan 28 10:52:23 rpmi: openssl-config-3.2.0-alt1 sisyphus+366659.140.4.1 1736956949 installed
[x86_64] <13>Jan 28 10:52:23 rpmi: libb2-0.98.1-alt1_1 sisyphus+291614.100.1.1 1638962877 installed
[x86_64] <13>Jan 28 10:52:23 rpmi: libp11-kit-1:0.25.5-alt1 sisyphus+352553.100.1.1 1720622573 installed
[x86_64] <13>Jan 28 10:52:23 rpmi: libtasn1-4.19.0-alt3 sisyphus+327816.100.1.1 1692802615 installed
[x86_64] <13>Jan 28 10:52:23 rpmi: rpm-macros-alternatives-0.5.3-alt1 sisyphus+371878.100.1.1 1737988822 installed
[x86_64] <13>Jan 28 10:52:23 rpmi: alternatives-0.5.3-alt1 sisyphus+371878.100.1.1 1737988822 installed
[x86_64] <13>Jan 28 10:52:23 rpmi: ca-certificates-2024.12.10-alt1 sisyphus+364633.200.3.1 1733918603 installed
[x86_64] <13>Jan 28 10:52:23 rpmi: ca-trust-0.2.0-alt1 sisyphus+344843.100.1.1 1712743326 installed
[x86_64] <13>Jan 28 10:52:23 rpmi: p11-kit-trust-1:0.25.5-alt1 sisyphus+352553.100.1.1 1720622573 installed
[x86_64] <13>Jan 28 10:52:23 rpmi: libcrypto3-3.3.2-alt1 sisyphus+366659.40.4.1 1736956900 installed
[x86_64] <13>Jan 28 10:52:23 rpmi: libssl3-3.3.2-alt1 sisyphus+366659.40.4.1 1736956900 installed
[x86_64] <13>Jan 28 10:52:23 rpmi: python3-3.12.8-alt1 sisyphus+364336.100.1.1 1733526854 installed
[x86_64] <13>Jan 28 10:52:24 rpmi: python3-base-3.12.8-alt1 sisyphus+364336.100.1.1 1733526854 installed
[x86_64] <13>Jan 28 10:52:24 rpmi: python3-module-py3dephell-0.3.1-alt1 sisyphus+365261.200.1.1 1734463433 installed
[x86_64] <13>Jan 28 10:52:24 rpmi: tests-for-installed-python3-pkgs-0.1.26-alt2 sisyphus+365350.100.1.1 1734517486 installed
[x86_64] <13>Jan 28 10:52:24 rpmi: rpm-build-python3-0.1.26-alt2 sisyphus+365350.100.1.1 1734517486 installed
[x86_64] <13>Jan 28 10:52:24 rpmi: rpm-macros-qt5-5.15.16-alt1 sisyphus+369621.100.1.3 1736956092 installed
[x86_64] warning: Macro %cmake not found
[x86_64] warning: Macro %_cmake__builddir not found
[x86_64] warning: Macro %cmake_build not found
[x86_64] warning: Macro %cmake_build not found
[x86_64] warning: Macro %cmakeinstall_std not found
[x86_64] error: Package has no %description: libvtkrendering9.3
[x86_64] hsh-rebuild: pkg.tar: failed to fetch build dependencies.
2025-Jan-28 10:52:24 :: [x86_64] vtk.git 9.3.0-alt1.3: remote: cannot build src.rpm
2025-Jan-28 10:52:24 :: [x86_64] #400 vtk.git 9.3.0-alt1.3: build FAILED
[i586] <13>Jan 28 10:52:23 rpmi: libmpdec3-2.5.1-alt3 sisyphus+314490.500.5.1 1675432033 installed
[i586] <13>Jan 28 10:52:23 rpmi: libgdbm-1.8.3-alt10 sisyphus+346222.200.3.2 1716468406 installed
[i586] <13>Jan 28 10:52:23 rpmi: libexpat-2.6.4-alt1 sisyphus+365521.100.1.1 1734700247 installed
[i586] <13>Jan 28 10:52:23 rpmi: openssl-config-3.2.0-alt1 sisyphus+366659.140.4.1 1736956949 installed
[i586] <13>Jan 28 10:52:23 rpmi: libb2-0.98.1-alt1_1 sisyphus+291614.100.1.1 1638962878 installed
[i586] <13>Jan 28 10:52:23 rpmi: libp11-kit-1:0.25.5-alt1 sisyphus+352553.100.1.1 1720622586 installed
[i586] <13>Jan 28 10:52:23 rpmi: libtasn1-4.19.0-alt3 sisyphus+327816.100.1.1 1692802618 installed
[i586] <13>Jan 28 10:52:23 rpmi: rpm-macros-alternatives-0.5.3-alt1 sisyphus+371878.100.1.1 1737988822 installed
[i586] <13>Jan 28 10:52:23 rpmi: alternatives-0.5.3-alt1 sisyphus+371878.100.1.1 1737988822 installed
[i586] <13>Jan 28 10:52:23 rpmi: ca-certificates-2024.12.10-alt1 sisyphus+364633.200.3.1 1733918603 installed
[i586] <13>Jan 28 10:52:23 rpmi: ca-trust-0.2.0-alt1 sisyphus+344843.100.1.1 1712743326 installed
[i586] <13>Jan 28 10:52:23 rpmi: p11-kit-trust-1:0.25.5-alt1 sisyphus+352553.100.1.1 1720622586 installed
[i586] <13>Jan 28 10:52:23 rpmi: libcrypto3-3.3.2-alt1 sisyphus+366659.40.4.1 1736957175 installed
[i586] <13>Jan 28 10:52:23 rpmi: libssl3-3.3.2-alt1 sisyphus+366659.40.4.1 1736957175 installed
[i586] <13>Jan 28 10:52:23 rpmi: python3-3.12.8-alt1 sisyphus+364336.100.1.1 1733526985 installed
[i586] <13>Jan 28 10:52:24 rpmi: python3-base-3.12.8-alt1 sisyphus+364336.100.1.1 1733526985 installed
[i586] <13>Jan 28 10:52:24 rpmi: python3-module-py3dephell-0.3.1-alt1 sisyphus+365261.200.1.1 1734463433 installed
[i586] <13>Jan 28 10:52:24 rpmi: tests-for-installed-python3-pkgs-0.1.26-alt2 sisyphus+365350.100.1.1 1734517486 installed
[i586] <13>Jan 28 10:52:24 rpmi: rpm-build-python3-0.1.26-alt2 sisyphus+365350.100.1.1 1734517486 installed
[i586] <13>Jan 28 10:52:24 rpmi: rpm-macros-qt5-5.15.16-alt1 sisyphus+369621.100.1.3 1736956092 installed
[i586] warning: Macro %cmake not found
[i586] warning: Macro %_cmake__builddir not found
[i586] warning: Macro %cmake_build not found
[i586] warning: Macro %cmake_build not found
[i586] warning: Macro %cmakeinstall_std not found
[i586] error: Package has no %description: libvtkrendering9.3
[i586] hsh-rebuild: pkg.tar: failed to fetch build dependencies.
2025-Jan-28 10:52:24 :: [i586] vtk.git 9.3.0-alt1.3: remote: cannot build src.rpm
2025-Jan-28 10:52:24 :: [i586] #400 vtk.git 9.3.0-alt1.3: build FAILED
2025-Jan-28 10:52:24 :: [x86_64] requesting cancellation of task processing
[aarch64] <13>Jan 28 10:52:30 rpmi: libmpdec3-2.5.1-alt3 sisyphus+314490.500.5.1 1675432086 installed
[aarch64] <13>Jan 28 10:52:30 rpmi: libgdbm-1.8.3-alt10 sisyphus+346222.200.3.2 1716468418 installed
[aarch64] <13>Jan 28 10:52:30 rpmi: libexpat-2.6.4-alt1 sisyphus+365521.100.1.1 1734700274 installed
[aarch64] <13>Jan 28 10:52:30 rpmi: openssl-config-3.2.0-alt1 sisyphus+366659.140.4.1 1736956949 installed
[aarch64] <13>Jan 28 10:52:30 rpmi: libb2-0.98.1-alt1_1 sisyphus+291614.100.1.1 1638962893 installed
[aarch64] <13>Jan 28 10:52:30 rpmi: libp11-kit-1:0.25.5-alt1 sisyphus+352553.100.1.1 1720622713 installed
[aarch64] <13>Jan 28 10:52:30 rpmi: libtasn1-4.19.0-alt3 sisyphus+327816.100.1.1 1692802654 installed
[aarch64] <13>Jan 28 10:52:30 rpmi: rpm-macros-alternatives-0.5.3-alt1 sisyphus+371878.100.1.1 1737988822 installed
[aarch64] <13>Jan 28 10:52:30 rpmi: alternatives-0.5.3-alt1 sisyphus+371878.100.1.1 1737988822 installed
[aarch64] <13>Jan 28 10:52:30 rpmi: ca-certificates-2024.12.10-alt1 sisyphus+364633.200.3.1 1733918603 installed
[aarch64] <13>Jan 28 10:52:30 rpmi: ca-trust-0.2.0-alt1 sisyphus+344843.100.1.1 1712743326 installed
[aarch64] <13>Jan 28 10:52:30 rpmi: p11-kit-trust-1:0.25.5-alt1 sisyphus+352553.100.1.1 1720622713 installed
[aarch64] <13>Jan 28 10:52:30 rpmi: libcrypto3-3.3.2-alt1 sisyphus+366659.40.4.1 1736957458 installed
[aarch64] <13>Jan 28 10:52:30 rpmi: libssl3-3.3.2-alt1 sisyphus+366659.40.4.1 1736957458 installed
[aarch64] <13>Jan 28 10:52:30 rpmi: python3-3.12.8-alt1 sisyphus+364336.100.1.1 1733528700 installed
[aarch64] <13>Jan 28 10:52:31 rpmi: python3-base-3.12.8-alt1 sisyphus+364336.100.1.1 1733528700 installed
[aarch64] <13>Jan 28 10:52:31 rpmi: python3-module-py3dephell-0.3.1-alt1 sisyphus+365261.200.1.1 1734463433 installed
[aarch64] <13>Jan 28 10:52:31 rpmi: tests-for-installed-python3-pkgs-0.1.26-alt2 sisyphus+365350.100.1.1 1734517486 installed
[aarch64] <13>Jan 28 10:52:31 rpmi: rpm-build-python3-0.1.26-alt2 sisyphus+365350.100.1.1 1734517486 installed
[aarch64] <13>Jan 28 10:52:31 rpmi: rpm-macros-qt5-5.15.16-alt1 sisyphus+369621.100.1.3 1736956092 installed
[aarch64] warning: Macro %cmake not found
[aarch64] warning: Macro %_cmake__builddir not found
[aarch64] warning: Macro %cmake_build not found
[aarch64] warning: Macro %cmake_build not found
[aarch64] warning: Macro %cmakeinstall_std not found
[aarch64] error: Package has no %description: libvtkrendering9.3
[aarch64] hsh-rebuild: pkg.tar: failed to fetch build dependencies.
2025-Jan-28 10:52:32 :: [aarch64] vtk.git 9.3.0-alt1.3: remote: cannot build src.rpm
2025-Jan-28 10:52:32 :: [aarch64] #400 vtk.git 9.3.0-alt1.3: build FAILED
[ppc64le] <13>Jan 28 10:52:31 rpmi: libmpdec3-2.5.1-alt3 sisyphus+314490.500.5.1 1675432129 installed
[ppc64le] <13>Jan 28 10:52:31 rpmi: libgdbm-1.8.3-alt10 sisyphus+346222.200.3.2 1716468420 installed
[ppc64le] <13>Jan 28 10:52:31 rpmi: libexpat-2.6.4-alt1 sisyphus+365521.100.1.1 1734700307 installed
[ppc64le] <13>Jan 28 10:52:31 rpmi: openssl-config-3.2.0-alt1 sisyphus+366659.140.4.1 1736956949 installed
[ppc64le] <13>Jan 28 10:52:31 rpmi: libb2-0.98.1-alt1_1 sisyphus+291614.100.1.1 1638962899 installed
[ppc64le] <13>Jan 28 10:52:31 rpmi: libp11-kit-1:0.25.5-alt1 sisyphus+352553.100.1.1 1720622748 installed
[ppc64le] <13>Jan 28 10:52:31 rpmi: libtasn1-4.19.0-alt3 sisyphus+327816.100.1.1 1692802672 installed
[ppc64le] <13>Jan 28 10:52:31 rpmi: rpm-macros-alternatives-0.5.3-alt1 sisyphus+371878.100.1.1 1737988822 installed
[ppc64le] <13>Jan 28 10:52:31 rpmi: alternatives-0.5.3-alt1 sisyphus+371878.100.1.1 1737988822 installed
[ppc64le] <13>Jan 28 10:52:31 rpmi: ca-certificates-2024.12.10-alt1 sisyphus+364633.200.3.1 1733918603 installed
[ppc64le] <13>Jan 28 10:52:31 rpmi: ca-trust-0.2.0-alt1 sisyphus+344843.100.1.1 1712743326 installed
[ppc64le] <13>Jan 28 10:52:31 rpmi: p11-kit-trust-1:0.25.5-alt1 sisyphus+352553.100.1.1 1720622748 installed
[ppc64le] <13>Jan 28 10:52:31 rpmi: libcrypto3-3.3.2-alt1 sisyphus+366659.40.4.1 1736957605 installed
[ppc64le] <13>Jan 28 10:52:31 rpmi: libssl3-3.3.2-alt1 sisyphus+366659.40.4.1 1736957605 installed
[ppc64le] <13>Jan 28 10:52:32 rpmi: python3-3.12.8-alt1 sisyphus+364336.100.1.1 1733528834 installed
[ppc64le] <13>Jan 28 10:52:33 rpmi: python3-base-3.12.8-alt1 sisyphus+364336.100.1.1 1733528834 installed
[ppc64le] <13>Jan 28 10:52:33 rpmi: python3-module-py3dephell-0.3.1-alt1 sisyphus+365261.200.1.1 1734463433 installed
[ppc64le] <13>Jan 28 10:52:33 rpmi: tests-for-installed-python3-pkgs-0.1.26-alt2 sisyphus+365350.100.1.1 1734517486 installed
[ppc64le] <13>Jan 28 10:52:33 rpmi: rpm-build-python3-0.1.26-alt2 sisyphus+365350.100.1.1 1734517486 installed
[ppc64le] <13>Jan 28 10:52:33 rpmi: rpm-macros-qt5-5.15.16-alt1 sisyphus+369621.100.1.3 1736956092 installed
[ppc64le] warning: Macro %cmake not found
[ppc64le] warning: Macro %_cmake__builddir not found
[ppc64le] warning: Macro %cmake_build not found
[ppc64le] warning: Macro %cmake_build not found
[ppc64le] warning: Macro %cmakeinstall_std not found
[ppc64le] error: Package has no %description: libvtkrendering9.3
[ppc64le] hsh-rebuild: pkg.tar: failed to fetch build dependencies.
2025-Jan-28 10:52:34 :: [ppc64le] vtk.git 9.3.0-alt1.3: remote: cannot build src.rpm
2025-Jan-28 10:52:34 :: [ppc64le] #400 vtk.git 9.3.0-alt1.3: build FAILED
2025-Jan-28 10:52:24 :: [x86_64] build FAILED
2025-Jan-28 10:52:24 :: [i586] build FAILED
2025-Jan-28 10:52:32 :: [aarch64] build FAILED
2025-Jan-28 10:52:34 :: [ppc64le] build FAILED
2025-Jan-28 10:52:34 :: task #371137 for sisyphus FAILED